{"text_format":"2","workbook":"xlsx","n_sheets":7,"sheets":["EventConfig","EventLinkConfig","EventConditionConfig","条件类型查询","产出tag查询","EventNPC","XianTuLogConfig"],"not_rendered":{"charts":0,"images":0,"macros":0,"external_links":0,"defined_names":4,"comments":0,"pivot_tables":0},"unopened":[],"bounds":{"document_bytes":16777216,"sheet_cells":100000,"run_cost":"one","rows_first":2000,"rows_last":500,"rows_between":2000,"halvings":0,"cell_chars":16384,"cell_head_chars":4096},"cells_cut":0,"cells_raw":0,"read":"whole","date_system":"1900"}

{"sheet":"EventConfig","index":0,"n_rows":99,"n_cols":43,"rows_kept":99,"cut":false,"hidden":false,"merged":[]}
["ID","EventLinksId","EventTriggerType","EventTag","EventType","Score","EventQuality","PrizeType","PrizeIDs","PrizeNums","RefreshProbability","RefreshCount","placeID","XiantuID",{"$f":"SUMIF(C:C,2,K:K)","v":0},"EventConditionId","EventValue","EventCount","EventName","Description"]
["int","int[]","int","int","int","int","int","int[]","int[]","int[]","int","int","int","int",null,"int","int[]","int","int","int"]
[{"$nulls":23},1,2,3,4,5,6,7,8,9,10,11,12,13,14,15,16,17,18,19,20]
["ID","事件包含的ID","事件类型：\n1.通用事件\n2.挂机事件\n4.主线任务\n5.仙山探险\n6.支线事件\n99.无标记\n","tag\n1主线2支线\n3通用\n4地图通用\n5道友6任务\n7资源","1.正常触发\n2.直接结算","增加进度值","事件品质","产出tag\n在辅助表查询","事件结局奖励","事件结局奖励数量","刷新的概率\n（100=100%）","最大刷新数量","属于哪张地图","仙途日志ID","触发条件","触发条件类型\n只能配处于什么状态和数值，不能配变化的数值","触发效果值","触发判定数量or次数","任务标题","任务详情界面的总描述","标题","整体描述","总步数","步骤1","步骤2","步骤3","步骤4","步骤5","步骤6","步骤7","步骤8","步骤9","步骤10","步骤11","步骤12","步骤13","步骤14","步骤15","步骤16","步骤17","步骤18","步骤19","步骤20"]
[1,{"$f":"IF(A5=\"\",\"\",_xlfn.TEXTJOIN(\";\",1,X5:AQ5,102))","v":"1001;1002;1003;1004;1005;100;102"},1,3,1,0,1,5,999001,1,null,null,null,4,{"$f":"IF(P5=\"\",\"\",VLOOKUP(P5,条件类型查询!A:B,2,FALSE))","v":""},null,null,null,174,1936,"受伤的狼","你发现一只奄奄一息的狼，决定上前一探究竟。",{"$f":"COUNTIF(EventLinkConfig!O:O,EventConfig!A5)","v":5},1001,1002,1003,1004,1005,{"$nulls":14},100]
[2,{"$f":"IF(A6=\"\",\"\",_xlfn.TEXTJOIN(\";\",1,X6:AQ6,102))","v":"1010;1011;1012;1013;1014;1015;1016;100;102"},1,3,1,0,1,6,999002,1,null,null,null,4,{"$f":"IF(P6=\"\",\"\",VLOOKUP(P6,条件类型查询!A:B,2,FALSE))","v":""},null,null,null,175,1937,"鹬蚌相争","附近的小树林闹的不可开交，你决定去看看怎么回事。",{"$f":"COUNTIF(EventLinkConfig!O:O,EventConfig!A6)","v":6},1010,1011,1012,1013,1014,1015,1016,{"$nulls":12},100]
[4,"1030;100;102",1,3,2,0,1,1,1001,100,null,null,null,3,{"$f":"IF(P7=\"\",\"\",VLOOKUP(P7,条件类型查询!A:B,2,FALSE))","v":""},null,null,null,217,1939,"溅血背包","不远处有一个小红点，走近一看你发现是一个带血的背包。",{"$f":"COUNTIF(EventLinkConfig!O:O,EventConfig!A7)","v":1},1030,{"$nulls":18},100]
[5,"1040;100;102",1,3,2,0,1,2,1003,100,null,null,null,3,{"$f":"IF(P8=\"\",\"\",VLOOKUP(P8,条件类型查询!A:B,2,FALSE))","v":""},null,null,null,218,1940,"废弃矿山","底下一座矿山甚是磅礴雄伟，走，去看一看。",{"$f":"COUNTIF(EventLinkConfig!O:O,EventConfig!A8)","v":1},1040,{"$nulls":18},100]
[6,"1050;100;102",1,3,2,0,1,3,1005,100,null,null,null,3,{"$f":"IF(P9=\"\",\"\",VLOOKUP(P9,条件类型查询!A:B,2,FALSE))","v":""},null,null,null,219,1941,"吵架声","你被一男一女的吵架声吸引。",{"$f":"COUNTIF(EventLinkConfig!O:O,EventConfig!A9)","v":1},1050,{"$nulls":18},100]
[7,"1060;100;102",1,3,2,0,1,4,1006,100,null,null,null,3,{"$f":"IF(P10=\"\",\"\",VLOOKUP(P10,条件类型查询!A:B,2,FALSE))","v":""},null,null,null,220,1942,"一座道观","远处一座道观仙气缭绕，似有仙人在此。",{"$f":"COUNTIF(EventLinkConfig!O:O,EventConfig!A10)","v":1},1060,{"$nulls":18},100]
[1011,{"$f":"IF(A11=\"\",\"\",_xlfn.TEXTJOIN(\";\",1,X11:AQ11,102))","v":"101101;100;102"},1,7,1,0,1,7,1401,1,{"$nulls":8},3017,3018,"药田","神识探索至一处山洞之中，似乎别有洞天",{"$f":"COUNTIF(EventLinkConfig!O:O,EventConfig!A11)","v":1},{"$f":"IF($W11>=X$3,$A11*100+X$3,\"\")","v":101101},"","","","","","","","","","","","","","","",null,null,null,100]
[1012,"101201;100;102",1,7,1,0,3,7,1402,1,{"$nulls":8},3038,3039,"矿井","神识探索至一处矿井之中，此处灵气氤氲",{"$f":"COUNTIF(EventLinkConfig!O:O,EventConfig!A12)","v":1},101201,"","","","","","","","","","","","","","","",null,null,null,100]
[1013,"101301;100;102",1,7,1,0,3,7,1403,1,{"$nulls":8},3040,3041,"寺庙","神识经过一处荒废寺庙之外，寺庙之中似乎有不同寻常之物",{"$f":"COUNTIF(EventLinkConfig!O:O,EventConfig!A13)","v":1},101301,"","","","","","","","","","","","","","","",null,null,null,100]
[1014,"101401;100;102",1,7,1,0,3,7,1404,1,{"$nulls":8},3042,3043,"洞府遗址","神识至一处灵气充盈之地，似乎是处洞府",{"$f":"COUNTIF(EventLinkConfig!O:O,EventConfig!A14)","v":1},101401,"","","","","","","","","","","","","","","",null,null,null,100]
[1015,"101501;101502;100;102",1,7,1,0,1,8,1301,1,{"$nulls":8},3046,3047,"拦路山贼","一个不知好歹的山贼拦住了你的去路",{"$f":"COUNTIF(EventLinkConfig!O:O,EventConfig!A15)","v":2},101501,101502,"","","","","","","","","","","","","","",null,null,null,100]
[1016,"101601;101602;100;102",1,7,1,0,1,8,1302,1,{"$nulls":8},3048,3049,"丢袈裟的和尚","一位和尚叫住了你，似乎有什么急事",{"$f":"COUNTIF(EventLinkConfig!O:O,EventConfig!A16)","v":2},101601,101602,"","","","","","","","","","","","","","",null,null,null,100]
[1017,"101701;100;102",1,7,1,0,1,8,1303,1,{"$nulls":5},10,30009,null,3048,3050,"丢袈裟的和尚","将袈裟还给和尚",{"$f":"COUNTIF(EventLinkConfig!O:O,EventConfig!A17)","v":1},101701,"","","","","","","","","","","","","","","",null,null,null,100]
[1018,"101801;101802;101803;101804;100;102",1,7,1,0,1,8,1304,1,{"$nulls":8},3051,3052,"云游修士","一名云游修士前来问道",{"$f":"COUNTIF(EventLinkConfig!O:O,EventConfig!A18)","v":4},101801,101802,101803,101804,"","","","","","","","","","","","",null,null,null,100]
[1019,"101901;101902;101903;100;102",1,7,1,0,1,9,1201,1,{"$nulls":8},3053,3054,"镇压妖王","逍遥宗长老前来求教",{"$f":"COUNTIF(EventLinkConfig!O:O,EventConfig!A19)","v":3},101901,101902,101903,"","","","","","","","","","","","","",null,null,null,100]
[1020,"102001;102002;100;102",1,7,1,0,1,9,1204,1,{"$nulls":8},3055,3056,"清剿妖兽","妖兽入侵了村子，消灭掉它们",{"$f":"COUNTIF(EventLinkConfig!O:O,EventConfig!A20)","v":2},102001,102002,"","","","","","","","","","","","","","",null,null,null,100]
[1021,"102101;102102;102103;100;102",1,7,1,0,1,9,1207,1,{"$nulls":8},3057,3058,"失窃的琉璃盏","琉璃盏被妖兽盗窃，前去寻回",{"$f":"COUNTIF(EventLinkConfig!O:O,EventConfig!A21)","v":3},{"$f":"IF($W21>=X$3,$A21*100+X$3,\"\")","v":102101},102102,102103,"","","","","","","","","","","","","",null,null,null,100]
[1022,"102201;102202;102203;102204;102205;102206;102207;100;102",1,7,1,0,1,10,1501,1,{"$nulls":8},3059,3060,"论道何长","明镜道长前来论道",{"$f":"COUNTIF(EventLinkConfig!O:O,EventConfig!A22)","v":7},102201,102202,102203,102204,102205,102206,102207,"","","","","","","","","",null,null,null,100]
[1023,"102301;102302;102303;100;102",1,7,1,0,1,10,1502,1,{"$nulls":8},3061,3062,"炼丹药童","炼丹药童前来询问丹药",{"$f":"COUNTIF(EventLinkConfig!O:O,EventConfig!A23)","v":3},102301,102302,102303,"","","","","","","","","","","","","",null,null,null,100]
[1024,"102401;102402;102403;100;102",1,7,1,0,1,11,1601,1,{"$nulls":8},3063,3064,"风无咎前来切磋","风无咎前来与你武艺论道",{"$f":"COUNTIF(EventLinkConfig!O:O,EventConfig!A24)","v":3},102401,102402,102403,"","","","","","","","","","","","","",null,null,null,100]
[1025,"102501;102502;102503;100;102",1,7,1,0,1,1,1001,100,{"$nulls":8},3065,3066,"魔族来犯","与魔族交涉",{"$f":"COUNTIF(EventLinkConfig!O:O,EventConfig!A25)","v":3},102501,102502,102503,"","","","","","","","","","","","","",null,null,null,100]
[1026,"102601;102602;100;102",1,7,1,0,1,2,1003,100,{"$nulls":8},3067,3068,"妖族入侵","击败妖族",{"$f":"COUNTIF(EventLinkConfig!O:O,EventConfig!A26)","v":2},102601,102602,"","","","","","","","","","","","","","",null,null,null,100]
[1027,"102701;102702;100;102",1,7,1,0,1,3,1005,100,{"$nulls":8},3069,3070,"北海危机","击败拦路妖兽",{"$f":"COUNTIF(EventLinkConfig!O:O,EventConfig!A27)","v":2},102701,102702,"","","","","","","","","","","","","","",null,null,null,100]
[1028,"102801;102802;102803;102804;102805;100;102",1,7,1,0,1,4,1006,100,{"$nulls":8},3071,3072,"保护北海","击败入侵妖兽",{"$f":"COUNTIF(EventLinkConfig!O:O,EventConfig!A28)","v":5},102801,102802,102803,102804,102805,"","","","","","","","","","","",null,null,null,100]
[1029,"102901;102902;102903;102904;102905;102906;102907;102908;100;102",1,7,1,0,1,7,1401,1,{"$nulls":8},3073,3074,"境明论道","境明道长邀请你与其论道",{"$f":"COUNTIF(EventLinkConfig!O:O,EventConfig!A29)","v":8},102901,102902,102903,102904,102905,102906,102907,102908,"","","","","","","","",null,null,null,100]
[1030,"103001;103002;103003;103004;103005;103006;103007;100;102",1,7,1,0,1,8,1301,1,{"$nulls":8},3075,3076,"听经习道","前去寺庙之中听经",{"$f":"COUNTIF(EventLinkConfig!O:O,EventConfig!A30)","v":7},103001,103002,103003,103004,103005,103006,103007,"","","","","","","","","",null,null,null,100]
[1031,"103101;103102;103103;103104;103105;100;102",1,7,1,0,1,9,1201,1,{"$nulls":8},3077,3074,"境明论道二","境明道长邀请你与其论道",{"$f":"COUNTIF(EventLinkConfig!O:O,EventConfig!A31)","v":5},103101,103102,103103,103104,103105,"","","","","","","","","","","",null,null,null,100]
[]
[11,"1101;1102;1103;100;102",2,3,1,0,1,null,-1,-1,{"$nulls":10},"挂机1","修为",{"$f":"COUNTIF(EventLinkConfig!O:O,EventConfig!A33)","v":3},{"$f":"IF($W33>=X$3,$A33*100+X$3,\"\")","v":1101},1102,1103,"","","","","","","","","",{"$nulls":7},100]
[12,"1201;1202;1203;100;102",2,3,1,0,1,null,-1,-1,{"$nulls":10},"挂机2","灵气",{"$f":"COUNTIF(EventLinkConfig!O:O,EventConfig!A34)","v":3},1201,1202,1203,"","","","","","","","","",{"$nulls":7},100]
[13,"1301;1302;1303;1304;100;102",2,3,1,0,1,null,-1,-1,{"$nulls":10},"挂机3","玄晶",{"$f":"COUNTIF(EventLinkConfig!O:O,EventConfig!A35)","v":4},1301,1302,1303,1304,"","","","","","","","",{"$nulls":7},100]
[14,"1401;1402;1403;100;102",2,3,1,0,1,null,-1,-1,{"$nulls":10},"挂机4","灵石",{"$f":"COUNTIF(EventLinkConfig!O:O,EventConfig!A36)","v":3},1401,1402,1403,"","","","","","","","","",{"$nulls":7},100]
[15,"1501;1502;1503;1504;100;102",2,3,1,0,1,null,-1,-1,{"$nulls":10},"挂机5","神识丹",{"$f":"COUNTIF(EventLinkConfig!O:O,EventConfig!A37)","v":4},1501,1502,1503,1504,"","","","","","","","",{"$nulls":7},100]
[16,{"$f":"IF(A38=\"\",\"\",_xlfn.TEXTJOIN(\";\",1,X38:AQ38,102))","v":"1601;1602;1603;100;102"},2,3,1,0,1,null,-1,-1,{"$nulls":10},"挂机6","妖丹",{"$f":"COUNTIF(EventLinkConfig!O:O,EventConfig!A38)","v":3},1601,1602,1603,"","","","","","","","","",{"$nulls":7},100]
[null,"",{"$nulls":12},{"$f":"IF(P39=\"\",\"\",VLOOKUP(P39,条件类型查询!A:B,2,FALSE))","v":""}]
[10001,"1000101;1000102;1000103;1000104;102",4,1,1,10,1,null,1001,10,null,null,1,1,{"$f":"IF(P40=\"\",\"\",VLOOKUP(P40,条件类型查询!A:B,2,FALSE))","v":""},null,null,null,1906,1914,"鲲鹏何在","神识未灭",{"$f":"COUNTIF(EventLinkConfig!O:O,EventConfig!A40)","v":4},{"$f":"IF($W40>=X$3,$A40*100+X$3,\"\")","v":1000101},1000102,1000103,1000104,"","","","","","","","","","","",""]
{"$rows_left_out":60}
{"sheet":"EventLinkConfig","index":1,"n_rows":481,"n_cols":37,"rows_kept":481,"cut":false,"hidden":false,"merged":[]}
["ID","conciseEventMessage",null,"EventConditionMessage",null,null,"PreShow","PreShowPar",null,"NPCID",null,"LanID",null,"DialogueType","EventID",null,"ConditionId",null,null,null,"optionType","optionPara1","optionPara2",{"$nulls":6},"PrizeIDs","PrizeNums","ResultType","ResultOptions"]
["int","int",null,"int",null,null,"int","int",null,"int",null,"int[]",null,"int","int",null,"int[]",null,null,null,"int","int[]","int[]",{"$nulls":6},"int[]","int[]","int","int[]"]
[]
["ID","任务列表中的简洁描述","任务列表中的简洁描述","无任务目标时的补充文本","无任务目标时的补充文本",null,"前置表现\n","前置表现参数\n",null,"对话NPCID","NPC","对话","对话1","对话框类型","属于哪个事件","步骤","条件判断类型","任务目标1","任务目标2","条件判断内容","步骤类型\n1=提供选项\n2=进入战斗\n5=自动退出\n3=获得奖励\n4=扣除道具","事件常量1\n1=步骤IDs\n2=战斗ID","事件常量2\n1=事件文本","选择1","选择1\n步骤：填选项文本1\n战斗：填战斗ID","选择1\n步骤1：跳转到哪一步\n不填默认跳转到下一步","选择2","选择2\n步骤：填选项文本2","选择1\n步骤2：跳转到哪一步\n不填默认跳转到下一步","事件结局奖励","事件结局奖励数量","事件结束类型\n1：跳转步骤\n2：根据战斗结果跳转\n3.触发新事件","事件结局后提供的选项\n1.EventLinkId\n2.胜利id;失败id\n3.EventConfigId","1.步骤ID（不填默认为下一个步骤ID）\n2.胜利ID（不填默认为下一个步骤ID）\n3.事件ID（不填默认为下一个事件ID）","语言表最大值"]
[100,{"$nulls":10},216,"你被怪物击败，神识也随之消散了。",null,null,null,{"$f":"_xlfn.TEXTJOIN(\";\",1,R5:S5)","v":""},null,null,{"$f":"IF(R5=\"\",\"\",\"-\"&VLOOKUP(R5,EventConditionConfig!A:C,3,FALSE)&IF(S5=\"\",\"\",CHAR(10)&\"-\"&VLOOKUP(S5,EventConditionConfig!A:C,3,FALSE)))","v":""},{"$nulls":14},{"$f":"IF(A5=\"\",\"\",MAX(B5,D5,L5,X5,AA5))","v":216}]
[101,{"$nulls":10},3011,"你败下阵来，感到头晕目眩，试图努力回忆起刚才发生的事情。",null,null,null,{"$f":"_xlfn.TEXTJOIN(\";\",1,R6:S6)","v":""},null,null,{"$f":"IF(R6=\"\",\"\",\"-\"&VLOOKUP(R6,EventConditionConfig!A:C,3,FALSE)&IF(S6=\"\",\"\",CHAR(10)&\"-\"&VLOOKUP(S6,EventConditionConfig!A:C,3,FALSE)))","v":""},{"$nulls":14},{"$f":"IF(A6=\"\",\"\",MAX(B6,D6,L6,X6,AA6))","v":3011}]
[102,{"$nulls":10},3012,"战斗胜利，你的任务进度增加了。",{"$nulls":21},3012]
[{"$nulls":16},"",null,null,{"$f":"IF(R8=\"\",\"\",\"-\"&VLOOKUP(R8,EventConditionConfig!A:C,3,FALSE)&IF(S8=\"\",\"\",CHAR(10)&\"-\"&VLOOKUP(S8,EventConditionConfig!A:C,3,FALSE)))","v":""},{"$nulls":14},""]
[1001,177,{"$nulls":7},2,null,177,"你遇到一只奄奄一息的野狼，从周围四散的血迹来看，想必它刚才经历了一场恶战。",null,1,null,"",null,null,{"$f":"IF(R9=\"\",\"\",\"-\"&VLOOKUP(R9,EventConditionConfig!A:C,3,FALSE)&IF(S9=\"\",\"\",CHAR(10)&\"-\"&VLOOKUP(S9,EventConditionConfig!A:C,3,FALSE)))","v":""},1,"1002;1003","198;199",null,"趁它虚弱赶紧除掉它！",null,null,"你不忍见它受苦，选择帮它减轻痛苦。",{"$nulls":6},177]
[1002,178,{"$nulls":9},178,"野狼用它最后一口气，朝你扑了过来！",null,1,null,"",null,null,{"$f":"IF(R10=\"\",\"\",\"-\"&VLOOKUP(R10,EventConditionConfig!A:C,3,FALSE)&IF(S10=\"\",\"\",CHAR(10)&\"-\"&VLOOKUP(S10,EventConditionConfig!A:C,3,FALSE)))","v":""},2,100001,{"$nulls":9},2,"1004;100",null,178]
[1003,179,{"$nulls":9},179,"你抽出匕首准备了结它的生命，却发现怀中还躺着一只刚出生的狼崽。",null,1,null,"",null,null,{"$f":"IF(R11=\"\",\"\",\"-\"&VLOOKUP(R11,EventConditionConfig!A:C,3,FALSE)&IF(S11=\"\",\"\",CHAR(10)&\"-\"&VLOOKUP(S11,EventConditionConfig!A:C,3,FALSE)))","v":""},1,1005,200,{"$nulls":11},179]
[1004,180,{"$nulls":9},180,"随着你的最后一击，野狼应声倒下，你罔顾它幽怨的眼神，从它怀中拿走了一些财物。",null,1,null,"",null,null,{"$f":"IF(R12=\"\",\"\",\"-\"&VLOOKUP(R12,EventConditionConfig!A:C,3,FALSE)&IF(S12=\"\",\"\",CHAR(10)&\"-\"&VLOOKUP(S12,EventConditionConfig!A:C,3,FALSE)))","v":""},3,{"$nulls":8},1002,100,null,null,null,180]
[1005,181,{"$nulls":9},181,"母狼似乎懂你要做什么，眼神归于平静。你终结了她，决定收养这只小狼仔。",null,1,null,"",null,null,{"$f":"IF(R13=\"\",\"\",\"-\"&VLOOKUP(R13,EventConditionConfig!A:C,3,FALSE)&IF(S13=\"\",\"\",CHAR(10)&\"-\"&VLOOKUP(S13,EventConditionConfig!A:C,3,FALSE)))","v":""},3,{"$nulls":8},1001,50,null,null,null,181]
[{"$nulls":16},"",null,null,{"$f":"IF(R14=\"\",\"\",\"-\"&VLOOKUP(R14,EventConditionConfig!A:C,3,FALSE)&IF(S14=\"\",\"\",CHAR(10)&\"-\"&VLOOKUP(S14,EventConditionConfig!A:C,3,FALSE)))","v":""},{"$nulls":14},""]
[1010,182,{"$nulls":9},182,"从不远处传来刀剑声，听起来双方已经精疲力尽了。",null,2,null,"",null,null,{"$f":"IF(R15=\"\",\"\",\"-\"&VLOOKUP(R15,EventConditionConfig!A:C,3,FALSE)&IF(S15=\"\",\"\",CHAR(10)&\"-\"&VLOOKUP(S15,EventConditionConfig!A:C,3,FALSE)))","v":""},1,"1011;1012","201;202",null,"去看看",null,null,"(需拥有法宝凝神珠）听起来都是鸡毛蒜皮的小摩擦，你选择祭出凝神珠化解他们的怨气。",{"$nulls":6},182]
[1011,183,{"$nulls":9},183,"你走进一看，原来是一伙山贼分赃不均内讧了起来。你看着旁边被砍的七零八落的轿子和这群山贼，选择怎么做呢：",null,2,null,"",null,null,{"$f":"IF(R16=\"\",\"\",\"-\"&VLOOKUP(R16,EventConditionConfig!A:C,3,FALSE)&IF(S16=\"\",\"\",CHAR(10)&\"-\"&VLOOKUP(S16,EventConditionConfig!A:C,3,FALSE)))","v":""},1,"1014;1015","203;204",null,"你顿时杀心四起，决定杀了贼寇，救出轿中之人",null,null,"盗贼们个个双眼杀的通红，你决定来个渔翁得利。",{"$nulls":6},183]
[1012,184,{"$nulls":9},"184;187","法宝现身，效果立竿见影，刀剑声逐渐消失，这个世界安静了。",null,2,null,"",null,null,{"$f":"IF(R17=\"\",\"\",\"-\"&VLOOKUP(R17,EventConditionConfig!A:C,3,FALSE)&IF(S17=\"\",\"\",CHAR(10)&\"-\"&VLOOKUP(S17,EventConditionConfig!A:C,3,FALSE)))","v":""},3,{"$nulls":8},1001,10,null,null,null,184,1,"1001;1"]
[1014,185,{"$nulls":9},185,"你怒斥贼寇的恶行，贼寇们被你激怒了，准备迎战！",null,2,null,"",null,null,{"$f":"IF(R18=\"\",\"\",\"-\"&VLOOKUP(R18,EventConditionConfig!A:C,3,FALSE)&IF(S18=\"\",\"\",CHAR(10)&\"-\"&VLOOKUP(S18,EventConditionConfig!A:C,3,FALSE)))","v":""},2,100002,{"$nulls":9},2,"1016;100",null,185,2,"4;150"]
[1015,186,{"$nulls":9},"186;189","你趁人不备顺走了轿内主人的包裹，任留轿内人痛苦的挣扎。",null,2,null,"",null,null,{"$f":"IF(R19=\"\",\"\",\"-\"&VLOOKUP(R19,EventConditionConfig!A:C,3,FALSE)&IF(S19=\"\",\"\",CHAR(10)&\"-\"&VLOOKUP(S19,EventConditionConfig!A:C,3,FALSE)))","v":""},3,{"$nulls":8},1003,1000,null,null,null,186]
[1016,188,{"$nulls":9},188,"杀退贼寇，你上演了一出英雄救美的桥段。姑娘为了答谢你的救命之恩，将藏在贴身处的珍贵首饰赠与你作为定情信物。",null,2,null,"",null,null,{"$f":"IF(R20=\"\",\"\",\"-\"&VLOOKUP(R20,EventConditionConfig!A:C,3,FALSE)&IF(S20=\"\",\"\",CHAR(10)&\"-\"&VLOOKUP(S20,EventConditionConfig!A:C,3,FALSE)))","v":""},{"$nulls":9},1001,200,null,null,null,188]
[{"$nulls":16},"",null,null,{"$f":"IF(R21=\"\",\"\",\"-\"&VLOOKUP(R21,EventConditionConfig!A:C,3,FALSE)&IF(S21=\"\",\"\",CHAR(10)&\"-\"&VLOOKUP(S21,EventConditionConfig!A:C,3,FALSE)))","v":""},{"$nulls":14},""]
[1020,190,{"$nulls":9},190,"从不远处传来刀剑声，听起来双方已经精疲力尽了。",null,null,null,"",null,null,{"$f":"IF(R22=\"\",\"\",\"-\"&VLOOKUP(R22,EventConditionConfig!A:C,3,FALSE)&IF(S22=\"\",\"\",CHAR(10)&\"-\"&VLOOKUP(S22,EventConditionConfig!A:C,3,FALSE)))","v":""},1,"1021;1022","201;202",null,"去看看",null,null,"使用法宝息事宁人",{"$nulls":6},190]
[1021,191,{"$nulls":9},191,"你走进一看，原来是一伙山贼抢了一名坐在官轿内的女子，因分赃不均内讧了起来。山贼二话不说就朝你冲了过来！",null,null,null,"",null,null,{"$f":"IF(R23=\"\",\"\",\"-\"&VLOOKUP(R23,EventConditionConfig!A:C,3,FALSE)&IF(S23=\"\",\"\",CHAR(10)&\"-\"&VLOOKUP(S23,EventConditionConfig!A:C,3,FALSE)))","v":""},2,100003,{"$nulls":7},1002,100,2,"1026;100",null,191]
[1022,192,{"$nulls":9},192,"法宝现身，效果立竿见影，刀剑声逐渐消失，这个世界安静了。",null,null,null,"",null,null,{"$f":"IF(R24=\"\",\"\",\"-\"&VLOOKUP(R24,EventConditionConfig!A:C,3,FALSE)&IF(S24=\"\",\"\",CHAR(10)&\"-\"&VLOOKUP(S24,EventConditionConfig!A:C,3,FALSE)))","v":""},4,{"$nulls":8},1002,10,null,null,null,192,1,"1001;1"]
[1024,193,{"$nulls":9},"193;196","你大声怒斥贼寇的恶行，贼首发现你了，准备迎战！",null,null,null,"",null,null,{"$f":"IF(R25=\"\",\"\",\"-\"&VLOOKUP(R25,EventConditionConfig!A:C,3,FALSE)&IF(S25=\"\",\"\",CHAR(10)&\"-\"&VLOOKUP(S25,EventConditionConfig!A:C,3,FALSE)))","v":""},2,100004,{"$nulls":7},1004,100,2,"1016;100",null,193,2,"4;150"]
[1025,194,{"$nulls":9},"194;197","你趁人不备顺走了轿内主人的包裹，任留轿内人痛苦的挣扎。",null,null,null,"",null,null,{"$f":"IF(R26=\"\",\"\",\"-\"&VLOOKUP(R26,EventConditionConfig!A:C,3,FALSE)&IF(S26=\"\",\"\",CHAR(10)&\"-\"&VLOOKUP(S26,EventConditionConfig!A:C,3,FALSE)))","v":""},3,{"$nulls":8},1002,1000,null,null,null,194]
[1026,207,{"$nulls":9},207,"你将山贼们打的落花流水，成功吸引了山贼头子的注意。",null,null,null,"",null,null,{"$f":"IF(R27=\"\",\"\",\"-\"&VLOOKUP(R27,EventConditionConfig!A:C,3,FALSE)&IF(S27=\"\",\"\",CHAR(10)&\"-\"&VLOOKUP(S27,EventConditionConfig!A:C,3,FALSE)))","v":""},1,"1024;1025","205;206",null,"选择正面迎战山贼头领（困难）",null,null,"你决定避开山贼头领的视线，来个渔翁得利。",{"$nulls":6},207]
[{"$nulls":16},"",null,null,{"$f":"IF(R28=\"\",\"\",\"-\"&VLOOKUP(R28,EventConditionConfig!A:C,3,FALSE)&IF(S28=\"\",\"\",CHAR(10)&\"-\"&VLOOKUP(S28,EventConditionConfig!A:C,3,FALSE)))","v":""},{"$nulls":14},""]
[1030,{"$nulls":10},221,"发现一个血迹斑斑的背包，好像刚刚发生了战斗，我翻翻背包...",null,4,null,"",null,null,{"$f":"IF(R29=\"\",\"\",\"-\"&VLOOKUP(R29,EventConditionConfig!A:C,3,FALSE)&IF(S29=\"\",\"\",CHAR(10)&\"-\"&VLOOKUP(S29,EventConditionConfig!A:C,3,FALSE)))","v":""},3,{"$nulls":8},1002,10,null,null,null,221]
[{"$nulls":16},"",null,null,{"$f":"IF(R30=\"\",\"\",\"-\"&VLOOKUP(R30,EventConditionConfig!A:C,3,FALSE)&IF(S30=\"\",\"\",CHAR(10)&\"-\"&VLOOKUP(S30,EventConditionConfig!A:C,3,FALSE)))","v":""},{"$nulls":14},""]
[1040,{"$nulls":10},222,"啥也没有....除了钱",null,5,null,"",null,null,{"$f":"IF(R31=\"\",\"\",\"-\"&VLOOKUP(R31,EventConditionConfig!A:C,3,FALSE)&IF(S31=\"\",\"\",CHAR(10)&\"-\"&VLOOKUP(S31,EventConditionConfig!A:C,3,FALSE)))","v":""},3,{"$nulls":8},1002,10,null,null,null,222]
[{"$nulls":16},"",null,null,{"$f":"IF(R32=\"\",\"\",\"-\"&VLOOKUP(R32,EventConditionConfig!A:C,3,FALSE)&IF(S32=\"\",\"\",CHAR(10)&\"-\"&VLOOKUP(S32,EventConditionConfig!A:C,3,FALSE)))","v":""},{"$nulls":14},""]
[1050,{"$nulls":10},223,"两夫妻在吵架，似乎为了一件大事..",null,6,null,"",null,null,{"$f":"IF(R33=\"\",\"\",\"-\"&VLOOKUP(R33,EventConditionConfig!A:C,3,FALSE)&IF(S33=\"\",\"\",CHAR(10)&\"-\"&VLOOKUP(S33,EventConditionConfig!A:C,3,FALSE)))","v":""},3,{"$nulls":8},"1002;1001","10;20",null,null,null,223]
[{"$nulls":16},"",null,null,{"$f":"IF(R34=\"\",\"\",\"-\"&VLOOKUP(R34,EventConditionConfig!A:C,3,FALSE)&IF(S34=\"\",\"\",CHAR(10)&\"-\"&VLOOKUP(S34,EventConditionConfig!A:C,3,FALSE)))","v":""},{"$nulls":14},""]
[1060,{"$nulls":10},224,"没有任何发现，但感觉空气很好....下次有空再来看看",null,7,null,"",null,null,{"$f":"IF(R35=\"\",\"\",\"-\"&VLOOKUP(R35,EventConditionConfig!A:C,3,FALSE)&IF(S35=\"\",\"\",CHAR(10)&\"-\"&VLOOKUP(S35,EventConditionConfig!A:C,3,FALSE)))","v":""},{"$nulls":14},224]
[{"$nulls":16},"",null,null,{"$f":"IF(R36=\"\",\"\",\"-\"&VLOOKUP(R36,EventConditionConfig!A:C,3,FALSE)&IF(S36=\"\",\"\",CHAR(10)&\"-\"&VLOOKUP(S36,EventConditionConfig!A:C,3,FALSE)))","v":""},{"$nulls":14},""]
[{"$nulls":16},"",null,null,{"$f":"IF(R37=\"\",\"\",\"-\"&VLOOKUP(R37,EventConditionConfig!A:C,3,FALSE)&IF(S37=\"\",\"\",CHAR(10)&\"-\"&VLOOKUP(S37,EventConditionConfig!A:C,3,FALSE)))","v":""},{"$nulls":14},""]
[{"$nulls":16},"",null,null,{"$f":"IF(R38=\"\",\"\",\"-\"&VLOOKUP(R38,EventConditionConfig!A:C,3,FALSE)&IF(S38=\"\",\"\",CHAR(10)&\"-\"&VLOOKUP(S38,EventConditionConfig!A:C,3,FALSE)))","v":""},{"$nulls":14},""]
[{"$f":"O39*100+P39","v":1101},{"$nulls":10},208,"你遇到一只拦路的妖兽，它看起来饥肠辘辘",null,11,{"$f":"IF(O39=O38,P38+1,1)","v":1},"",null,null,{"$f":"IF(R39=\"\",\"\",\"-\"&VLOOKUP(R39,EventConditionConfig!A:C,3,FALSE)&IF(S39=\"\",\"\",CHAR(10)&\"-\"&VLOOKUP(S39,EventConditionConfig!A:C,3,FALSE)))","v":""},{"$nulls":11},1,{"$f":"A40","v":1102},null,208]
[{"$f":"O40*100+P40","v":1102},{"$nulls":10},209,"你扔出一块鹿肉，趁它抢食之际，你祭出腰间的法宝",null,11,{"$f":"IF(O40=O39,P39+1,1)","v":2},"",null,null,{"$f":"IF(R40=\"\",\"\",\"-\"&VLOOKUP(R40,EventConditionConfig!A:C,3,FALSE)&IF(S40=\"\",\"\",CHAR(10)&\"-\"&VLOOKUP(S40,EventConditionConfig!A:C,3,FALSE)))","v":""},{"$nulls":11},1,{"$f":"A41","v":1103},null,209]
{"$rows_left_out":442}
{"sheet":"EventConditionConfig","index":2,"n_rows":23,"n_cols":12,"rows_kept":23,"cut":false,"hidden":false,"merged":[]}
["ID","message",null,null,"Operation",null,"ConditionType","ConditionPara","finishCount","RelatedEvents"]
["int","int",null,null,"int",null,"int","int[]","int","int[]"]
[]
["ID","描述",null,null,"与0\n或1",null,"条件判断类型","条件判断值","条件完成次数or数量","关联的事件Id","提示","跳转"]
[1,2078,"拥有金币",{"$f":"CONCATENATE(\"- \",C5,\"{0}/{1}\")","v":"- 拥有金币{0}/{1}"},null,null,1,1001,10]
[2,2079,"达到境界：筑基-中期",{"$f":"CONCATENATE(\"- \",C6,\"{0}/{1}\")","v":"- 达到境界：筑基-中期{0}/{1}"},null,null,3,11,1]
[3,2080,"击杀魔休","- 击杀魔休{0}/{1}",null,null,5,1001,5,9031]
[4,2081,"获得钻石","- 获得钻石{0}/{1}",null,null,6,1002,10]
[5,2082,"使用神识","- 使用神识{0}/{1}",null,null,8,null,1]
[6,2094,"继续飞行一段时间","- 继续飞行一段时间{0}/{1}",null,null,9,null,6]
[7,2843,"击败结界兽","- 击败结界兽{0}/{1}",null,null,5,1002,1]
[8,2844,"达到境界：筑基-后期","- 达到境界：筑基-后期{0}/{1}",null,null,3,21,1]
[9,2845,"击杀妖兽","- 击杀妖兽{0}/{1}",null,null,5,1003,1,30003]
[10,2846,"击败后山小妖","- 击败后山小妖{0}/{1}",null,null,5,1004,3,30004]
[11,2847,"收集灵草种子","- 收集灵草种子{0}/{1}",null,null,6,20003,3,30011]
[12,2848,"击败夜袭的妖兽","- 击败夜袭的妖兽{0}/{1}",null,null,5,1005,1,30005]
[13,2849,"击败峰顶的妖王","- 击败峰顶的妖王{0}/{1}",null,null,5,1006,1,30006]
[14,2850,"境界达到[金丹-前期]","- 境界达到[金丹-前期]{0}/{1}",null,null,3,31,1]
[15,2851,"击败仙山的阵眼妖兽","- 击败仙山的阵眼妖兽{0}/{1}",null,null,5,1007,1,30007]
[17,2852,"击杀灵兽获得天肥",{"$f":"CONCATENATE(\"- \",C20,\"{0}/{1}\")","v":"- 击杀灵兽获得天肥{0}/{1}"},null,null,5,1008,1,30008]
[18,2853,"获得一件袈裟","- 获得一件袈裟{0}/{1}",null,null,6,1301,1,30009]
[19,2854,"夺回琉璃盏","- 夺回琉璃盏{0}/{1}",null,null,6,1001,1,30010]
[20,2855,"给予渡劫丹","- 给予渡劫丹{0}/{1}",null,null,1,1001,1]

{"sheet":"条件类型查询","index":3,"n_rows":10,"n_cols":7,"rows_kept":10,"cut":false,"hidden":false,"merged":[]}
["ID","条件判断类型","条件判断值","条件完成次数or数量","额外文本","不可用","是否可用于事件"]
[1,"拥有特定道具","道具ID","数量≥","检测背包道具",null,1]
[2,"灵根判定","哪个灵根","灵根值≥",null,1]
[3,"境界判断","境界id",null,null,null,1]
[5,"战斗胜利","战斗组ID","胜利次数≥"]
[6,"获得道具","道具的ID","数量≥","探测出事件才开始检测"]
[7,"触发概率","概率值 1000=100%",null,null,null,1]
[8,"使用神识",null,"数量≥"]
[9,"游戏在线多少时长（秒）",null,"时间≥（秒）",null,null,1]
[10,"前置事件","事件ID",null,null,null,1]

{"sheet":"产出tag查询","index":4,"n_rows":23,"n_cols":2,"rows_kept":23,"cut":false,"hidden":false,"merged":[]}
["产出TAG","产出类型"]
[1,"金币"]
[2,"修为"]
[3,"功法灵气"]
[4,"法宝灵韵"]
[5,"功法碎片"]
[6,"法宝碎片"]
[7,"修为丹"]
[8,"天材地宝"]
[9,"渡劫丹"]
[10,"好感度礼物"]
[11,"心情礼物"]
[12]
[13]
[14]
[15]
[16]
[17]
[18]
[19]
[20]
[21]
[22]

{"sheet":"EventNPC","index":5,"n_rows":31,"n_cols":5,"rows_kept":31,"cut":false,"hidden":false,"merged":[]}
["ID","name","ID","DaoyouID"]
["int","int","int","int"]
[]
["ID","名字","半身像icon","道友ID","名称"]
[1,null,null,null,"玩家"]
[2,null,null,1,"道友1"]
[3,null,null,2,"道友2"]
[4,null,null,3,"道友3"]
[5,null,null,4,"道友4"]
[6,null,null,5,"道友5"]
[7,null,null,6,"道友6"]
[8,null,null,7,"道友7"]
[9,null,null,8,"道友8"]
[10,null,null,9,"道友9"]
[11,null,null,10,"道友10"]
[]
[100,3000,null,null,"玩家"]
[101,3001,null,null,"蜩鸟"]
[102,3002,null,null,"小麻雀"]
[103,3003,null,null,"疯道人"]
[104,3004,null,null,"痴道人"]
[105,3005,null,null,"尧帝"]
[106,3006,null,null,"许由"]
[107,3007,null,null,"村名甲"]
[108,3008,null,null,"村名乙"]
[109,3009,null,null,"村名丙"]
[110,3010,null,null,"樗木之灵"]
[111,null,null,null,"惠子"]
[112,3021,null,null,"风无咎"]
[113,3034,null,null,"北海剑妖"]
[114,3067,null,null,"拦路妖兽"]

{"sheet":"XianTuLogConfig","index":6,"n_rows":8,"n_cols":7,"rows_kept":8,"cut":false,"hidden":false,"merged":[]}
["ID","EventType","Title","Desc","BigMapID"]
["int","int","int","int","int"]
[]
["ID","1主线\n2事件","名称","描述","属于哪个章节"]
[1,1,2087,2089,1,"第一章.逍遥游","多次渡劫失败的你，误入“无何有之乡”，在这里受到了列子的指引，踏上了寻找七道心境的修仙之路。"]
[2,2,2088,2090,1,"无用的大葫芦","惠子种出了巨大葫芦，他觉得毫无用处，非常生气！"]
[3,2,2088,2090,2,"无用的大葫芦","惠子种出了巨大葫芦，他觉得毫无用处，非常生气！"]
[4,2,2088,2090,3,"无用的大葫芦","惠子种出了巨大葫芦，他觉得毫无用处，非常生气！"]