{"text_format":"2","workbook":"xlsx","n_sheets":4,"sheets":["UnlockConfig","SubunlockConfig","解锁功能查询","UI的序列号查询"],"not_rendered":{"charts":0,"images":0,"macros":0,"external_links":2,"defined_names":2,"comments":0,"pivot_tables":0},"unopened":[],"bounds":{"document_bytes":16777216,"sheet_cells":100000,"run_cost":"one","rows_first":2000,"rows_last":500,"rows_between":2000,"halvings":0,"cell_chars":16384,"cell_head_chars":4096},"cells_cut":0,"cells_raw":0,"read":"whole","date_system":"1900"}

{"sheet":"UnlockConfig","index":0,"n_rows":226,"n_cols":15,"rows_kept":226,"cut":false,"hidden":false,"merged":[]}
["ID","ulockFunction","ulockCondition","ulockValue","functionValue","lockType","PlayerGuideID","GuidebyUI","UnlockTipsID"]
["int","int","int","int","int","int","int","int[]","int"]
[]
["序列","解锁功能\n见解锁功能查询","解锁方式\n1=飞艇等级解锁\n2=主线关卡ID解锁(MainStageNewConfig)\n4=试炼之地关卡ID解锁\n5=主线章节ID","ulockCondition=1，代表飞艇等级\nulockCondition=2，MainStageNewConfig_ID（到达）\nulockCondition=4，TowerLevelConfig_ID\nulockCondition=5，ChapterConfig_ID","功能参数\n","未解锁前对应入口的展现形式\n1、看不见\n2、置灰","新手引导ID","进入特定界面时再判断是否触发引导\n-1=任何界面都触发","未解锁时点击的提示语言表ID\n{0}取ulockValue","功能","对应Mainstage表里的文本",null,"新手引导ID，只填写功能解锁时会强制触发的引导。\n进入某功能才进行的引导不填！",null,"飞艇等级段"]
[186,338,2,2,0,1,0,-1,407063,{"$f":"VLOOKUP(B5,解锁功能查询!A:C,2,FALSE)","v":"【入口】英雄"}]
[193,515,2,2,0,1,0,-1,407063,"【引导】进1-2引导"]
[118,317,2,3,0,2,0,-1,407063,{"$f":"VLOOKUP(B7,解锁功能查询!A:C,2,FALSE)","v":"【选项卡】英雄详情-武具"},null,null,10]
[188,510,2,3,0,1,0,-1,407063,"【引导】英雄界面引导"]
[123,324,2,{"$f":"VLOOKUP(K9,[1]主线及解锁!$E:$I,5,FALSE)+1","v":6},0,1,0,-1,407063,{"$f":"VLOOKUP(B9,解锁功能查询!A:C,2,FALSE)","v":"【入口】公告"},"冒险指南",null,7]
[124,325,2,{"$f":"VLOOKUP(K10,[1]主线及解锁!$E:$I,5,FALSE)+1","v":6},0,1,0,-1,407063,{"$f":"VLOOKUP(B10,解锁功能查询!A:C,2,FALSE)","v":"【入口】邮件"},"冒险指南",null,7]
[135,311,2,8,0,1,0,-1,407063,{"$f":"VLOOKUP(B11,解锁功能查询!A:C,2,FALSE)","v":"【入口】主界面-商店"},"冒险指南",null,2]
[179,507,2,{"$f":"VLOOKUP(K12,[1]主线及解锁!$E:$I,5,FALSE)+1","v":10},0,1,0,-1,407063,{"$f":"VLOOKUP(B12,解锁功能查询!A:C,2,FALSE)","v":"活动框架"},"活动"]
[178,506,2,{"$f":"VLOOKUP(K13,[1]主线及解锁!$E:$I,5,FALSE)+1","v":7},0,1,0,-1,407063,{"$f":"VLOOKUP(B13,解锁功能查询!A:C,2,FALSE)","v":"日常签到"},"签到"]
[187,339,2,{"$f":"VLOOKUP(K14,[1]主线及解锁!$E:$I,5,FALSE)+1","v":6},0,1,0,-1,407063,{"$f":"VLOOKUP(B14,解锁功能查询!A:C,2,FALSE)","v":"【入口】背包"},"冒险指南"]
[197,340,2,4,0,2,0,-1,407063,"编队","冒险指南"]
[199,521,2,4,0,2,0,-1,407063,"穿装备引导"]
[125,326,2,{"$f":"VLOOKUP(K17,[1]主线及解锁!$E:$I,5,FALSE)+1","v":33},0,1,0,-1,407063,{"$f":"VLOOKUP(B17,解锁功能查询!A:C,2,FALSE)","v":"【入口】主线-三星奖励"},"探险地图1",null,7]
[130,307,2,{"$f":"VLOOKUP(K18,[1]主线及解锁!$E:$I,5,FALSE)+1","v":18},0,1,0,-1,407063,{"$f":"VLOOKUP(B18,解锁功能查询!A:C,2,FALSE)","v":"【入口】聊天UI"},"聊天好友",null,10]
[117,316,2,{"$f":"VLOOKUP(K19,[1]主线及解锁!$E:$I,5,FALSE)+1","v":12},0,2,0,-1,407063,{"$f":"VLOOKUP(B19,解锁功能查询!A:C,2,FALSE)","v":"【选项卡】英雄详情-防具"},"防具",null,10]
[198,520,2,33,0,2,0,-1,400027,"主线地图探索引导"]
[200,522,2,5,0,2,0,-1,407063,"编队引导"]
[203,525,2,33,0,1,0,-1,407063,"探索地图功能入口"]
[116,315,2,{"$f":"VLOOKUP(K23,[1]主线及解锁!$E:$I,5,FALSE)+1","v":6},0,2,0,-1,407063,{"$f":"VLOOKUP(B23,解锁功能查询!A:C,2,FALSE)","v":"【选项卡】英雄详情-觉醒"},"冒险指南",null,7]
[121,214,2,{"$f":"VLOOKUP(K24,[1]主线及解锁!$E:$I,5,FALSE)+1","v":6},0,1,0,-1,407063,{"$f":"VLOOKUP(B24,解锁功能查询!A:C,2,FALSE)","v":"【入口】冒险指南1"},"冒险指南",null,2]
[134,308,2,{"$f":"VLOOKUP(K25,[1]主线及解锁!$E:$I,5,FALSE)+1","v":6},0,1,0,-1,407063,{"$f":"VLOOKUP(B25,解锁功能查询!A:C,2,FALSE)","v":"【入口】英雄招募"},"冒险指南",null,2]
[153,501,2,{"$f":"VLOOKUP(K26,[1]主线及解锁!$E:$I,5,FALSE)+1","v":6},0,1,0,-1,407063,{"$f":"VLOOKUP(B26,解锁功能查询!A:C,2,FALSE)","v":"战斗-2倍速"},"冒险指南"]
[156,504,2,{"$f":"VLOOKUP(K27,[1]主线及解锁!$E:$I,5,FALSE)+1","v":6},0,1,0,-1,407063,{"$f":"VLOOKUP(B27,解锁功能查询!A:C,2,FALSE)","v":"战斗-瞄准线按钮"},"冒险指南"]
[154,502,2,{"$f":"VLOOKUP(K28,[1]主线及解锁!$E:$I,5,FALSE)+1","v":6},0,1,0,-1,407063,{"$f":"VLOOKUP(B28,解锁功能查询!A:C,2,FALSE)","v":"战斗-自动释放终结技"},"冒险指南"]
[155,503,2,{"$f":"VLOOKUP(K29,[1]主线及解锁!$E:$I,5,FALSE)+1","v":6},0,1,0,-1,407063,{"$f":"VLOOKUP(B29,解锁功能查询!A:C,2,FALSE)","v":"战斗-自动战斗"},"冒险指南"]
[196,519,2,{"$f":"VLOOKUP(K30,[1]主线及解锁!$E:$I,5,FALSE)+1","v":7},0,1,0,-1,407063,"累充奖励","签到"]
[107,201,2,{"$f":"VLOOKUP(K31,[1]主线及解锁!$E:$I,5,FALSE)+1","v":9},0,1,0,-1,407063,{"$f":"VLOOKUP(B31,解锁功能查询!A:C,2,FALSE)","v":"【入口】冒险-物资枢纽+第1个选项卡"},"物资枢纽-巨石营地1",null,10]
[109,203,2,{"$f":"VLOOKUP(K32,[1]主线及解锁!$E:$I,5,FALSE)+1","v":9},0,1,0,-1,407063,{"$f":"VLOOKUP(B32,解锁功能查询!A:C,2,FALSE)","v":"物资枢纽-巨石营地（英雄经验）"},"物资枢纽-巨石营地1",null,13]
[111,205,2,{"$f":"VLOOKUP(K33,[1]主线及解锁!$E:$I,5,FALSE)+1","v":16},0,1,0,-1,407063,{"$f":"VLOOKUP(B33,解锁功能查询!A:C,2,FALSE)","v":"物资枢纽-深渊猎场（防具材料）"},"物资枢纽-深渊猎场1",null,10]
[201,523,2,7,0,2,0,-1,407063,"主线箱子引导"]
[168,331,2,{"$f":"VLOOKUP(K35,[1]主线及解锁!$E:$I,5,FALSE)+1","v":29},0,1,0,-1,407063,{"$f":"VLOOKUP(B35,解锁功能查询!A:C,2,FALSE)","v":"【入口】战令"},"深渊通行证"]
[177,239,2,{"$f":"VLOOKUP(K36,[1]主线及解锁!$E:$I,5,FALSE)+1","v":43},0,1,0,-1,407063,{"$f":"VLOOKUP(B36,解锁功能查询!A:C,2,FALSE)","v":"契约按钮"},"契约"]
[108,202,2,{"$f":"VLOOKUP(K37,[1]主线及解锁!$E:$I,5,FALSE)+1","v":26},0,1,0,-1,407063,{"$f":"VLOOKUP(B37,解锁功能查询!A:C,2,FALSE)","v":"物资枢纽-闹鬼金矿（金币）"},"物资枢纽-闹鬼金矿1",null,18,"如果不缺的话，这个延后"]
[202,524,2,10,0,2,0,-1,407063,"特殊关卡引导"]
[127,328,2,{"$f":"VLOOKUP(K39,[1]主线及解锁!$E:$I,5,FALSE)+1","v":6},0,1,0,-1,407063,{"$f":"VLOOKUP(B39,解锁功能查询!A:C,2,FALSE)","v":"【入口】图鉴"},"冒险指南",null,7]
[191,513,2,{"$f":"VLOOKUP(K40,[1]主线及解锁!$E:$I,5,FALSE)+1","v":12},0,1,0,-1,407063,"【引导】防具强化引导","防具"]
[1001,4,2,{"$f":"VLOOKUP(K41,[1]主线及解锁!$E:$I,5,FALSE)+1","v":11},20,1,0,-1,407063,{"$f":"VLOOKUP(B41,解锁功能查询!A:C,2,FALSE)","v":"英雄等级上限提升"},{"$f":"CONCATENATE(\"英雄等级上限Lv.\",E41-10,\" → Lv.\",E41)","v":"英雄等级上限Lv.10 → Lv.20"}]
[1020,518,2,{"$f":"VLOOKUP(K42,[1]主线及解锁!$E:$I,5,FALSE)+1","v":23},0,1,0,-1,407063,"连续战斗按钮的解锁","连续战斗"]
[129,306,2,{"$f":"VLOOKUP(K43,[1]主线及解锁!$E:$I,5,FALSE)+1","v":18},0,1,0,-1,407063,{"$f":"VLOOKUP(B43,解锁功能查询!A:C,2,FALSE)","v":"【入口】好友"},"聊天好友",null,5]
[184,241,2,{"$f":"VLOOKUP(K44,[1]主线及解锁!$E:$I,5,FALSE)+1","v":141},0,2,0,-1,407063,{"$f":"VLOOKUP(B44,解锁功能查询!A:C,2,FALSE)","v":"深渊道馆入口按钮"},"深渊道馆"]
[169,332,1,68,0,1,0,-1,400027,{"$f":"VLOOKUP(B45,解锁功能查询!A:C,2,FALSE)","v":"商店-小镇杂货"},"钻石商店",null,2]
[180,508,2,{"$f":"VLOOKUP(K46,[1]主线及解锁!$E:$I,5,FALSE)+1","v":136},0,1,0,-1,407063,{"$f":"VLOOKUP(B46,解锁功能查询!A:C,2,FALSE)","v":"公会"},"小队系统"]
[122,215,2,{"$f":"VLOOKUP(K47,[1]主线及解锁!$E:$I,5,FALSE)+1","v":61},0,1,0,-1,407063,{"$f":"VLOOKUP(B47,解锁功能查询!A:C,2,FALSE)","v":"【入口】日常周常"},"日常任务",null,2]
[142,222,2,{"$f":"VLOOKUP(K48,[1]主线及解锁!$E:$I,5,FALSE)+1","v":46},0,2,0,-1,407063,{"$f":"VLOOKUP(B48,解锁功能查询!A:C,2,FALSE)","v":"试炼之地-时光试炼1"},"试炼之地-时光试炼1"]
[136,330,2,{"$f":"VLOOKUP(K49,[1]主线及解锁!$E:$I,5,FALSE)+1","v":46},0,1,0,-1,407063,{"$f":"VLOOKUP(B49,解锁功能查询!A:C,2,FALSE)","v":"【入口】冒险-试炼之地"},"试炼之地-时光试炼1"]
[915,336,2,{"$f":"VLOOKUP(K50,[1]主线及解锁!$E:$I,5,FALSE)+1","v":46},0,2,0,-1,407063,{"$f":"VLOOKUP(B50,解锁功能查询!A:C,2,FALSE)","v":"【入口】铁匠铺-时光之契"},"试炼之地-时光试炼1"]
[119,321,2,{"$f":"VLOOKUP(K51,[1]主线及解锁!$E:$I,5,FALSE)+1","v":46},0,1,0,-1,407063,{"$f":"VLOOKUP(B51,解锁功能查询!A:C,2,FALSE)","v":"【入口】编队界面-神器"},"试炼之地-时光试炼1",null,30,"神器作为到30级的养成。"]
[115,303,2,{"$f":"VLOOKUP(K52,[1]主线及解锁!$E:$I,5,FALSE)+1","v":46},0,1,0,-1,407063,{"$f":"VLOOKUP(B52,解锁功能查询!A:C,2,FALSE)","v":"【入口】主界面-铁匠铺"},"试炼之地-时光试炼1",null,20]
[204,526,2,15,0,1,0,-1,407063,"使用背包道具引导"]
[113,212,2,{"$f":"VLOOKUP(K54,[1]主线及解锁!$E:$I,5,FALSE)+1","v":58},0,1,0,-1,407063,{"$f":"VLOOKUP(B54,解锁功能查询!A:C,2,FALSE)","v":"BURP酒馆-悬赏任务"},"悬赏任务",null,15]
[114,301,2,{"$f":"VLOOKUP(K55,[1]主线及解锁!$E:$I,5,FALSE)+1","v":58},0,1,0,-1,407063,{"$f":"VLOOKUP(B55,解锁功能查询!A:C,2,FALSE)","v":"主界面-BURP酒馆入口"},"悬赏任务",null,999]
[175,334,1,9999,0,1,0,-1,400027,{"$f":"VLOOKUP(B56,解锁功能查询!A:C,2,FALSE)","v":"冲刺活动按钮"}]
[137,217,2,{"$f":"VLOOKUP(K57,[1]主线及解锁!$E:$I,5,FALSE)+1","v":66},0,2,0,-1,407063,{"$f":"VLOOKUP(B57,解锁功能查询!A:C,2,FALSE)","v":"试炼之地-流明试炼1（主线）"},"试炼之地-流明试炼"]
[131,319,2,{"$f":"VLOOKUP(K58,[1]主线及解锁!$E:$I,5,FALSE)+1","v":46},0,1,0,-1,407063,{"$f":"VLOOKUP(B58,解锁功能查询!A:C,2,FALSE)","v":"【入口】预设编队"},"试炼之地-时光试炼1",null,15]
[120,213,2,{"$f":"VLOOKUP(K59,[1]主线及解锁!$E:$I,5,FALSE)+1","v":36},0,1,0,-1,407063,{"$f":"VLOOKUP(B59,解锁功能查询!A:C,2,FALSE)","v":"【入口】冒险-模拟训练选"},"模拟训练-难度Lv.35",null,20]
[170,333,2,{"$f":"VLOOKUP(K60,[1]主线及解锁!$E:$I,5,FALSE)+1","v":{"$error":"#N/A"}},0,1,0,-1,407063,{"$f":"VLOOKUP(B60,解锁功能查询!A:C,2,FALSE)","v":"商店-模拟训练"},"模拟商店"]
{"$rows_left_out":167}
{"sheet":"SubunlockConfig","index":1,"n_rows":35,"n_cols":20,"rows_kept":35,"cut":false,"hidden":false,"merged":[[4,7,4,11],[17,7,17,11]]}
["ID","unlockSystem","unlockSubystem","unlocHeroDuty","ulockHeroLevel"]
["int","int","int","int","int"]
[]
["ID","1=防具栏位\n2=遗物栏位\n3=秘石栏位","unlockSystem=1时：随身装备部位\n1=鞋子\n2=衣服\n3=腰带\nunlockSystem=2时：遗物部位\n1=部件A-希音遗物\n2=部件B-曜烨遗物\n3=部件C-馨香遗物\n4=部件D-藏微遗物","解锁所需英雄定位\n0=任意定位\n1=肉盾\n2=输出\n3=治疗\n4=辅助","解锁所需英雄等级"]
[101,1,1,1,{"$f":"I7","v":10},null,null,"不同职业随身装备各部位解锁所需英雄等级"]
[102,1,1,2,{"$f":"J7","v":200},null,null,null,"坦克（重）","输出（皮）","治疗（布）","辅助（布）",null,null,"重甲","皮甲","布甲"]
[103,1,1,3,{"$f":"K7","v":400},null,"防御","鞋子",10,200,400,200,null,"防御",1.5,1,0.5,null,300,200]
[104,1,1,4,{"$f":"L7","v":200},null,"生命","衣服",200,400,10,10,null,"生命",1,0.5,1.5,null,600,800]
[105,1,2,1,{"$f":"I8","v":200},null,"攻击","腰带",400,10,200,400,null,"攻击",0.5,1.5,1,null,900,2000]
[106,1,2,2,{"$f":"J8","v":400}]
[107,1,2,3,{"$f":"K8","v":10}]
[108,1,2,4,{"$f":"L8","v":10}]
[109,1,3,1,{"$f":"I9","v":400}]
[110,1,3,2,{"$f":"J9","v":10}]
[111,1,3,3,{"$f":"K9","v":200}]
[112,1,3,4,{"$f":"L9","v":400}]
[]
[201,2,1,1,90,null,null,"不同职业遗物各位置解锁所需英雄等级"]
[202,2,1,2,90,null,null,null,"坦克","输出","治疗","辅助"]
[203,2,1,3,90,null,"生命","部位1",90,90,90,90]
[204,2,1,4,90,null,"防御","部位2",90,90,90,90]
[205,2,2,1,90,null,"攻击","部位3",90,90,90,90]
[206,2,2,2,90,null,"辅助","部位4",90,90,90,90]
[207,2,2,3,90]
[208,2,2,4,90]
[209,2,3,1,90]
[210,2,3,2,90]
[211,2,3,3,90]
[212,2,3,4,90]
[213,2,4,1,90]
[214,2,4,2,90,null,null,null,31,51,31,51]
[215,2,4,3,90,null,null,null,51,31,51,31]
[216,2,4,4,90,null,null,null,51,31,51,31]
[]
[301,3,1,0,500]

{"sheet":"解锁功能查询","index":2,"n_rows":148,"n_cols":20,"rows_kept":148,"cut":false,"hidden":false,"merged":[]}
["ulockFunction","解锁功能","functionValue代表的意义","计数",{"$nulls":14},"遗物部位","随身装备部位"]
[1,"飞艇等级上限","飞艇等级上限解锁到多少级",{"$f":"COUNTIF(UnlockConfig!B:B,解锁功能查询!A2)","v":0},{"$nulls":8},"飞艇等级上限","飞艇等级上限解锁到多少级",{"$nulls":4},"int","int"]
[4,"英雄等级上限提升","英雄等级上限解锁到多少级"]
[101,"勋章栏位1解锁",null,{"$f":"COUNTIF(UnlockConfig!B:B,解锁功能查询!A4)","v":0},{"$nulls":8},"勋章栏位","解锁第几个勋章栏位"]
[102,"勋章栏位2解锁",null,{"$f":"COUNTIF(UnlockConfig!B:B,解锁功能查询!A5)","v":0},{"$nulls":8},"商业街建筑","1=酒馆（悬赏）\n2=职业介绍所（抽卡）\n3=铁匠铺（防具&抽武器）\n4=生物馆\n5=健身房",{"$nulls":4},"装备类型\n1:部件A\n2:部件B\n3:部件C\n4:部件D","装备类型\n1=鞋子\n2=衣服\n3=腰带"]
[103,"勋章栏位3解锁",null,{"$f":"COUNTIF(UnlockConfig!B:B,解锁功能查询!A6)","v":0},{"$nulls":8},"秘石栏位解锁","解锁第几个秘石栏位"]
[104,"勋章栏位4解锁",null,{"$f":"COUNTIF(UnlockConfig!B:B,解锁功能查询!A7)","v":0},{"$nulls":8},"排位赛解锁","无"]
[105,"英雄界面-武具-秘石",null,{"$f":"COUNTIF(UnlockConfig!B:B,解锁功能查询!A8)","v":0},{"$nulls":8},"好友&聊天","无"]
[106,"英雄界面-武具-遗物",null,{"$f":"COUNTIF(UnlockConfig!B:B,解锁功能查询!A9)","v":0},{"$nulls":8},"资源本","1金币 2英雄经验 3防具材料 4武器经验"]
[107,null,null,{"$f":"COUNTIF(UnlockConfig!B:B,解锁功能查询!A10)","v":0},{"$nulls":8},"入围赛解锁","无"]
[108,null,null,{"$f":"COUNTIF(UnlockConfig!B:B,解锁功能查询!A11)","v":0},{"$nulls":8},"藏宝图玩法","无"]
[109,"符文选项卡+秘石的提升按钮",null,{"$f":"COUNTIF(UnlockConfig!B:B,解锁功能查询!A12)","v":0},{"$nulls":8},"符文解锁","无"]
[null,null,null,{"$f":"COUNTIF(UnlockConfig!B:B,解锁功能查询!A13)","v":0}]
[201,"【入口】冒险-物资枢纽+第1个选项卡",null,{"$f":"COUNTIF(UnlockConfig!B:B,解锁功能查询!A14)","v":1}]
[202,"物资枢纽-闹鬼金矿（金币）",null,{"$f":"COUNTIF(UnlockConfig!B:B,解锁功能查询!A15)","v":1}]
[203,"物资枢纽-巨石营地（英雄经验）",null,{"$f":"COUNTIF(UnlockConfig!B:B,解锁功能查询!A16)","v":1}]
[204,"物资枢纽-机械废墟（残响）",null,{"$f":"COUNTIF(UnlockConfig!B:B,解锁功能查询!A17)","v":0}]
[205,"物资枢纽-深渊猎场（防具材料）",null,{"$f":"COUNTIF(UnlockConfig!B:B,解锁功能查询!A18)","v":1}]
[206,"勇士选拔赛按钮",null,{"$f":"COUNTIF(UnlockConfig!B:B,解锁功能查询!A19)","v":0}]
[207,"入围赛入口",null,{"$f":"COUNTIF(UnlockConfig!B:B,解锁功能查询!A20)","v":0}]
[208,"排位赛入口",null,{"$f":"COUNTIF(UnlockConfig!B:B,解锁功能查询!A21)","v":0}]
[209,"【入口】冒险-藏宝图",null,{"$f":"COUNTIF(UnlockConfig!B:B,解锁功能查询!A22)","v":1}]
[210,"藏宝图商店选项卡",null,{"$f":"COUNTIF(UnlockConfig!B:B,解锁功能查询!A23)","v":0}]
[211,"打工玩法选项卡",null,{"$f":"COUNTIF(UnlockConfig!B:B,解锁功能查询!A24)","v":0}]
[212,"BURP酒馆-悬赏任务",null,{"$f":"COUNTIF(UnlockConfig!B:B,解锁功能查询!A25)","v":1}]
[213,"【入口】冒险-模拟训练选",null,{"$f":"COUNTIF(UnlockConfig!B:B,解锁功能查询!A26)","v":1}]
[214,"【入口】冒险指南1",null,{"$f":"COUNTIF(UnlockConfig!B:B,解锁功能查询!A27)","v":1}]
[215,"【入口】日常周常",null,{"$f":"COUNTIF(UnlockConfig!B:B,解锁功能查询!A28)","v":1}]
[216,"成就界面",null,{"$f":"COUNTIF(UnlockConfig!B:B,解锁功能查询!A29)","v":1}]
[217,"试炼之地-流明试炼1（主线）",null,{"$f":"COUNTIF(UnlockConfig!B:B,解锁功能查询!A30)","v":1}]
[218,"试炼之地-流明试炼2（火）",null,{"$f":"COUNTIF(UnlockConfig!B:B,解锁功能查询!A31)","v":1}]
[219,"试炼之地-流明试炼3（冰）",null,{"$f":"COUNTIF(UnlockConfig!B:B,解锁功能查询!A32)","v":1}]
[220,"试炼之地-流明试炼4（雷）",null,{"$f":"COUNTIF(UnlockConfig!B:B,解锁功能查询!A33)","v":1}]
[221,"试炼之地-流明试炼5",null,{"$f":"COUNTIF(UnlockConfig!B:B,解锁功能查询!A34)","v":0}]
[222,"试炼之地-时光试炼1",null,{"$f":"COUNTIF(UnlockConfig!B:B,解锁功能查询!A35)","v":1}]
[223,"试炼之地-时光试炼2",null,{"$f":"COUNTIF(UnlockConfig!B:B,解锁功能查询!A36)","v":1}]
[224,"试炼之地-时光试炼3",null,{"$f":"COUNTIF(UnlockConfig!B:B,解锁功能查询!A37)","v":1}]
[225,"试炼之地-时光试炼4",null,{"$f":"COUNTIF(UnlockConfig!B:B,解锁功能查询!A38)","v":1}]
[226,"试炼之地-时光试炼5",null,{"$f":"COUNTIF(UnlockConfig!B:B,解锁功能查询!A39)","v":1}]
[227,"试炼之地-时光试炼6",null,{"$f":"COUNTIF(UnlockConfig!B:B,解锁功能查询!A40)","v":1}]
[228,"试炼之地-轮回试炼1",null,{"$f":"COUNTIF(UnlockConfig!B:B,解锁功能查询!A41)","v":1}]
[229,"试炼之地-轮回试炼2",null,{"$f":"COUNTIF(UnlockConfig!B:B,解锁功能查询!A42)","v":1}]
[230,"试炼之地-轮回试炼3",null,{"$f":"COUNTIF(UnlockConfig!B:B,解锁功能查询!A43)","v":1}]
[231,"藏宝图-单人行动选项卡",null,{"$f":"COUNTIF(UnlockConfig!B:B,解锁功能查询!A44)","v":1}]
[232,"藏宝图-我是队长&加入行动选项卡",null,{"$f":"COUNTIF(UnlockConfig!B:B,解锁功能查询!A45)","v":1}]
[233,"物资枢纽-第2个选项卡（遗物）",null,{"$f":"COUNTIF(UnlockConfig!B:B,解锁功能查询!A46)","v":1}]
[234,"物资枢纽-残响1",null,{"$f":"COUNTIF(UnlockConfig!B:B,解锁功能查询!A47)","v":1}]
[235,"物资枢纽-残响2",null,{"$f":"COUNTIF(UnlockConfig!B:B,解锁功能查询!A48)","v":1}]
[236,"物资枢纽-残响3",null,{"$f":"COUNTIF(UnlockConfig!B:B,解锁功能查询!A49)","v":1}]
[237,"物资枢纽-残响4",null,{"$f":"COUNTIF(UnlockConfig!B:B,解锁功能查询!A50)","v":1}]
[238,"冒险指南2",null,{"$f":"COUNTIF(UnlockConfig!B:B,解锁功能查询!A51)","v":1}]
[239,"契约按钮",null,{"$f":"COUNTIF(UnlockConfig!B:B,解锁功能查询!A52)","v":1}]
[240,"赛季模拟训练",null,{"$f":"COUNTIF(UnlockConfig!B:B,解锁功能查询!A53)","v":1}]
[241,"深渊道馆入口按钮",null,{"$f":"COUNTIF(UnlockConfig!B:B,解锁功能查询!A54)","v":1}]
[242,"藏宝图活动入口",null,{"$f":"COUNTIF(UnlockConfig!B:B,解锁功能查询!A55)","v":1}]
[]
[301,"主界面-BURP酒馆入口",null,{"$f":"COUNTIF(UnlockConfig!B:B,解锁功能查询!A57)","v":1}]
[302,"职业介绍所建筑入口",null,{"$f":"COUNTIF(UnlockConfig!B:B,解锁功能查询!A58)","v":0}]
[303,"【入口】主界面-铁匠铺",null,{"$f":"COUNTIF(UnlockConfig!B:B,解锁功能查询!A59)","v":1}]
[304,"生物馆建筑入口",null,{"$f":"COUNTIF(UnlockConfig!B:B,解锁功能查询!A60)","v":0}]
{"$rows_left_out":89}
{"sheet":"UI的序列号查询","index":3,"n_rows":100,"n_cols":2,"rows_kept":100,"cut":false,"hidden":false,"merged":[]}
["序列号","代表界面"]
[{"$f":"IF([2]跳转类型!$A6=\"\",\"\",[2]跳转类型!$A6)","v":1},{"$f":"IF(A2=\"\",\"待定义\",VLOOKUP(A2,[2]跳转类型!$A:$B,2,FALSE))","v":"冒险关卡第1章"}]
[{"$f":"IF([2]跳转类型!$A7=\"\",\"\",[2]跳转类型!$A7)","v":2},{"$f":"IF(A3=\"\",\"待定义\",VLOOKUP(A3,[2]跳转类型!$A:$B,2,FALSE))","v":"冒险关卡第2章"}]
[{"$f":"IF([2]跳转类型!$A8=\"\",\"\",[2]跳转类型!$A8)","v":3},{"$f":"IF(A4=\"\",\"待定义\",VLOOKUP(A4,[2]跳转类型!$A:$B,2,FALSE))","v":"冒险关卡第3章"}]
[{"$f":"IF([2]跳转类型!$A9=\"\",\"\",[2]跳转类型!$A9)","v":4},{"$f":"IF(A5=\"\",\"待定义\",VLOOKUP(A5,[2]跳转类型!$A:$B,2,FALSE))","v":"冒险关卡第4章"}]
[{"$f":"IF([2]跳转类型!$A10=\"\",\"\",[2]跳转类型!$A10)","v":5},{"$f":"IF(A6=\"\",\"待定义\",VLOOKUP(A6,[2]跳转类型!$A:$B,2,FALSE))","v":"冒险关卡第5章"}]
[{"$f":"IF([2]跳转类型!$A11=\"\",\"\",[2]跳转类型!$A11)","v":6},{"$f":"IF(A7=\"\",\"待定义\",VLOOKUP(A7,[2]跳转类型!$A:$B,2,FALSE))","v":"冒险关卡第6章"}]
[{"$f":"IF([2]跳转类型!$A12=\"\",\"\",[2]跳转类型!$A12)","v":7},{"$f":"IF(A8=\"\",\"待定义\",VLOOKUP(A8,[2]跳转类型!$A:$B,2,FALSE))","v":"冒险关卡第7章"}]
[{"$f":"IF([2]跳转类型!$A13=\"\",\"\",[2]跳转类型!$A13)","v":8},{"$f":"IF(A9=\"\",\"待定义\",VLOOKUP(A9,[2]跳转类型!$A:$B,2,FALSE))","v":"冒险关卡第8章"}]
[{"$f":"IF([2]跳转类型!$A14=\"\",\"\",[2]跳转类型!$A14)","v":9},{"$f":"IF(A10=\"\",\"待定义\",VLOOKUP(A10,[2]跳转类型!$A:$B,2,FALSE))","v":"冒险关卡第9章"}]
[{"$f":"IF([2]跳转类型!$A15=\"\",\"\",[2]跳转类型!$A15)","v":10},{"$f":"IF(A11=\"\",\"待定义\",VLOOKUP(A11,[2]跳转类型!$A:$B,2,FALSE))","v":"冒险关卡第10章"}]
[{"$f":"IF([2]跳转类型!$A16=\"\",\"\",[2]跳转类型!$A16)","v":11},{"$f":"IF(A12=\"\",\"待定义\",VLOOKUP(A12,[2]跳转类型!$A:$B,2,FALSE))","v":"冒险关卡第11章"}]
[{"$f":"IF([2]跳转类型!$A17=\"\",\"\",[2]跳转类型!$A17)","v":12},{"$f":"IF(A13=\"\",\"待定义\",VLOOKUP(A13,[2]跳转类型!$A:$B,2,FALSE))","v":"冒险关卡第12章"}]
[{"$f":"IF([2]跳转类型!$A18=\"\",\"\",[2]跳转类型!$A18)","v":30},{"$f":"IF(A14=\"\",\"待定义\",VLOOKUP(A14,[2]跳转类型!$A:$B,2,FALSE))","v":"冒险关卡当前进度章节"}]
[{"$f":"IF([2]跳转类型!$A19=\"\",\"\",[2]跳转类型!$A19)","v":35},{"$f":"IF(A15=\"\",\"待定义\",VLOOKUP(A15,[2]跳转类型!$A:$B,2,FALSE))","v":"藏宝图大厅"}]
[{"$f":"IF([2]跳转类型!$A20=\"\",\"\",[2]跳转类型!$A20)","v":36},{"$f":"IF(A16=\"\",\"待定义\",VLOOKUP(A16,[2]跳转类型!$A:$B,2,FALSE))","v":"模拟训练"}]
[{"$f":"IF([2]跳转类型!$A21=\"\",\"\",[2]跳转类型!$A21)","v":37},{"$f":"IF(A17=\"\",\"待定义\",VLOOKUP(A17,[2]跳转类型!$A:$B,2,FALSE))","v":"共斗玩法"}]
[{"$f":"IF([2]跳转类型!$A22=\"\",\"\",[2]跳转类型!$A22)","v":38},{"$f":"IF(A18=\"\",\"待定义\",VLOOKUP(A18,[2]跳转类型!$A:$B,2,FALSE))","v":"商店"}]
[{"$f":"IF([2]跳转类型!$A23=\"\",\"\",[2]跳转类型!$A23)","v":39},{"$f":"IF(A19=\"\",\"待定义\",VLOOKUP(A19,[2]跳转类型!$A:$B,2,FALSE))","v":"好友"}]
[{"$f":"IF([2]跳转类型!$A24=\"\",\"\",[2]跳转类型!$A24)","v":40},{"$f":"IF(A20=\"\",\"待定义\",VLOOKUP(A20,[2]跳转类型!$A:$B,2,FALSE))","v":"公会"}]
[{"$f":"IF([2]跳转类型!$A25=\"\",\"\",[2]跳转类型!$A25)","v":41},{"$f":"IF(A21=\"\",\"待定义\",VLOOKUP(A21,[2]跳转类型!$A:$B,2,FALSE))","v":"悬赏栏"}]
[{"$f":"IF([2]跳转类型!$A26=\"\",\"\",[2]跳转类型!$A26)","v":42},{"$f":"IF(A22=\"\",\"待定义\",VLOOKUP(A22,[2]跳转类型!$A:$B,2,FALSE))","v":"铁匠铺"}]
[{"$f":"IF([2]跳转类型!$A27=\"\",\"\",[2]跳转类型!$A27)","v":43},{"$f":"IF(A23=\"\",\"待定义\",VLOOKUP(A23,[2]跳转类型!$A:$B,2,FALSE))","v":"英雄招募"}]
[{"$f":"IF([2]跳转类型!$A28=\"\",\"\",[2]跳转类型!$A28)","v":44},{"$f":"IF(A24=\"\",\"待定义\",VLOOKUP(A24,[2]跳转类型!$A:$B,2,FALSE))","v":"英雄选择界面"}]
[{"$f":"IF([2]跳转类型!$A29=\"\",\"\",[2]跳转类型!$A29)","v":45},{"$f":"IF(A25=\"\",\"待定义\",VLOOKUP(A25,[2]跳转类型!$A:$B,2,FALSE))","v":"成就"}]
[{"$f":"IF([2]跳转类型!$A30=\"\",\"\",[2]跳转类型!$A30)","v":46},{"$f":"IF(A26=\"\",\"待定义\",VLOOKUP(A26,[2]跳转类型!$A:$B,2,FALSE))","v":"图鉴"}]
[{"$f":"IF([2]跳转类型!$A31=\"\",\"\",[2]跳转类型!$A31)","v":47},{"$f":"IF(A27=\"\",\"待定义\",VLOOKUP(A27,[2]跳转类型!$A:$B,2,FALSE))","v":"邮箱"}]
[{"$f":"IF([2]跳转类型!$A32=\"\",\"\",[2]跳转类型!$A32)","v":48},{"$f":"IF(A28=\"\",\"待定义\",VLOOKUP(A28,[2]跳转类型!$A:$B,2,FALSE))","v":"背包界面"}]
[{"$f":"IF([2]跳转类型!$A33=\"\",\"\",[2]跳转类型!$A33)","v":49},{"$f":"IF(A29=\"\",\"待定义\",VLOOKUP(A29,[2]跳转类型!$A:$B,2,FALSE))","v":"日常任务界面"}]
[{"$f":"IF([2]跳转类型!$A34=\"\",\"\",[2]跳转类型!$A34)","v":50},{"$f":"IF(A30=\"\",\"待定义\",VLOOKUP(A30,[2]跳转类型!$A:$B,2,FALSE))","v":"商店-小镇杂货页签"}]
[{"$f":"IF([2]跳转类型!$A35=\"\",\"\",[2]跳转类型!$A35)","v":51},{"$f":"IF(A31=\"\",\"待定义\",VLOOKUP(A31,[2]跳转类型!$A:$B,2,FALSE))","v":"试炼之塔-流明试炼"}]
[{"$f":"IF([2]跳转类型!$A36=\"\",\"\",[2]跳转类型!$A36)","v":52},{"$f":"IF(A32=\"\",\"待定义\",VLOOKUP(A32,[2]跳转类型!$A:$B,2,FALSE))","v":"试炼之塔-时光试炼"}]
[{"$f":"IF([2]跳转类型!$A37=\"\",\"\",[2]跳转类型!$A37)","v":53},{"$f":"IF(A33=\"\",\"待定义\",VLOOKUP(A33,[2]跳转类型!$A:$B,2,FALSE))","v":"试炼之塔-轮回试炼"}]
[{"$f":"IF([2]跳转类型!$A38=\"\",\"\",[2]跳转类型!$A38)","v":54},{"$f":"IF(A34=\"\",\"待定义\",VLOOKUP(A34,[2]跳转类型!$A:$B,2,FALSE))","v":"个人飞艇界面"}]
[{"$f":"IF([2]跳转类型!$A39=\"\",\"\",[2]跳转类型!$A39)","v":60},{"$f":"IF(A35=\"\",\"待定义\",VLOOKUP(A35,[2]跳转类型!$A:$B,2,FALSE))","v":"物资枢纽主界面"}]
[{"$f":"IF([2]跳转类型!$A40=\"\",\"\",[2]跳转类型!$A40)","v":61},{"$f":"IF(A36=\"\",\"待定义\",VLOOKUP(A36,[2]跳转类型!$A:$B,2,FALSE))","v":"物资枢纽-闹鬼金矿"}]
[{"$f":"IF([2]跳转类型!$A41=\"\",\"\",[2]跳转类型!$A41)","v":62},{"$f":"IF(A37=\"\",\"待定义\",VLOOKUP(A37,[2]跳转类型!$A:$B,2,FALSE))","v":"物资枢纽-冒险者墓地"}]
[{"$f":"IF([2]跳转类型!$A42=\"\",\"\",[2]跳转类型!$A42)","v":63},{"$f":"IF(A38=\"\",\"待定义\",VLOOKUP(A38,[2]跳转类型!$A:$B,2,FALSE))","v":"物资枢纽-机械废墟·红-进攻型遗物"}]
[{"$f":"IF([2]跳转类型!$A43=\"\",\"\",[2]跳转类型!$A43)","v":64},{"$f":"IF(A39=\"\",\"待定义\",VLOOKUP(A39,[2]跳转类型!$A:$B,2,FALSE))","v":"物资枢纽-机械废墟·蓝-防御型遗物"}]
[{"$f":"IF([2]跳转类型!$A44=\"\",\"\",[2]跳转类型!$A44)","v":65},{"$f":"IF(A40=\"\",\"待定义\",VLOOKUP(A40,[2]跳转类型!$A:$B,2,FALSE))","v":"物资枢纽-机械废墟·绿-辅助型遗物"}]
[{"$f":"IF([2]跳转类型!$A45=\"\",\"\",[2]跳转类型!$A45)","v":67},{"$f":"IF(A41=\"\",\"待定义\",VLOOKUP(A41,[2]跳转类型!$A:$B,2,FALSE))","v":"物资枢纽-深渊猎场"}]
[{"$f":"IF([2]跳转类型!$A46=\"\",\"\",[2]跳转类型!$A46)","v":""},{"$f":"IF(A42=\"\",\"待定义\",VLOOKUP(A42,[2]跳转类型!$A:$B,2,FALSE))","v":"待定义"}]
[{"$f":"IF([2]跳转类型!$A47=\"\",\"\",[2]跳转类型!$A47)","v":""},{"$f":"IF(A43=\"\",\"待定义\",VLOOKUP(A43,[2]跳转类型!$A:$B,2,FALSE))","v":"待定义"}]
[{"$f":"IF([2]跳转类型!$A48=\"\",\"\",[2]跳转类型!$A48)","v":""},{"$f":"IF(A44=\"\",\"待定义\",VLOOKUP(A44,[2]跳转类型!$A:$B,2,FALSE))","v":"待定义"}]
[{"$f":"IF([2]跳转类型!$A49=\"\",\"\",[2]跳转类型!$A49)","v":""},{"$f":"IF(A45=\"\",\"待定义\",VLOOKUP(A45,[2]跳转类型!$A:$B,2,FALSE))","v":"待定义"}]
[{"$f":"IF([2]跳转类型!$A50=\"\",\"\",[2]跳转类型!$A50)","v":""},{"$f":"IF(A46=\"\",\"待定义\",VLOOKUP(A46,[2]跳转类型!$A:$B,2,FALSE))","v":"待定义"}]
[{"$f":"IF([2]跳转类型!$A51=\"\",\"\",[2]跳转类型!$A51)","v":""},{"$f":"IF(A47=\"\",\"待定义\",VLOOKUP(A47,[2]跳转类型!$A:$B,2,FALSE))","v":"待定义"}]
[{"$f":"IF([2]跳转类型!$A52=\"\",\"\",[2]跳转类型!$A52)","v":""},{"$f":"IF(A48=\"\",\"待定义\",VLOOKUP(A48,[2]跳转类型!$A:$B,2,FALSE))","v":"待定义"}]
[{"$f":"IF([2]跳转类型!$A53=\"\",\"\",[2]跳转类型!$A53)","v":""},{"$f":"IF(A49=\"\",\"待定义\",VLOOKUP(A49,[2]跳转类型!$A:$B,2,FALSE))","v":"待定义"}]
[{"$f":"IF([2]跳转类型!$A54=\"\",\"\",[2]跳转类型!$A54)","v":""},{"$f":"IF(A50=\"\",\"待定义\",VLOOKUP(A50,[2]跳转类型!$A:$B,2,FALSE))","v":"待定义"}]
[{"$f":"IF([2]跳转类型!$A55=\"\",\"\",[2]跳转类型!$A55)","v":""},{"$f":"IF(A51=\"\",\"待定义\",VLOOKUP(A51,[2]跳转类型!$A:$B,2,FALSE))","v":"待定义"}]
[{"$f":"IF([2]跳转类型!$A56=\"\",\"\",[2]跳转类型!$A56)","v":""},{"$f":"IF(A52=\"\",\"待定义\",VLOOKUP(A52,[2]跳转类型!$A:$B,2,FALSE))","v":"待定义"}]
[{"$f":"IF([2]跳转类型!$A57=\"\",\"\",[2]跳转类型!$A57)","v":""},{"$f":"IF(A53=\"\",\"待定义\",VLOOKUP(A53,[2]跳转类型!$A:$B,2,FALSE))","v":"待定义"}]
[{"$f":"IF([2]跳转类型!$A58=\"\",\"\",[2]跳转类型!$A58)","v":""},{"$f":"IF(A54=\"\",\"待定义\",VLOOKUP(A54,[2]跳转类型!$A:$B,2,FALSE))","v":"待定义"}]
[{"$f":"IF([2]跳转类型!$A59=\"\",\"\",[2]跳转类型!$A59)","v":""},{"$f":"IF(A55=\"\",\"待定义\",VLOOKUP(A55,[2]跳转类型!$A:$B,2,FALSE))","v":"待定义"}]
[{"$f":"IF([2]跳转类型!$A60=\"\",\"\",[2]跳转类型!$A60)","v":""},{"$f":"IF(A56=\"\",\"待定义\",VLOOKUP(A56,[2]跳转类型!$A:$B,2,FALSE))","v":"待定义"}]
[{"$f":"IF([2]跳转类型!$A61=\"\",\"\",[2]跳转类型!$A61)","v":""},{"$f":"IF(A57=\"\",\"待定义\",VLOOKUP(A57,[2]跳转类型!$A:$B,2,FALSE))","v":"待定义"}]
[{"$f":"IF([2]跳转类型!$A62=\"\",\"\",[2]跳转类型!$A62)","v":""},{"$f":"IF(A58=\"\",\"待定义\",VLOOKUP(A58,[2]跳转类型!$A:$B,2,FALSE))","v":"待定义"}]
[{"$f":"IF([2]跳转类型!$A63=\"\",\"\",[2]跳转类型!$A63)","v":""},{"$f":"IF(A59=\"\",\"待定义\",VLOOKUP(A59,[2]跳转类型!$A:$B,2,FALSE))","v":"待定义"}]
[{"$f":"IF([2]跳转类型!$A64=\"\",\"\",[2]跳转类型!$A64)","v":""},{"$f":"IF(A60=\"\",\"待定义\",VLOOKUP(A60,[2]跳转类型!$A:$B,2,FALSE))","v":"待定义"}]
{"$rows_left_out":40}