{"text_format":"2","workbook":"xlsx","n_sheets":4,"sheets":["ItemConfig","渡劫辅助表","ID分段","ItemAssociateConfig"],"not_rendered":{"charts":0,"images":0,"macros":0,"external_links":4,"defined_names":1,"comments":0,"pivot_tables":0},"unopened":[],"bounds":{"document_bytes":16777216,"sheet_cells":100000,"run_cost":"one","rows_first":2000,"rows_last":500,"rows_between":2000,"halvings":0,"cell_chars":16384,"cell_head_chars":4096},"cells_cut":0,"cells_raw":0,"read":"whole","date_system":"1900"}

{"sheet":"ItemConfig","index":0,"n_rows":264,"n_cols":42,"rows_kept":264,"cut":false,"hidden":false,"merged":[]}
["ID","itemName",null,"itemDesc",null,"icon","itemTag",null,"quality","stack","isSell","SkiptoID","rewardsNum","isVisible","isUse","useLimit","useLimtValue","costItemNum","rewardsItems","rewardsItemNums","stack","associateID","associateVlaue","sort","itemDesc2"]
["int","int",null,"int",null,"string","int",null,"int","int","bool","int[]","int","int","bool","int",null,"int","int[]","int[]","int","int","int[]","int","int"]
[]
["ID1","道具名称\n","道具名\n(查看)","功能说明","功能说明","道具图标","道具分类\n见ID分段",{"$f":"SUBTOTAL(3,H5:H10052)","v":240},"品质\n1.[物品]白\n2.[物品]绿\n3.[物品]蓝\n4.[物品]紫\n5.[物品]橙\n6.[物品]红","堆叠数量\n0.无限","是否出售","跳转ID","出售金额","进入背包时，是否可见","是否可用","使用限制\n0. 无\n1. 共鸣等级","限制的值","消耗道具数量","获得道具ID","获得道具的数量","堆叠数量\n0.无限","特殊功能ID\n详情见说明页","特殊功能参数\n详情见说明页","背包内排序","包装文本","包装文本","参数1","参数2","参数3","参数4","参数5",null,"跳转1","跳转2","跳转3","跳转1","跳转2","跳转3"]
[1001,169,"灵石",162,"游历仙界最基础的货币。","icon_Coin",1,{"$f":"CONCATENATE(VLOOKUP(G5,ID分段!A:B,2,FALSE),\"-\",VLOOKUP(G5,ID分段!A:C,3,FALSE))","v":"资源-货币"},2,0,0,{"$f":"_xlfn.TEXTJOIN(\";\",1,AG5:AI5)","v":"5;14"},0,1,0,null,null,0,0,0,0,{"$nulls":11},5,14,null,{"$f":"IF(AG5=\"\",\"\",VLOOKUP(AG5,[1]SkiptoConfig!$A:$H,8,FALSE))","v":"使用神识"},{"$f":"IF(AH5=\"\",\"\",VLOOKUP(AH5,[1]SkiptoConfig!$A:$H,8,FALSE))","v":"命运峰"},{"$f":"IF(AI5=\"\",\"\",VLOOKUP(AI5,[1]SkiptoConfig!$A:$H,8,FALSE))","v":""}]
[1002,170,"妖丹",163,"妖物魂魄凝结而成的丹药，一般作为较为稀有的货币。","icon_Coins_s",1,{"$f":"CONCATENATE(VLOOKUP(G6,ID分段!A:B,2,FALSE),\"-\",VLOOKUP(G6,ID分段!A:C,3,FALSE))","v":"资源-货币"},4,0,0,{"$f":"_xlfn.TEXTJOIN(\";\",1,AG6:AI6)","v":"4"},0,1,0,null,null,0,0,0,0,{"$nulls":11},4,null,null,{"$f":"IF(AG6=\"\",\"\",VLOOKUP(AG6,[1]SkiptoConfig!$A:$H,8,FALSE))","v":"兑换商店-妖丹兑换"},{"$f":"IF(AH6=\"\",\"\",VLOOKUP(AH6,[1]SkiptoConfig!$A:$H,8,FALSE))","v":""},{"$f":"IF(AI6=\"\",\"\",VLOOKUP(AI6,[1]SkiptoConfig!$A:$H,8,FALSE))","v":""}]
[1003,171,"修为",164,"英雄提升等级所必需的资源。","icon_Gem_Star_Blue",2,{"$f":"CONCATENATE(VLOOKUP(G7,ID分段!A:B,2,FALSE),\"-\",VLOOKUP(G7,ID分段!A:C,3,FALSE))","v":"资源-材料"},2,0,0,"5;14",0,1,0,null,null,0,0,0,0,13,{"$nulls":10},5,14,null,{"$f":"IF(AG7=\"\",\"\",VLOOKUP(AG7,[1]SkiptoConfig!$A:$H,8,FALSE))","v":"使用神识"},{"$f":"IF(AH7=\"\",\"\",VLOOKUP(AH7,[1]SkiptoConfig!$A:$H,8,FALSE))","v":"命运峰"},{"$f":"IF(AI7=\"\",\"\",VLOOKUP(AI7,[1]SkiptoConfig!$A:$H,8,FALSE))","v":""}]
[1004,248,"仙缘宝券",249,"仙界最为珍贵的货币。","icon_Demo_Gem04",1,{"$f":"CONCATENATE(VLOOKUP(G8,ID分段!A:B,2,FALSE),\"-\",VLOOKUP(G8,ID分段!A:C,3,FALSE))","v":"资源-货币"},5,0,0,"6",0,1,0,null,null,0,0,0,0,{"$nulls":11},6,null,null,{"$f":"IF(AG8=\"\",\"\",VLOOKUP(AG8,[1]SkiptoConfig!$A:$H,8,FALSE))","v":"参悟天道"},{"$f":"IF(AH8=\"\",\"\",VLOOKUP(AH8,[1]SkiptoConfig!$A:$H,8,FALSE))","v":""},{"$f":"IF(AI8=\"\",\"\",VLOOKUP(AI8,[1]SkiptoConfig!$A:$H,8,FALSE))","v":""}]
[1005,725,"灵气",726,"功法升级所必需的资源。","icon_GradeBadge_Master",2,{"$f":"CONCATENATE(VLOOKUP(G9,ID分段!A:B,2,FALSE),\"-\",VLOOKUP(G9,ID分段!A:C,3,FALSE))","v":"资源-材料"},3,0,0,"10;5",0,1,0,null,null,0,0,0,0,{"$nulls":11},10,5,null,{"$f":"IF(AG9=\"\",\"\",VLOOKUP(AG9,[1]SkiptoConfig!$A:$H,8,FALSE))","v":"探宝"},{"$f":"IF(AH9=\"\",\"\",VLOOKUP(AH9,[1]SkiptoConfig!$A:$H,8,FALSE))","v":"使用神识"},{"$f":"IF(AI9=\"\",\"\",VLOOKUP(AI9,[1]SkiptoConfig!$A:$H,8,FALSE))","v":""}]
[1006,1400,"玄晶",1401,"法宝升级所必需的资源。","icon_GradeBadge_Challenger",2,{"$f":"CONCATENATE(VLOOKUP(G10,ID分段!A:B,2,FALSE),\"-\",VLOOKUP(G10,ID分段!A:C,3,FALSE))","v":"资源-材料"},3,0,0,"10;5",0,1,0,null,null,0,0,0,0,{"$nulls":11},10,5,null,{"$f":"IF(AG10=\"\",\"\",VLOOKUP(AG10,[1]SkiptoConfig!$A:$H,8,FALSE))","v":"探宝"},{"$f":"IF(AH10=\"\",\"\",VLOOKUP(AH10,[1]SkiptoConfig!$A:$H,8,FALSE))","v":"使用神识"},{"$f":"IF(AI10=\"\",\"\",VLOOKUP(AI10,[1]SkiptoConfig!$A:$H,8,FALSE))","v":""}]
[1007,-1,"广告币",-1,null,"icon_GradeBadge_Challenger",1,{"$f":"CONCATENATE(VLOOKUP(G11,ID分段!A:B,2,FALSE),\"-\",VLOOKUP(G11,ID分段!A:C,3,FALSE))","v":"资源-货币"},4,0,0,"",0,0,0,null,null,0,0,0,0,{"$nulls":14},{"$f":"IF(AG11=\"\",\"\",VLOOKUP(AG11,[1]SkiptoConfig!$A:$H,8,FALSE))","v":""},{"$f":"IF(AH11=\"\",\"\",VLOOKUP(AH11,[1]SkiptoConfig!$A:$H,8,FALSE))","v":""},{"$f":"IF(AI11=\"\",\"\",VLOOKUP(AI11,[1]SkiptoConfig!$A:$H,8,FALSE))","v":""}]
[{"$nulls":11},"",{"$nulls":23},{"$f":"IF(AG12=\"\",\"\",VLOOKUP(AG12,[1]SkiptoConfig!$A:$H,8,FALSE))","v":""},{"$f":"IF(AH12=\"\",\"\",VLOOKUP(AH12,[1]SkiptoConfig!$A:$H,8,FALSE))","v":""},{"$f":"IF(AI12=\"\",\"\",VLOOKUP(AI12,[1]SkiptoConfig!$A:$H,8,FALSE))","v":""}]
[1101,-1,{"$f":"CONCATENATE(\"自转道具-\",VLOOKUP(AA13,A:C,3,FALSE),\"×\",AB13)","v":"自转道具-仙缘宝券×3"},-1,null,"icon_GradeBadge_Challenger",9,{"$f":"CONCATENATE(VLOOKUP(G13,ID分段!A:B,2,FALSE),\"-\",VLOOKUP(G13,ID分段!A:C,3,FALSE))","v":"资源-自动转代币"},3,0,0,"",0,0,0,null,null,0,0,0,0,9,{"$f":"_xlfn.TEXTJOIN(\";\",1,AA13:AE13)","v":"1004;3"},null,null,null,1004,3,{"$nulls":7},{"$f":"IF(AG13=\"\",\"\",VLOOKUP(AG13,[1]SkiptoConfig!$A:$H,8,FALSE))","v":""},{"$f":"IF(AH13=\"\",\"\",VLOOKUP(AH13,[1]SkiptoConfig!$A:$H,8,FALSE))","v":""},{"$f":"IF(AI13=\"\",\"\",VLOOKUP(AI13,[1]SkiptoConfig!$A:$H,8,FALSE))","v":""}]
[1102,-1,"自转道具-仙缘宝券×18",-1,null,"icon_GradeBadge_Challenger",9,{"$f":"CONCATENATE(VLOOKUP(G14,ID分段!A:B,2,FALSE),\"-\",VLOOKUP(G14,ID分段!A:C,3,FALSE))","v":"资源-自动转代币"},3,0,0,"",0,0,0,null,null,0,0,0,0,9,{"$f":"_xlfn.TEXTJOIN(\";\",1,AA14:AE14)","v":"1004;18"},null,null,null,1004,18,{"$nulls":7},{"$f":"IF(AG14=\"\",\"\",VLOOKUP(AG14,[1]SkiptoConfig!$A:$H,8,FALSE))","v":""},{"$f":"IF(AH14=\"\",\"\",VLOOKUP(AH14,[1]SkiptoConfig!$A:$H,8,FALSE))","v":""},{"$f":"IF(AI14=\"\",\"\",VLOOKUP(AI14,[1]SkiptoConfig!$A:$H,8,FALSE))","v":""}]
[1103,-1,"自转道具-仙缘宝券×68",-1,null,"icon_GradeBadge_Challenger",9,{"$f":"CONCATENATE(VLOOKUP(G15,ID分段!A:B,2,FALSE),\"-\",VLOOKUP(G15,ID分段!A:C,3,FALSE))","v":"资源-自动转代币"},4,0,0,"",0,0,0,null,null,0,0,0,0,9,"1004;68",null,null,null,1004,68,{"$nulls":7},{"$f":"IF(AG15=\"\",\"\",VLOOKUP(AG15,[1]SkiptoConfig!$A:$H,8,FALSE))","v":""},{"$f":"IF(AH15=\"\",\"\",VLOOKUP(AH15,[1]SkiptoConfig!$A:$H,8,FALSE))","v":""},{"$f":"IF(AI15=\"\",\"\",VLOOKUP(AI15,[1]SkiptoConfig!$A:$H,8,FALSE))","v":""}]
[1104,-1,"自转道具-仙缘宝券×128",-1,null,"icon_GradeBadge_Challenger",9,{"$f":"CONCATENATE(VLOOKUP(G16,ID分段!A:B,2,FALSE),\"-\",VLOOKUP(G16,ID分段!A:C,3,FALSE))","v":"资源-自动转代币"},4,0,0,"",0,0,0,null,null,0,0,0,0,9,"1004;128",null,null,null,1004,128,{"$nulls":7},{"$f":"IF(AG16=\"\",\"\",VLOOKUP(AG16,[1]SkiptoConfig!$A:$H,8,FALSE))","v":""},{"$f":"IF(AH16=\"\",\"\",VLOOKUP(AH16,[1]SkiptoConfig!$A:$H,8,FALSE))","v":""},{"$f":"IF(AI16=\"\",\"\",VLOOKUP(AI16,[1]SkiptoConfig!$A:$H,8,FALSE))","v":""}]
[1105,-1,"自转道具-仙缘宝券×328",-1,null,"icon_GradeBadge_Challenger",9,{"$f":"CONCATENATE(VLOOKUP(G17,ID分段!A:B,2,FALSE),\"-\",VLOOKUP(G17,ID分段!A:C,3,FALSE))","v":"资源-自动转代币"},5,0,0,"",0,0,0,null,null,0,0,0,0,9,"1004;328",null,null,null,1004,328,{"$nulls":7},{"$f":"IF(AG17=\"\",\"\",VLOOKUP(AG17,[1]SkiptoConfig!$A:$H,8,FALSE))","v":""},{"$f":"IF(AH17=\"\",\"\",VLOOKUP(AH17,[1]SkiptoConfig!$A:$H,8,FALSE))","v":""},{"$f":"IF(AI17=\"\",\"\",VLOOKUP(AI17,[1]SkiptoConfig!$A:$H,8,FALSE))","v":""}]
[1106,-1,"自转道具-仙缘宝券×648",-1,null,"icon_GradeBadge_Challenger",9,{"$f":"CONCATENATE(VLOOKUP(G18,ID分段!A:B,2,FALSE),\"-\",VLOOKUP(G18,ID分段!A:C,3,FALSE))","v":"资源-自动转代币"},5,0,0,"",0,0,0,null,null,0,0,0,0,9,"1004;648",null,null,null,1004,648,{"$nulls":7},{"$f":"IF(AG18=\"\",\"\",VLOOKUP(AG18,[1]SkiptoConfig!$A:$H,8,FALSE))","v":""},{"$f":"IF(AH18=\"\",\"\",VLOOKUP(AH18,[1]SkiptoConfig!$A:$H,8,FALSE))","v":""},{"$f":"IF(AI18=\"\",\"\",VLOOKUP(AI18,[1]SkiptoConfig!$A:$H,8,FALSE))","v":""}]
[{"$nulls":11},"",{"$nulls":23},{"$f":"IF(AG19=\"\",\"\",VLOOKUP(AG19,[1]SkiptoConfig!$A:$H,8,FALSE))","v":""},{"$f":"IF(AH19=\"\",\"\",VLOOKUP(AH19,[1]SkiptoConfig!$A:$H,8,FALSE))","v":""},{"$f":"IF(AI19=\"\",\"\",VLOOKUP(AI19,[1]SkiptoConfig!$A:$H,8,FALSE))","v":""}]
[1201,250,"灵血草",259,{"$f":"CONCATENATE(\"协助修仙者突破的天材地宝，在\",AM20,\"期进行突破时，可提升\",AC20,\"%的渡劫成功率。\")","v":"协助修仙者突破的天材地宝，在练气期进行突破时，可提升15%的渡劫成功率。"},"icon_item_1201",3,{"$f":"CONCATENATE(VLOOKUP(G20,ID分段!A:B,2,FALSE),\"-\",VLOOKUP(G20,ID分段!A:C,3,FALSE))","v":"资源-渡劫-选有"},2,0,0,"5",0,1,0,null,null,0,0,0,0,1,"30;40;15;20",null,null,null,30,40,15,20,null,null,5,null,null,{"$f":"IF(AG20=\"\",\"\",VLOOKUP(AG20,[1]SkiptoConfig!$A:$H,8,FALSE))","v":"使用神识"},{"$f":"IF(AH20=\"\",\"\",VLOOKUP(AH20,[1]SkiptoConfig!$A:$H,8,FALSE))","v":""},{"$f":"IF(AI20=\"\",\"\",VLOOKUP(AI20,[1]SkiptoConfig!$A:$H,8,FALSE))","v":""},"练气"]
[1202,251,"玄玉髓",260,{"$f":"CONCATENATE(\"协助修仙者突破的天材地宝，在\",AM21,\"期进行突破时，可提升\",AC21,\"%的渡劫成功率。\")","v":"协助修仙者突破的天材地宝，在筑基期进行突破时，可提升30%的渡劫成功率。"},"icon_item_1202",3,{"$f":"CONCATENATE(VLOOKUP(G21,ID分段!A:B,2,FALSE),\"-\",VLOOKUP(G21,ID分段!A:C,3,FALSE))","v":"资源-渡劫-选有"},2,0,0,"5",0,1,0,null,null,0,0,0,0,1,"40;60;30;20",null,null,null,40,60,30,20,null,null,5,null,null,{"$f":"IF(AG21=\"\",\"\",VLOOKUP(AG21,[1]SkiptoConfig!$A:$H,8,FALSE))","v":"使用神识"},{"$f":"IF(AH21=\"\",\"\",VLOOKUP(AH21,[1]SkiptoConfig!$A:$H,8,FALSE))","v":""},{"$f":"IF(AI21=\"\",\"\",VLOOKUP(AI21,[1]SkiptoConfig!$A:$H,8,FALSE))","v":""},"筑基"]
[1203,252,"赤阳砂",261,"协助修仙者突破的天材地宝，在结丹期进行突破时，可提升20%的渡劫成功率。","icon_item_1203",3,{"$f":"CONCATENATE(VLOOKUP(G22,ID分段!A:B,2,FALSE),\"-\",VLOOKUP(G22,ID分段!A:C,3,FALSE))","v":"资源-渡劫-选有"},3,0,0,"5",0,1,0,null,null,0,0,0,0,1,"70;90;20;20",null,null,null,70,90,20,20,null,null,5,null,null,{"$f":"IF(AG22=\"\",\"\",VLOOKUP(AG22,[1]SkiptoConfig!$A:$H,8,FALSE))","v":"使用神识"},{"$f":"IF(AH22=\"\",\"\",VLOOKUP(AH22,[1]SkiptoConfig!$A:$H,8,FALSE))","v":""},{"$f":"IF(AI22=\"\",\"\",VLOOKUP(AI22,[1]SkiptoConfig!$A:$H,8,FALSE))","v":""},"结丹"]
[1204,253,"火灵果",262,"协助修仙者突破的天材地宝，在结丹期进行突破时，可提升20%的渡劫成功率。","icon_item_1204",3,{"$f":"CONCATENATE(VLOOKUP(G23,ID分段!A:B,2,FALSE),\"-\",VLOOKUP(G23,ID分段!A:C,3,FALSE))","v":"资源-渡劫-选有"},3,0,0,"5",0,1,0,null,null,0,0,0,0,1,"70;90;20;20",null,null,null,70,90,20,20,null,null,5,null,null,{"$f":"IF(AG23=\"\",\"\",VLOOKUP(AG23,[1]SkiptoConfig!$A:$H,8,FALSE))","v":"使用神识"},{"$f":"IF(AH23=\"\",\"\",VLOOKUP(AH23,[1]SkiptoConfig!$A:$H,8,FALSE))","v":""},{"$f":"IF(AI23=\"\",\"\",VLOOKUP(AI23,[1]SkiptoConfig!$A:$H,8,FALSE))","v":""},"结丹"]
[1205,254,"婴魂草",263,"协助修仙者突破的天材地宝，在元婴期进行突破时，可提升25%的渡劫成功率。","icon_item_1205",3,{"$f":"CONCATENATE(VLOOKUP(G24,ID分段!A:B,2,FALSE),\"-\",VLOOKUP(G24,ID分段!A:C,3,FALSE))","v":"资源-渡劫-选有"},3,0,0,{"$f":"_xlfn.TEXTJOIN(\";\",1,AG24:AI24)","v":"5"},0,1,0,null,null,0,0,0,0,1,{"$f":"_xlfn.TEXTJOIN(\";\",1,AA24:AE24)","v":"100;120;25;20"},null,null,null,100,120,25,20,null,null,5,null,null,{"$f":"IF(AG24=\"\",\"\",VLOOKUP(AG24,[1]SkiptoConfig!$A:$H,8,FALSE))","v":"使用神识"},{"$f":"IF(AH24=\"\",\"\",VLOOKUP(AH24,[1]SkiptoConfig!$A:$H,8,FALSE))","v":""},{"$f":"IF(AI24=\"\",\"\",VLOOKUP(AI24,[1]SkiptoConfig!$A:$H,8,FALSE))","v":""},"元婴"]
[1206,255,"灵魄藤",264,"协助修仙者突破的天材地宝，在元婴期进行突破时，可提升25%的渡劫成功率。","icon_item_1206",3,{"$f":"CONCATENATE(VLOOKUP(G25,ID分段!A:B,2,FALSE),\"-\",VLOOKUP(G25,ID分段!A:C,3,FALSE))","v":"资源-渡劫-选有"},3,0,0,"5",0,1,0,null,null,0,0,0,0,1,"100;120;25;20",null,null,null,100,120,25,20,null,null,5,null,null,{"$f":"IF(AG25=\"\",\"\",VLOOKUP(AG25,[1]SkiptoConfig!$A:$H,8,FALSE))","v":"使用神识"},{"$f":"IF(AH25=\"\",\"\",VLOOKUP(AH25,[1]SkiptoConfig!$A:$H,8,FALSE))","v":""},{"$f":"IF(AI25=\"\",\"\",VLOOKUP(AI25,[1]SkiptoConfig!$A:$H,8,FALSE))","v":""},"元婴"]
[1207,256,"灵冥石",265,"协助修仙者突破的天材地宝，在化神期进行突破时，可提升20%的渡劫成功率。","icon_item_1207",3,{"$f":"CONCATENATE(VLOOKUP(G26,ID分段!A:B,2,FALSE),\"-\",VLOOKUP(G26,ID分段!A:C,3,FALSE))","v":"资源-渡劫-选有"},4,0,0,"5",0,1,0,null,null,0,0,0,0,1,"130;150;20;20",null,null,null,130,150,20,20,null,null,5,null,null,{"$f":"IF(AG26=\"\",\"\",VLOOKUP(AG26,[1]SkiptoConfig!$A:$H,8,FALSE))","v":"使用神识"},{"$f":"IF(AH26=\"\",\"\",VLOOKUP(AH26,[1]SkiptoConfig!$A:$H,8,FALSE))","v":""},{"$f":"IF(AI26=\"\",\"\",VLOOKUP(AI26,[1]SkiptoConfig!$A:$H,8,FALSE))","v":""},"化神"]
[1208,257,"玄金砂",266,"协助修仙者突破的天材地宝，在化神期进行突破时，可提升20%的渡劫成功率。","icon_item_1208",3,{"$f":"CONCATENATE(VLOOKUP(G27,ID分段!A:B,2,FALSE),\"-\",VLOOKUP(G27,ID分段!A:C,3,FALSE))","v":"资源-渡劫-选有"},4,0,0,"5",0,1,0,null,null,0,0,0,0,1,"130;150;20;20",null,null,null,130,150,20,20,null,null,5,null,null,{"$f":"IF(AG27=\"\",\"\",VLOOKUP(AG27,[1]SkiptoConfig!$A:$H,8,FALSE))","v":"使用神识"},{"$f":"IF(AH27=\"\",\"\",VLOOKUP(AH27,[1]SkiptoConfig!$A:$H,8,FALSE))","v":""},{"$f":"IF(AI27=\"\",\"\",VLOOKUP(AI27,[1]SkiptoConfig!$A:$H,8,FALSE))","v":""},"化神"]
[1209,258,"紫玄晶",267,"协助修仙者突破的天材地宝，在化神期进行突破时，可提升20%的渡劫成功率。","icon_item_1209",3,{"$f":"CONCATENATE(VLOOKUP(G28,ID分段!A:B,2,FALSE),\"-\",VLOOKUP(G28,ID分段!A:C,3,FALSE))","v":"资源-渡劫-选有"},4,0,0,{"$f":"_xlfn.TEXTJOIN(\";\",1,AG28:AI28)","v":"5"},0,1,0,null,null,0,0,0,0,1,{"$f":"_xlfn.TEXTJOIN(\";\",1,AA28:AE28)","v":"130;150;20;20"},null,null,null,130,150,20,20,null,null,5,null,null,{"$f":"IF(AG28=\"\",\"\",VLOOKUP(AG28,[1]SkiptoConfig!$A:$H,8,FALSE))","v":"使用神识"},{"$f":"IF(AH28=\"\",\"\",VLOOKUP(AH28,[1]SkiptoConfig!$A:$H,8,FALSE))","v":""},{"$f":"IF(AI28=\"\",\"\",VLOOKUP(AI28,[1]SkiptoConfig!$A:$H,8,FALSE))","v":""},"化神"]
[1210,10452,"丹心花",10486,"协助修仙者突破的天材地宝，在炼虚期进行突破时，可提升25%的渡劫成功率。","icon_item_1210",3,{"$f":"CONCATENATE(VLOOKUP(G29,ID分段!A:B,2,FALSE),\"-\",VLOOKUP(G29,ID分段!A:C,3,FALSE))","v":"资源-渡劫-选有"},4,0,0,"5",0,1,0,null,null,0,0,0,0,1,"160;180;25;20",null,null,null,160,180,25,20,null,null,5,null,null,{"$f":"IF(AG29=\"\",\"\",VLOOKUP(AG29,[1]SkiptoConfig!$A:$H,8,FALSE))","v":"使用神识"},{"$f":"IF(AH29=\"\",\"\",VLOOKUP(AH29,[1]SkiptoConfig!$A:$H,8,FALSE))","v":""},{"$f":"IF(AI29=\"\",\"\",VLOOKUP(AI29,[1]SkiptoConfig!$A:$H,8,FALSE))","v":""},"炼虚"]
[1211,10453,"太冥草",10487,"协助修仙者突破的天材地宝，在炼虚期进行突破时，可提升25%的渡劫成功率。","icon_item_1211",3,{"$f":"CONCATENATE(VLOOKUP(G30,ID分段!A:B,2,FALSE),\"-\",VLOOKUP(G30,ID分段!A:C,3,FALSE))","v":"资源-渡劫-选有"},4,0,0,"5",0,1,0,null,null,0,0,0,0,1,"160;180;25;20",null,null,null,160,180,25,20,null,null,5,null,null,{"$f":"IF(AG30=\"\",\"\",VLOOKUP(AG30,[1]SkiptoConfig!$A:$H,8,FALSE))","v":"使用神识"},{"$f":"IF(AH30=\"\",\"\",VLOOKUP(AH30,[1]SkiptoConfig!$A:$H,8,FALSE))","v":""},{"$f":"IF(AI30=\"\",\"\",VLOOKUP(AI30,[1]SkiptoConfig!$A:$H,8,FALSE))","v":""},"炼虚"]
[1212,10454,"星炎草",10488,"协助修仙者突破的天材地宝，在炼虚期进行突破时，可提升25%的渡劫成功率。","icon_item_1212",3,{"$f":"CONCATENATE(VLOOKUP(G31,ID分段!A:B,2,FALSE),\"-\",VLOOKUP(G31,ID分段!A:C,3,FALSE))","v":"资源-渡劫-选有"},4,0,0,"5",0,1,0,null,null,0,0,0,0,1,"160;180;25;20",null,null,null,160,180,25,20,null,null,5,null,null,{"$f":"IF(AG31=\"\",\"\",VLOOKUP(AG31,[1]SkiptoConfig!$A:$H,8,FALSE))","v":"使用神识"},{"$f":"IF(AH31=\"\",\"\",VLOOKUP(AH31,[1]SkiptoConfig!$A:$H,8,FALSE))","v":""},{"$f":"IF(AI31=\"\",\"\",VLOOKUP(AI31,[1]SkiptoConfig!$A:$H,8,FALSE))","v":""},"炼虚"]
[1213,10455,"混元晶",10489,"协助修仙者突破的天材地宝，在合体期进行突破时，可提升30%的渡劫成功率。","icon_item_1213",3,{"$f":"CONCATENATE(VLOOKUP(G32,ID分段!A:B,2,FALSE),\"-\",VLOOKUP(G32,ID分段!A:C,3,FALSE))","v":"资源-渡劫-选有"},5,0,0,"5",0,1,0,null,null,0,0,0,0,1,"190;210;30;20",null,null,null,190,210,30,20,null,null,5,null,null,{"$f":"IF(AG32=\"\",\"\",VLOOKUP(AG32,[1]SkiptoConfig!$A:$H,8,FALSE))","v":"使用神识"},{"$f":"IF(AH32=\"\",\"\",VLOOKUP(AH32,[1]SkiptoConfig!$A:$H,8,FALSE))","v":""},{"$f":"IF(AI32=\"\",\"\",VLOOKUP(AI32,[1]SkiptoConfig!$A:$H,8,FALSE))","v":""},"合体"]
[1214,10456,"地髓晶",10490,"协助修仙者突破的天材地宝，在合体期进行突破时，可提升30%的渡劫成功率。","icon_item_1214",3,{"$f":"CONCATENATE(VLOOKUP(G33,ID分段!A:B,2,FALSE),\"-\",VLOOKUP(G33,ID分段!A:C,3,FALSE))","v":"资源-渡劫-选有"},5,0,0,"5",0,1,0,null,null,0,0,0,0,1,"190;210;30;20",null,null,null,190,210,30,20,null,null,5,null,null,{"$f":"IF(AG33=\"\",\"\",VLOOKUP(AG33,[1]SkiptoConfig!$A:$H,8,FALSE))","v":"使用神识"},{"$f":"IF(AH33=\"\",\"\",VLOOKUP(AH33,[1]SkiptoConfig!$A:$H,8,FALSE))","v":""},{"$f":"IF(AI33=\"\",\"\",VLOOKUP(AI33,[1]SkiptoConfig!$A:$H,8,FALSE))","v":""},"合体"]
[1215,10457,"灵月石",10491,"协助修仙者突破的天材地宝，在合体期进行突破时，可提升30%的渡劫成功率。","icon_item_1215",3,{"$f":"CONCATENATE(VLOOKUP(G34,ID分段!A:B,2,FALSE),\"-\",VLOOKUP(G34,ID分段!A:C,3,FALSE))","v":"资源-渡劫-选有"},5,0,0,"5",0,1,0,null,null,0,0,0,0,1,"190;210;30;20",null,null,null,190,210,30,20,null,null,5,null,null,{"$f":"IF(AG34=\"\",\"\",VLOOKUP(AG34,[1]SkiptoConfig!$A:$H,8,FALSE))","v":"使用神识"},{"$f":"IF(AH34=\"\",\"\",VLOOKUP(AH34,[1]SkiptoConfig!$A:$H,8,FALSE))","v":""},{"$f":"IF(AI34=\"\",\"\",VLOOKUP(AI34,[1]SkiptoConfig!$A:$H,8,FALSE))","v":""},"合体"]
[1216,10458,"玄雷果",10492,"协助修仙者突破的天材地宝，在大乘期进行突破时，可提升30%的渡劫成功率。","icon_item_1216",3,{"$f":"CONCATENATE(VLOOKUP(G35,ID分段!A:B,2,FALSE),\"-\",VLOOKUP(G35,ID分段!A:C,3,FALSE))","v":"资源-渡劫-选有"},5,0,0,"5",0,1,0,null,null,0,0,0,0,1,"220;240;30;20",null,null,null,220,240,30,20,null,null,5,null,null,{"$f":"IF(AG35=\"\",\"\",VLOOKUP(AG35,[1]SkiptoConfig!$A:$H,8,FALSE))","v":"使用神识"},{"$f":"IF(AH35=\"\",\"\",VLOOKUP(AH35,[1]SkiptoConfig!$A:$H,8,FALSE))","v":""},{"$f":"IF(AI35=\"\",\"\",VLOOKUP(AI35,[1]SkiptoConfig!$A:$H,8,FALSE))","v":""},"大乘"]
[1217,10459,"龙筋草",10493,"协助修仙者突破的天材地宝，在大乘期进行突破时，可提升30%的渡劫成功率。","icon_item_1217",3,{"$f":"CONCATENATE(VLOOKUP(G36,ID分段!A:B,2,FALSE),\"-\",VLOOKUP(G36,ID分段!A:C,3,FALSE))","v":"资源-渡劫-选有"},5,0,0,{"$f":"_xlfn.TEXTJOIN(\";\",1,AG36:AI36)","v":"5"},0,1,0,null,null,0,0,0,0,1,{"$f":"_xlfn.TEXTJOIN(\";\",1,AA36:AE36)","v":"220;240;30;20"},null,null,null,220,240,30,20,null,null,5,null,null,{"$f":"IF(AG36=\"\",\"\",VLOOKUP(AG36,[1]SkiptoConfig!$A:$H,8,FALSE))","v":"使用神识"},{"$f":"IF(AH36=\"\",\"\",VLOOKUP(AH36,[1]SkiptoConfig!$A:$H,8,FALSE))","v":""},{"$f":"IF(AI36=\"\",\"\",VLOOKUP(AI36,[1]SkiptoConfig!$A:$H,8,FALSE))","v":""},"大乘"]
[1218,10460,"太虚花",10494,"协助修仙者突破的天材地宝，在大乘期进行突破时，可提升30%的渡劫成功率。","icon_item_1218",3,{"$f":"CONCATENATE(VLOOKUP(G37,ID分段!A:B,2,FALSE),\"-\",VLOOKUP(G37,ID分段!A:C,3,FALSE))","v":"资源-渡劫-选有"},5,0,0,"5",0,1,0,null,null,0,0,0,0,1,"220;240;30;20",null,null,null,220,240,30,20,null,null,5,null,null,{"$f":"IF(AG37=\"\",\"\",VLOOKUP(AG37,[1]SkiptoConfig!$A:$H,8,FALSE))","v":"使用神识"},{"$f":"IF(AH37=\"\",\"\",VLOOKUP(AH37,[1]SkiptoConfig!$A:$H,8,FALSE))","v":""},{"$f":"IF(AI37=\"\",\"\",VLOOKUP(AI37,[1]SkiptoConfig!$A:$H,8,FALSE))","v":""},"大乘"]
[1219,10461,"升仙丹",10495,"协助修仙者突破的天材地宝，在渡劫期进行突破时，可提升30%的渡劫成功率。","icon_item_1219",3,{"$f":"CONCATENATE(VLOOKUP(G38,ID分段!A:B,2,FALSE),\"-\",VLOOKUP(G38,ID分段!A:C,3,FALSE))","v":"资源-渡劫-选有"},6,0,0,"5",0,1,0,null,null,0,0,0,0,1,"250;270;30;20",null,null,null,250,270,30,20,null,null,5,null,null,{"$f":"IF(AG38=\"\",\"\",VLOOKUP(AG38,[1]SkiptoConfig!$A:$H,8,FALSE))","v":"使用神识"},{"$f":"IF(AH38=\"\",\"\",VLOOKUP(AH38,[1]SkiptoConfig!$A:$H,8,FALSE))","v":""},{"$f":"IF(AI38=\"\",\"\",VLOOKUP(AI38,[1]SkiptoConfig!$A:$H,8,FALSE))","v":""},"渡劫"]
[1220,10462,"归虚花",10496,"协助修仙者突破的天材地宝，在渡劫期进行突破时，可提升30%的渡劫成功率。","icon_item_1220",3,{"$f":"CONCATENATE(VLOOKUP(G39,ID分段!A:B,2,FALSE),\"-\",VLOOKUP(G39,ID分段!A:C,3,FALSE))","v":"资源-渡劫-选有"},6,0,0,"5",0,1,0,null,null,0,0,0,0,1,"250;270;30;20",null,null,null,250,270,30,20,null,null,5,null,null,{"$f":"IF(AG39=\"\",\"\",VLOOKUP(AG39,[1]SkiptoConfig!$A:$H,8,FALSE))","v":"使用神识"},{"$f":"IF(AH39=\"\",\"\",VLOOKUP(AH39,[1]SkiptoConfig!$A:$H,8,FALSE))","v":""},{"$f":"IF(AI39=\"\",\"\",VLOOKUP(AI39,[1]SkiptoConfig!$A:$H,8,FALSE))","v":""},"渡劫"]
[1221,10463,"真阳骨",10497,"协助修仙者突破的天材地宝，在渡劫期进行突破时，可提升30%的渡劫成功率。","icon_item_1221",3,{"$f":"CONCATENATE(VLOOKUP(G40,ID分段!A:B,2,FALSE),\"-\",VLOOKUP(G40,ID分段!A:C,3,FALSE))","v":"资源-渡劫-选有"},6,0,0,"5",0,1,0,null,null,0,0,0,0,1,"250;270;30;20",null,null,null,250,270,30,20,null,null,5,null,null,{"$f":"IF(AG40=\"\",\"\",VLOOKUP(AG40,[1]SkiptoConfig!$A:$H,8,FALSE))","v":"使用神识"},{"$f":"IF(AH40=\"\",\"\",VLOOKUP(AH40,[1]SkiptoConfig!$A:$H,8,FALSE))","v":""},{"$f":"IF(AI40=\"\",\"\",VLOOKUP(AI40,[1]SkiptoConfig!$A:$H,8,FALSE))","v":""},"渡劫"]
{"$rows_left_out":225}
{"sheet":"渡劫辅助表","index":1,"n_rows":31,"n_cols":19,"rows_kept":31,"cut":false,"hidden":false,"merged":[]}
[{"$nulls":4},"必须",null,null,"选有1","选有2","选有3"]
[null,1,2,10,"淬骨丹",{"$f":"1-COUNTA(H2:L2)*G2","v":1},{"$nulls":6},10,11,{"$nulls":4},{"$f":"F2*100","v":100}]
[null,2,2,20,"凝灵丹",{"$f":"1-COUNTA(H3:L3)*G3","v":1},{"$nulls":6},20,21,"灵血草",2,0.15,{"$f":"Q3*100","v":15},{"$f":"F3*100","v":100}]
["筑基",3,2,30,"筑基丹",0.85,0.15,"灵血草",{"$nulls":4},30,31,"玄玉髓",2,0.3,{"$f":"Q4*100","v":30},85]
[null,4,2,40,"固元丹",0.7,0.3,"玄玉髓",{"$nulls":4},40,41,"赤阳砂",3,0.2,20,70]
[null,5,2,50,"青灵果",0.7,0.3,"玄玉髓",{"$nulls":4},50,51,"火灵果",3,0.2,20,70]
["结丹",6,2,60,"金阳果",0.7,0.3,"玄玉髓",{"$nulls":4},60,61,"婴魂草",3,0.25,25,70]
[null,7,3,70,"金灵丹",0.6,0.2,"赤阳砂","火灵果",null,null,null,70,71,"灵魄藤",3,0.25,25,60]
[null,8,3,80,"紫霞芝",0.6,0.2,"赤阳砂","火灵果",null,null,null,80,81,"灵冥石",4,0.2,20,60]
["元婴",9,3,90,"九窍芝",0.6,0.2,"赤阳砂","火灵果",null,null,null,90,91,"玄金砂",4,0.2,20,60]
[null,10,3,100,"婴化丹",0.5,0.25,"婴魂草","灵魄藤",null,null,null,100,101,"紫玄晶",4,0.2,20,50]
[null,11,3,110,"玄婴花",0.5,0.25,"婴魂草","灵魄藤",null,null,null,110,111,"丹心花",4,0.25,25,50]
["化神",12,3,120,"玄冥髓",0.5,0.25,"婴魂草","灵魄藤",null,null,null,120,121,"太冥草",4,0.25,25,50]
[null,13,4,130,"聚神丹",0.4,0.2,"灵冥石","玄金砂","紫玄晶",null,null,130,131,"星炎草",4,0.25,25,40]
[null,14,4,140,"太虚花",0.4,0.2,"灵冥石","玄金砂","紫玄晶",null,null,140,141,"混元晶",5,0.3,30,40]
["炼虚",15,4,150,"九焰莲",0.4,0.2,"灵冥石","玄金砂","紫玄晶",null,null,150,151,"地髓晶",5,0.3,30,40]
[null,16,4,160,"虚灵丹",0.25,0.25,"丹心花","太冥草","星炎草",null,null,160,161,"灵月石",5,0.3,30,25]
[null,17,4,170,"梦魇藤",0.25,0.25,"丹心花","太冥草","星炎草",null,null,170,171,"玄雷果",5,0.3,30,25]
["合体",18,4,180,"混沌合晶",0.25,0.25,"丹心花","太冥草","星炎草",null,null,180,181,"龙筋草",5,0.3,30,25]
[null,19,5,190,"天合草",0.1,0.3,"混元晶","地髓晶","灵月石",null,null,190,191,"太虚花",5,0.3,30,10]
[null,20,5,200,"合元丹",0.1,0.3,"混元晶","地髓晶","灵月石",null,null,200,201,"升仙丹",6,0.3,30,10]
["大乘",21,5,210,"鸿蒙紫华",0.1,0.3,"混元晶","地髓晶","灵月石",null,null,210,211,"归虚花",6,0.3,30,10]
[null,22,5,220,"九曜花",0.1,0.3,"玄雷果","龙筋草","太虚花",null,null,220,221,"真阳骨",6,0.3,30,10]
[null,23,5,230,"天衍丹",0.1,0.3,"玄雷果","龙筋草","太虚花",null,null,230,231,"太玄髓",6,0.18,18,10]
["渡劫",24,5,240,"开天古藤",0.1,0.3,"玄雷果","龙筋草","太虚花",null,null,240,241,"离魄花",6,0.18,18,10]
[null,25,6,250,"避雷藤",0.1,0.3,"升仙丹","归虚花","真阳骨",null,null,250,251,"裂界藤",6,0.18,18,10]
[null,26,6,260,"渡元丹",0.1,0.3,"升仙丹","归虚花","真阳骨",null,null,260,261,"寂灭沙",6,0.18,18,10]
["飞升",27,6,270,"天衍花",{"$f":"1-COUNTA(H28:L28)*G28","v":0.1},0.3,"升仙丹","归虚花","真阳骨",null,null,270,271,"天罡心核",6,0.19,19,10]
[null,28,6,280,"归墟之泪",{"$f":"1-COUNTA(H29:L29)*G29","v":0.05},0.19,"太玄髓","离魄花","裂界藤","寂灭沙","天罡心核",280,281,{"$nulls":4},5]
[null,29,6,290,"寂灭之心",{"$f":"1-COUNTA(H30:L30)*G30","v":0.05},0.19,"太玄髓","离魄花","裂界藤","寂灭沙","天罡心核",290,291,{"$nulls":4},5]
["真仙",30,6,299,"九天露华",{"$f":"1-COUNTA(H31:L31)*G31","v":0.05},0.19,"太玄髓","离魄花","裂界藤","寂灭沙","天罡心核",299,300,{"$nulls":4},5]

{"sheet":"ID分段","index":2,"n_rows":25,"n_cols":6,"rows_kept":25,"cut":false,"hidden":false,"merged":[]}
["Tag","大类","小类","起始ID","结束ID","已使用"]
[1,"资源","货币",1000,1099]
[2,"资源","材料",1100,1199]
[3,"资源","渡劫-选有",1200,1299]
[4,"资源","渡劫-必选",1300,1399]
[5,"资源","经验丹",1400,1499]
[6,"资源","好感度礼物",1500,1599]
[7,"资源","心情礼物",1600,1699]
[8,"资源","神识丹",1700,1799]
[9,"资源","自动转代币",1800,1899]
[]
[]
[11,"法宝","本体",10000,10999]
[12,"法宝","碎片",11000,11999]
[13,"功法","本体",12000,12999]
[14,"功法","碎片",13000,13999]
[]
[21,"道具","任务道具",20000,20999]
[22,"道具","神识道符",21000,21999]
[23,"道具","感悟点",22000,22999]
[24,"道具","广告卡",23000,23099]
[25,"道具","广告卡碎片",23100,23199]
[26,"道具","隐藏链接道具",23200,23299]
[]
[27,"道具","动态道具",23300,23399]

{"sheet":"ItemAssociateConfig","index":3,"n_rows":18,"n_cols":5,"rows_kept":18,"cut":false,"hidden":false,"merged":[]}
["ID","associateID","associateVlaue","LanID"]
["int","int",null,"int"]
[]
["序列号","特殊功能ID\n","特殊功能参数\n","特殊用途描述\n"]
[1,1,"突破丹可用的下限修为等级（包含）；突破丹可用的上限修为等级（不包含）；突破丹增加的概率；突破失败可以降低的修为损耗%",10698,"突破时提升{2}%概率。"]
[2,2,"经验丹增加的修为值",10699,"使用后获得{0}点修为值。"]
[3,3,"功法对应的碎片ID；功法对应的技能组ID;功法分解时获得的碎片数量",-1]
[4,4,"法宝对应的碎片ID；法宝对应的法宝表ID;法宝分解时获得的碎片数量",-1]
[5,5,"心情礼物对应增加的心情值",10702,"赠送给道友，提升{0}点心情值。"]
[6,6,"神识符：提升某个品质的刷新概率;提升的权重百分比（填110意思是将原有权重值×1.1）;多少神识等级可用",-1]
[7,7,"神识符：使用后必定出现哪个PrizeType的事件",-1]
[8,8,"神识丹：使用后可恢复的神识点数",10705,"使用后立即恢复{0}点神识点数。"]
[9,9,"自动转代币：要转的代币ID；要转的代币数量",-1]
[10,10,"广告卡碎片：需要多少个碎片；合成出什么道具ID",-1]
[11,11,"功法碎片：对应的功法本体道具ID",-1]
[12,12,"法宝碎片：对应的法宝本体道具ID",-1]
[13,13,"修为会自动转成玩家经验值",-1]
[14,14,"动态道具：取resourcelevel里面的第几行",-1]