{"text_format":"2","workbook":"xlsx","n_sheets":6,"sheets":["EventConfig","EventLinkConfig","EventConditionConfig","条件类型查询","EventNPC","XianTuLogConfig"],"not_rendered":{"charts":0,"images":0,"macros":0,"external_links":0,"defined_names":4,"comments":0,"pivot_tables":0},"unopened":[],"bounds":{"document_bytes":16777216,"sheet_cells":100000,"run_cost":"one","rows_first":2000,"rows_last":500,"rows_between":2000,"halvings":0,"cell_chars":16384,"cell_head_chars":4096},"cells_cut":0,"cells_raw":0,"read":"whole","date_system":"1900"}

{"sheet":"EventConfig","index":0,"n_rows":99,"n_cols":43,"rows_kept":99,"cut":false,"hidden":false,"merged":[]}
["ID","EventLinksId","EventTriggerType","EventTag","EventType","Score","EventQuality",null,"PrizeIDs","PrizeNums","RefreshProbability","RefreshCount","placeID","XiantuID",null,"EventConditionId","EventValue","EventCount","EventName","Description"]
["int","int[]","int","int","int","int","int",null,"int[]","int[]","int","int","int","int",null,"int","int[]","int","int","int"]
[{"$nulls":23},1,2,3,4,5,6,7,8,9,10,11,12,13,14,15,16,17,18,19,20]
["ID","事件包含的ID","事件类型：\n1.通用事件\n2.挂机事件\n4.主线任务\n5.仙山探险\n6.支线事件\n99.无标记\n","tag\n1主线2支线\n3通用\n4地图通用\n5道友6任务\n7资源","1.正常触发\n2.直接结算","增加进度值","事件品质",null,"事件结局奖励","事件结局奖励数量","刷新的概率\n（100=100%）","最大刷新数量","属于哪张地图","仙途日志ID","触发条件","触发条件类型\n只能配处于什么状态和数值，不能配变化的数值","触发效果值","触发判定数量or次数","任务标题","任务详情界面的总描述","标题","整体描述","总步数","步骤1","步骤2","步骤3","步骤4","步骤5","步骤6","步骤7","步骤8","步骤9","步骤10","步骤11","步骤12","步骤13","步骤14","步骤15","步骤16","步骤17","步骤18","步骤19","步骤20"]
[1,{"$f":"_xlfn.TEXTJOIN(\";\",1,X5:AM5)","v":"1001;1002;1003;1004;1005"},1,3,1,0,1,null,1001,10,null,null,8,4,{"$f":"IF(P5=\"\",\"\",VLOOKUP(P5,条件类型查询!A:B,2,FALSE))","v":"境界判断"},3,5,null,174,1936,"受伤的狼","你发现一只奄奄一息的狼，决定上前一探究竟。",null,1001,1002,1003,1004,1005]
[2,{"$f":"_xlfn.TEXTJOIN(\";\",1,X6:AM6)","v":"1010;1011;1012;1013;1014;1015;1016"},1,3,1,0,1,null,1001,10,null,null,9,4,{"$f":"IF(P6=\"\",\"\",VLOOKUP(P6,条件类型查询!A:B,2,FALSE))","v":""},null,null,null,175,1937,"鹬蚌相争","附近的小树林闹的不可开交，你决定去看看怎么回事。",null,1010,1011,1012,1013,1014,1015,1016]
[3,"1020;1021;1022;1023;1024;1025;1026",99,2,1,10,1,null,1001,10,null,null,10,4,{"$f":"IF(P7=\"\",\"\",VLOOKUP(P7,条件类型查询!A:B,2,FALSE))","v":"拥有特定道具"},1,1004,1,176,1938,"鹬蚌相争2","附近的小树林闹的不可开交，你决定去看看怎么回事。",null,1020,1021,1022,1023,1024,1025,1026]
[null,"",{"$nulls":12},{"$f":"IF(P8=\"\",\"\",VLOOKUP(P8,条件类型查询!A:B,2,FALSE))","v":""}]
[4,"1030",1,1,2,0,1,null,1001,10,null,null,5,3,{"$f":"IF(P9=\"\",\"\",VLOOKUP(P9,条件类型查询!A:B,2,FALSE))","v":"触发概率"},7,500,null,217,1939,"溅血背包","不远处有一个小红点，走近一看你发现是一个带血的背包。",null,1030]
[5,"1040",1,1,2,0,1,null,1001,10,null,null,5,3,{"$f":"IF(P10=\"\",\"\",VLOOKUP(P10,条件类型查询!A:B,2,FALSE))","v":""},null,null,null,218,1940,"废弃矿山","底下一座矿山甚是磅礴雄伟，走，去看一看。",null,1040]
[6,"1050",1,1,2,0,1,null,1001,10,null,null,6,3,{"$f":"IF(P11=\"\",\"\",VLOOKUP(P11,条件类型查询!A:B,2,FALSE))","v":""},null,null,null,219,1941,"吵架声","你被一男一女的吵架声吸引。",null,1050]
[7,"1060",1,1,2,0,1,null,1001,10,null,null,7,3,{"$f":"IF(P12=\"\",\"\",VLOOKUP(P12,条件类型查询!A:B,2,FALSE))","v":""},null,null,null,220,1942,"一座道观","远处一座道观仙气缭绕，似有仙人在此。",null,1060]
[null,"",{"$nulls":12},{"$f":"IF(P13=\"\",\"\",VLOOKUP(P13,条件类型查询!A:B,2,FALSE))","v":""}]
[11,"1101;1102",2,null,1,0,1,null,1001,10,{"$nulls":4},{"$f":"IF(P14=\"\",\"\",VLOOKUP(P14,条件类型查询!A:B,2,FALSE))","v":""},{"$nulls":5},"遇到怪物1-修为",null,{"$f":"COUNTIF(EventLinkConfig!O:O,EventConfig!A14)","v":2},{"$f":"IF($W14>=X$3,$A14*100+X$3,\"\")","v":1101},1102,"","","","","","","","","",""]
[12,"1201;1202;1203",2,null,1,0,1,null,1001,10,{"$nulls":4},{"$f":"IF(P15=\"\",\"\",VLOOKUP(P15,条件类型查询!A:B,2,FALSE))","v":""},{"$nulls":5},"对话-功法灵气",null,{"$f":"COUNTIF(EventLinkConfig!O:O,EventConfig!A15)","v":3},1201,1202,1203,"","","","","","","","",""]
[13,"1301;1302;1303;1304",2,null,1,0,1,null,1001,10,{"$nulls":4},{"$f":"IF(P16=\"\",\"\",VLOOKUP(P16,条件类型查询!A:B,2,FALSE))","v":""},{"$nulls":5},"对话-法宝灵韵",null,{"$f":"COUNTIF(EventLinkConfig!O:O,EventConfig!A16)","v":4},1301,1302,1303,1304,"","","","","","","",""]
[14,"1401;1402",2,null,1,0,1,null,1001,10,{"$nulls":4},{"$f":"IF(P17=\"\",\"\",VLOOKUP(P17,条件类型查询!A:B,2,FALSE))","v":""},{"$nulls":5},"遇到怪物2-修为",null,{"$f":"COUNTIF(EventLinkConfig!O:O,EventConfig!A17)","v":2},1401,1402,"","","","","","","","","",""]
[15,"1501;1502",2,null,1,0,1,null,1001,10,{"$nulls":4},{"$f":"IF(P18=\"\",\"\",VLOOKUP(P18,条件类型查询!A:B,2,FALSE))","v":""},{"$nulls":5},"遇到怪物3-修为",null,{"$f":"COUNTIF(EventLinkConfig!O:O,EventConfig!A18)","v":2},1501,1502,"","","","","","","","","",""]
[null,"",{"$nulls":12},{"$f":"IF(P19=\"\",\"\",VLOOKUP(P19,条件类型查询!A:B,2,FALSE))","v":""}]
[null,"",{"$nulls":12},{"$f":"IF(P20=\"\",\"\",VLOOKUP(P20,条件类型查询!A:B,2,FALSE))","v":""}]
[10001,"1000101;1000102;1000103;1000104",4,1,1,10,1,null,1001,10,null,null,1,1,{"$f":"IF(P21=\"\",\"\",VLOOKUP(P21,条件类型查询!A:B,2,FALSE))","v":""},null,null,null,1906,1914,"鲲鹏何在","神识未灭",{"$f":"COUNTIF(EventLinkConfig!O:O,EventConfig!A21)","v":4},{"$f":"IF($W21>=X$3,$A21*100+X$3,\"\")","v":1000101},1000102,1000103,1000104,"","","","","","","","","","","",""]
[10002,"1000201;1000202;1000203",4,1,1,10,1,null,1001,10,null,null,1,1,{"$f":"IF(P22=\"\",\"\",VLOOKUP(P22,条件类型查询!A:B,2,FALSE))","v":""},null,null,null,1907,1915,"北海迷径1","御剑而行",{"$f":"COUNTIF(EventLinkConfig!O:O,EventConfig!A22)","v":3},1000201,1000202,1000203,"","","","","","","","","","","","",""]
[10003,"1000301;1000302;1000303;1000304;1000305;1000306;1000307;1000308;1000309",4,1,1,10,1,null,1001,10,null,null,1,1,{"$f":"IF(P23=\"\",\"\",VLOOKUP(P23,条件类型查询!A:B,2,FALSE))","v":""},null,null,null,1908,1916,"北海迷径2","雀笑大鹏",{"$f":"COUNTIF(EventLinkConfig!O:O,EventConfig!A23)","v":9},1000301,1000302,1000303,1000304,1000305,1000306,1000307,1000308,1000309,"","","","","","",""]
[10004,"1000401;1000402;1000403;1000404",4,1,1,10,1,null,1001,10,null,null,1,1,{"$f":"IF(P24=\"\",\"\",VLOOKUP(P24,条件类型查询!A:B,2,FALSE))","v":""},null,null,null,1909,1917,"古径阵法","击败结界兽",{"$f":"COUNTIF(EventLinkConfig!O:O,EventConfig!A24)","v":4},1000401,1000402,1000403,1000404,"","","","","","","","","","","",""]
[10005,"1000501;1000502;1000503;1000504;1000505;1000506;1000507;1000508;1000509;1000510;1000511;1000512;1000513;1000514",4,1,1,10,1,null,1001,10,null,null,1,1,{"$f":"IF(P25=\"\",\"\",VLOOKUP(P25,条件类型查询!A:B,2,FALSE))","v":""},null,null,null,2135,2137,"浮空之岛1","初见疯道人",{"$f":"COUNTIF(EventLinkConfig!O:O,EventConfig!A25)","v":14},1000501,1000502,1000503,1000504,1000505,1000506,1000507,1000508,1000509,1000510,1000511,1000512,1000513,1000514,"",""]
[10006,"1000601;1000602;1000603;1000604;1000605;1000606",4,1,1,10,1,null,1001,10,null,null,1,1,{"$f":"IF(P26=\"\",\"\",VLOOKUP(P26,条件类型查询!A:B,2,FALSE))","v":""},null,null,null,2136,2138,"浮空之岛2","筑基中期",{"$f":"COUNTIF(EventLinkConfig!O:O,EventConfig!A26)","v":6},1000601,1000602,1000603,1000604,1000605,1000606,"","","","","","","","","",""]
[10007,"1000701;1000702;1000703;1000704;1000705",4,1,1,10,1,null,1001,10,null,null,1,1,{"$f":"IF(P27=\"\",\"\",VLOOKUP(P27,条件类型查询!A:B,2,FALSE))","v":""},null,null,null,2801,2822,"风中洞府1","击败痴道人",{"$f":"COUNTIF(EventLinkConfig!O:O,EventConfig!A27)","v":5},1000701,1000702,1000703,1000704,1000705,"","","","","","","","","","",""]
[10008,"1000801;1000802;1000803;1000804;1000805;1000806;1000807;1000808;1000809;1000810;1000811;1000812;1000813;1000814",4,1,1,10,1,null,1001,10,null,null,1,1,{"$f":"IF(P28=\"\",\"\",VLOOKUP(P28,条件类型查询!A:B,2,FALSE))","v":""},null,null,null,2802,2823,"风中洞府2","疯痴相聚",{"$f":"COUNTIF(EventLinkConfig!O:O,EventConfig!A28)","v":14},1000801,1000802,1000803,1000804,1000805,1000806,1000807,1000808,1000809,1000810,1000811,1000812,1000813,1000814,"",""]
[10009,"1000901;1000902;1000903",4,1,1,10,1,null,1001,10,null,null,1,1,{"$f":"IF(P29=\"\",\"\",VLOOKUP(P29,条件类型查询!A:B,2,FALSE))","v":""},null,null,null,2803,2824,"风灵之力","筑基后期",{"$f":"COUNTIF(EventLinkConfig!O:O,EventConfig!A29)","v":3},1000901,1000902,1000903,"","","","","","","","","","","","",""]
[10010,"1001001",4,1,1,10,1,null,1001,10,null,null,1,1,{"$f":"IF(P30=\"\",\"\",VLOOKUP(P30,条件类型查询!A:B,2,FALSE))","v":""},null,null,null,2804,2825,"北海深处1","妖兽横行",{"$f":"COUNTIF(EventLinkConfig!O:O,EventConfig!A30)","v":1},1001001,"","","","","","","","","","","","","","",""]
{"$rows_left_out":70}
{"sheet":"EventLinkConfig","index":1,"n_rows":464,"n_cols":37,"rows_kept":464,"cut":false,"hidden":false,"merged":[]}
["ID","conciseEventMessage",null,"EventConditionMessage",null,null,"PreShow","PreShowPar",null,"NPCID",null,"LanID",null,"DialogueType","EventID",null,"ConditionId",null,null,null,"optionType","optionPara1","optionPara2",{"$nulls":6},"PrizeIDs","PrizeNums","ResultType","ResultOptions"]
["int","int",null,"int",null,null,"int","int",null,"int",null,"int[]",null,"int","int",null,"int[]",null,null,null,"int","int[]","int[]",{"$nulls":6},"int[]","int[]","int","int[]"]
[]
["ID","任务列表中的简洁描述","任务列表中的简洁描述","无任务目标时的补充文本","无任务目标时的补充文本",null,"前置表现\n","前置表现参数\n",null,"对话NPCID","NPC","对话","对话1","对话框类型","属于哪个事件","步骤","条件判断类型","任务目标1","任务目标2","条件判断内容","步骤类型\n1=提供选项\n2=进入战斗\n5=自动退出\n3=获得奖励\n4=扣除道具","事件常量1\n1=步骤IDs\n2=战斗ID","事件常量2\n1=事件文本","选择1","选择1\n步骤：填选项文本1\n战斗：填战斗ID","选择1\n步骤1：跳转到哪一步\n不填默认跳转到下一步","选择2","选择2\n步骤：填选项文本2","选择1\n步骤2：跳转到哪一步\n不填默认跳转到下一步","事件结局奖励","事件结局奖励数量","事件结束类型\n1：跳转步骤\n2：根据战斗结果跳转\n3.触发新事件","事件结局后提供的选项\n1.EventLinkId\n2.胜利id;失败id\n3.EventConfigId","1.步骤ID（不填默认为下一个步骤ID）\n2.胜利ID（不填默认为下一个步骤ID）\n3.事件ID（不填默认为下一个事件ID）","语言表最大值"]
[100,{"$nulls":10},216,"你被怪物击败，神识也随之消散了。",null,null,null,{"$f":"_xlfn.TEXTJOIN(\";\",1,R5:S5)","v":""},null,null,{"$f":"IF(R5=\"\",\"\",\"-\"&VLOOKUP(R5,EventConditionConfig!A:C,3,FALSE)&IF(S5=\"\",\"\",CHAR(10)&\"-\"&VLOOKUP(S5,EventConditionConfig!A:C,3,FALSE)))","v":""},{"$nulls":14},{"$f":"IF(A5=\"\",\"\",MAX(B5,D5,L5,X5,AA5))","v":216}]
[101,{"$nulls":10},3011,"你败下阵来，感到头晕目眩，试图努力回忆起刚才发生的事情。(回到主界面重新触发剧情）",null,null,null,{"$f":"_xlfn.TEXTJOIN(\";\",1,R6:S6)","v":""},null,null,{"$f":"IF(R6=\"\",\"\",\"-\"&VLOOKUP(R6,EventConditionConfig!A:C,3,FALSE)&IF(S6=\"\",\"\",CHAR(10)&\"-\"&VLOOKUP(S6,EventConditionConfig!A:C,3,FALSE)))","v":""},{"$nulls":14},{"$f":"IF(A6=\"\",\"\",MAX(B6,D6,L6,X6,AA6))","v":3011}]
[102,{"$nulls":10},3012,"战斗胜利，你的任务进度增加了。",{"$nulls":21},3012]
[{"$nulls":16},"",null,null,{"$f":"IF(R8=\"\",\"\",\"-\"&VLOOKUP(R8,EventConditionConfig!A:C,3,FALSE)&IF(S8=\"\",\"\",CHAR(10)&\"-\"&VLOOKUP(S8,EventConditionConfig!A:C,3,FALSE)))","v":""},{"$nulls":14},""]
[1001,177,{"$nulls":7},2,null,177,"你遇到一只奄奄一息的野狼，从周围四散的血迹来看，想必它刚才经历了一场恶战。",null,null,null,"",null,null,{"$f":"IF(R9=\"\",\"\",\"-\"&VLOOKUP(R9,EventConditionConfig!A:C,3,FALSE)&IF(S9=\"\",\"\",CHAR(10)&\"-\"&VLOOKUP(S9,EventConditionConfig!A:C,3,FALSE)))","v":""},1,"1002;1003","198;199",null,"趁它虚弱赶紧除掉它！",null,null,"你不忍见它受苦，选择帮它减轻痛苦。",{"$nulls":6},177]
[1002,178,{"$nulls":9},178,"野狼用它最后一口气，朝你扑了过来！",null,null,null,"",null,null,{"$f":"IF(R10=\"\",\"\",\"-\"&VLOOKUP(R10,EventConditionConfig!A:C,3,FALSE)&IF(S10=\"\",\"\",CHAR(10)&\"-\"&VLOOKUP(S10,EventConditionConfig!A:C,3,FALSE)))","v":""},2,100001,{"$nulls":9},2,"1004;100",null,178]
[1003,179,{"$nulls":9},179,"你抽出匕首准备了结它的生命，却发现怀中还躺着一只刚出生的狼崽。",null,null,null,"",null,null,{"$f":"IF(R11=\"\",\"\",\"-\"&VLOOKUP(R11,EventConditionConfig!A:C,3,FALSE)&IF(S11=\"\",\"\",CHAR(10)&\"-\"&VLOOKUP(S11,EventConditionConfig!A:C,3,FALSE)))","v":""},1,1005,200,{"$nulls":11},179]
[1004,180,{"$nulls":9},180,"随着你的最后一击，野狼应声倒下，你罔顾它幽怨的眼神，从它怀中拿走了一些财物。",null,null,null,"",null,null,{"$f":"IF(R12=\"\",\"\",\"-\"&VLOOKUP(R12,EventConditionConfig!A:C,3,FALSE)&IF(S12=\"\",\"\",CHAR(10)&\"-\"&VLOOKUP(S12,EventConditionConfig!A:C,3,FALSE)))","v":""},3,{"$nulls":8},1002,100,null,null,null,180]
[1005,181,{"$nulls":9},181,"母狼似乎懂你要做什么，眼神归于平静。你终结了她，决定收养这只小狼仔。",null,null,null,"",null,null,{"$f":"IF(R13=\"\",\"\",\"-\"&VLOOKUP(R13,EventConditionConfig!A:C,3,FALSE)&IF(S13=\"\",\"\",CHAR(10)&\"-\"&VLOOKUP(S13,EventConditionConfig!A:C,3,FALSE)))","v":""},3,{"$nulls":8},1001,50,null,null,null,181]
[{"$nulls":16},"",null,null,{"$f":"IF(R14=\"\",\"\",\"-\"&VLOOKUP(R14,EventConditionConfig!A:C,3,FALSE)&IF(S14=\"\",\"\",CHAR(10)&\"-\"&VLOOKUP(S14,EventConditionConfig!A:C,3,FALSE)))","v":""},{"$nulls":14},""]
[1010,182,{"$nulls":9},182,"从不远处传来刀剑声，听起来双方已经精疲力尽了。",null,null,null,"",null,null,{"$f":"IF(R15=\"\",\"\",\"-\"&VLOOKUP(R15,EventConditionConfig!A:C,3,FALSE)&IF(S15=\"\",\"\",CHAR(10)&\"-\"&VLOOKUP(S15,EventConditionConfig!A:C,3,FALSE)))","v":""},1,"1011;1012","201;202",null,"去看看",null,null,"(需拥有法宝凝神珠）听起来都是鸡毛蒜皮的小摩擦，你选择祭出凝神珠化解他们的怨气。",{"$nulls":6},182]
[1011,183,{"$nulls":9},183,"你走进一看，原来是一伙山贼分赃不均内讧了起来。你看着旁边被砍的七零八落的轿子和这群山贼，选择怎么做呢：",null,null,null,"",null,null,{"$f":"IF(R16=\"\",\"\",\"-\"&VLOOKUP(R16,EventConditionConfig!A:C,3,FALSE)&IF(S16=\"\",\"\",CHAR(10)&\"-\"&VLOOKUP(S16,EventConditionConfig!A:C,3,FALSE)))","v":""},1,"1014;1015","203;204",null,"你顿时杀心四起，决定杀了贼寇，救出轿中之人",null,null,"盗贼们个个双眼杀的通红，你决定来个渔翁得利。",{"$nulls":6},183]
[1012,184,{"$nulls":9},"184;187","法宝现身，效果立竿见影，刀剑声逐渐消失，这个世界安静了。",null,null,null,"",null,null,{"$f":"IF(R17=\"\",\"\",\"-\"&VLOOKUP(R17,EventConditionConfig!A:C,3,FALSE)&IF(S17=\"\",\"\",CHAR(10)&\"-\"&VLOOKUP(S17,EventConditionConfig!A:C,3,FALSE)))","v":""},3,{"$nulls":8},1001,10,null,null,null,184,1,"1001;1"]
[1014,185,{"$nulls":9},185,"你怒斥贼寇的恶行，贼寇们被你激怒了，准备迎战！",null,null,null,"",null,null,{"$f":"IF(R18=\"\",\"\",\"-\"&VLOOKUP(R18,EventConditionConfig!A:C,3,FALSE)&IF(S18=\"\",\"\",CHAR(10)&\"-\"&VLOOKUP(S18,EventConditionConfig!A:C,3,FALSE)))","v":""},2,100002,{"$nulls":9},2,"1016;100",null,185,2,"4;150"]
[1015,186,{"$nulls":9},"186;189","你趁人不备顺走了轿内主人的包裹，任留轿内人痛苦的挣扎。",null,null,null,"",null,null,{"$f":"IF(R19=\"\",\"\",\"-\"&VLOOKUP(R19,EventConditionConfig!A:C,3,FALSE)&IF(S19=\"\",\"\",CHAR(10)&\"-\"&VLOOKUP(S19,EventConditionConfig!A:C,3,FALSE)))","v":""},3,{"$nulls":8},1003,1000,null,null,null,186]
[1016,188,{"$nulls":9},188,"杀退贼寇，你上演了一出英雄救美的桥段。姑娘为了答谢你的救命之恩，将藏在贴身处的珍贵首饰赠与你作为定情信物。",null,null,null,"",null,null,{"$f":"IF(R20=\"\",\"\",\"-\"&VLOOKUP(R20,EventConditionConfig!A:C,3,FALSE)&IF(S20=\"\",\"\",CHAR(10)&\"-\"&VLOOKUP(S20,EventConditionConfig!A:C,3,FALSE)))","v":""},{"$nulls":9},1001,200,null,null,null,188]
[{"$nulls":16},"",null,null,{"$f":"IF(R21=\"\",\"\",\"-\"&VLOOKUP(R21,EventConditionConfig!A:C,3,FALSE)&IF(S21=\"\",\"\",CHAR(10)&\"-\"&VLOOKUP(S21,EventConditionConfig!A:C,3,FALSE)))","v":""},{"$nulls":14},""]
[1020,190,{"$nulls":9},190,"从不远处传来刀剑声，听起来双方已经精疲力尽了。",null,null,null,"",null,null,{"$f":"IF(R22=\"\",\"\",\"-\"&VLOOKUP(R22,EventConditionConfig!A:C,3,FALSE)&IF(S22=\"\",\"\",CHAR(10)&\"-\"&VLOOKUP(S22,EventConditionConfig!A:C,3,FALSE)))","v":""},1,"1021;1022","201;202",null,"去看看",null,null,"使用法宝息事宁人",{"$nulls":6},190]
[1021,191,{"$nulls":9},191,"你走进一看，原来是一伙山贼抢了一名坐在官轿内的女子，因分赃不均内讧了起来。山贼二话不说就朝你冲了过来！",null,null,null,"",null,null,{"$f":"IF(R23=\"\",\"\",\"-\"&VLOOKUP(R23,EventConditionConfig!A:C,3,FALSE)&IF(S23=\"\",\"\",CHAR(10)&\"-\"&VLOOKUP(S23,EventConditionConfig!A:C,3,FALSE)))","v":""},2,100003,{"$nulls":7},1002,100,2,"1026;100",null,191]
[1022,192,{"$nulls":9},192,"法宝现身，效果立竿见影，刀剑声逐渐消失，这个世界安静了。",null,null,null,"",null,null,{"$f":"IF(R24=\"\",\"\",\"-\"&VLOOKUP(R24,EventConditionConfig!A:C,3,FALSE)&IF(S24=\"\",\"\",CHAR(10)&\"-\"&VLOOKUP(S24,EventConditionConfig!A:C,3,FALSE)))","v":""},4,{"$nulls":8},1002,10,null,null,null,192,1,"1001;1"]
[1024,193,{"$nulls":9},"193;196","你大声怒斥贼寇的恶行，贼首发现你了，准备迎战！",null,null,null,"",null,null,{"$f":"IF(R25=\"\",\"\",\"-\"&VLOOKUP(R25,EventConditionConfig!A:C,3,FALSE)&IF(S25=\"\",\"\",CHAR(10)&\"-\"&VLOOKUP(S25,EventConditionConfig!A:C,3,FALSE)))","v":""},2,100004,{"$nulls":7},1004,100,2,"1016;100",null,193,2,"4;150"]
[1025,194,{"$nulls":9},"194;197","你趁人不备顺走了轿内主人的包裹，任留轿内人痛苦的挣扎。",null,null,null,"",null,null,{"$f":"IF(R26=\"\",\"\",\"-\"&VLOOKUP(R26,EventConditionConfig!A:C,3,FALSE)&IF(S26=\"\",\"\",CHAR(10)&\"-\"&VLOOKUP(S26,EventConditionConfig!A:C,3,FALSE)))","v":""},3,{"$nulls":8},1002,1000,null,null,null,194]
[1026,207,{"$nulls":9},207,"你将山贼们打的落花流水，成功吸引了山贼头子的注意。",null,null,null,"",null,null,{"$f":"IF(R27=\"\",\"\",\"-\"&VLOOKUP(R27,EventConditionConfig!A:C,3,FALSE)&IF(S27=\"\",\"\",CHAR(10)&\"-\"&VLOOKUP(S27,EventConditionConfig!A:C,3,FALSE)))","v":""},1,"1024;1025","205;206",null,"选择正面迎战山贼头领（困难）",null,null,"你决定避开山贼头领的视线，来个渔翁得利。",{"$nulls":6},207]
[{"$nulls":16},"",null,null,{"$f":"IF(R28=\"\",\"\",\"-\"&VLOOKUP(R28,EventConditionConfig!A:C,3,FALSE)&IF(S28=\"\",\"\",CHAR(10)&\"-\"&VLOOKUP(S28,EventConditionConfig!A:C,3,FALSE)))","v":""},{"$nulls":14},""]
[1030,221,{"$nulls":9},221,"发现一个血迹斑斑的背包，好像刚刚发生了战斗，我翻翻背包...",null,null,null,"",null,null,{"$f":"IF(R29=\"\",\"\",\"-\"&VLOOKUP(R29,EventConditionConfig!A:C,3,FALSE)&IF(S29=\"\",\"\",CHAR(10)&\"-\"&VLOOKUP(S29,EventConditionConfig!A:C,3,FALSE)))","v":""},3,{"$nulls":8},1002,10,null,null,null,221]
[{"$nulls":16},"",null,null,{"$f":"IF(R30=\"\",\"\",\"-\"&VLOOKUP(R30,EventConditionConfig!A:C,3,FALSE)&IF(S30=\"\",\"\",CHAR(10)&\"-\"&VLOOKUP(S30,EventConditionConfig!A:C,3,FALSE)))","v":""},{"$nulls":14},""]
{"$rows_left_out":435}
{"sheet":"EventConditionConfig","index":2,"n_rows":23,"n_cols":12,"rows_kept":23,"cut":false,"hidden":false,"merged":[]}
["ID","message",null,null,"Operation",null,"ConditionType","ConditionPara","finishCount","RelatedEvents"]
["int","int",null,null,"int",null,"int","int[]","int","int[]"]
[]
["ID","描述",null,null,"与0\n或1",null,"条件判断类型","条件判断值","条件完成次数or数量","关联的事件Id","提示","跳转"]
[1,2078,"拥有金币",{"$f":"CONCATENATE(\"- \",C5,\"{0}/{1}\")","v":"- 拥有金币{0}/{1}"},null,null,1,1001,10]
[2,2079,"达到境界：筑基-中期",{"$f":"CONCATENATE(\"- \",C6,\"{0}/{1}\")","v":"- 达到境界：筑基-中期{0}/{1}"},null,null,3,11,1]
[3,2080,"击杀魔休","- 击杀魔休{0}/{1}",null,null,5,1001,5,9031]
[4,2081,"获得钻石","- 获得钻石{0}/{1}",null,null,6,1002,10]
[5,2082,"使用神识","- 使用神识{0}/{1}",null,null,8,null,1]
[6,2094,"继续飞行一段时间","- 继续飞行一段时间{0}/{1}",null,null,9,null,6]
[7,2843,"击败结界兽","- 击败结界兽{0}/{1}",null,null,5,1002,1]
[8,2844,"达到境界：筑基-后期","- 达到境界：筑基-后期{0}/{1}",null,null,3,21,1]
[9,2845,"击杀妖兽","- 击杀妖兽{0}/{1}",null,null,5,1003,1,30003]
[10,2846,"击败后山小妖","- 击败后山小妖{0}/{1}",null,null,5,1004,3,30004]
[11,2847,"收集灵草种子","- 收集灵草种子{0}/{1}",null,null,6,20003,3,30011]
[12,2848,"击败夜袭的妖兽","- 击败夜袭的妖兽{0}/{1}",null,null,5,1005,1,30005]
[13,2849,"击败峰顶的妖王","- 击败峰顶的妖王{0}/{1}",null,null,5,1006,1,30006]
[14,2850,"境界达到[金丹-前期]","- 境界达到[金丹-前期]{0}/{1}",null,null,3,31,1]
[15,2851,"击败仙山的阵眼妖兽","- 击败仙山的阵眼妖兽{0}/{1}",null,null,5,1007,1,30007]
[17,2852,"击杀灵兽获得天肥",{"$f":"CONCATENATE(\"- \",C20,\"{0}/{1}\")","v":"- 击杀灵兽获得天肥{0}/{1}"},null,null,5,1008,1,30008]
[18,2853,"获得一件袈裟","- 获得一件袈裟{0}/{1}",null,null,6,1301,1,30009]
[19,2854,"夺回琉璃盏","- 夺回琉璃盏{0}/{1}",null,null,6,1001,1,30010]
[20,2855,"给予渡劫丹","- 给予渡劫丹{0}/{1}",null,null,1,1001,1]

{"sheet":"条件类型查询","index":3,"n_rows":10,"n_cols":7,"rows_kept":10,"cut":false,"hidden":false,"merged":[]}
["ID","条件判断类型","条件判断值","条件完成次数or数量","额外文本","不可用","是否可用于事件"]
[1,"拥有特定道具","道具ID","数量≥","检测背包道具",null,1]
[2,"灵根判定","哪个灵根","灵根值≥",null,1]
[3,"境界判断","境界id",null,null,null,1]
[5,"战斗胜利","战斗组ID","胜利次数≥"]
[6,"获得道具","道具的ID","数量≥","探测出事件才开始检测"]
[7,"触发概率","概率值 1000=100%",null,null,null,1]
[8,"使用神识",null,"数量≥"]
[9,"游戏在线多少时长（秒）",null,"时间≥（秒）",null,null,1]
[10,"前置事件","事件ID",null,null,null,1]

{"sheet":"EventNPC","index":4,"n_rows":31,"n_cols":5,"rows_kept":31,"cut":false,"hidden":false,"merged":[]}
["ID","name","ID","DaoyouID"]
["int","int","int","int"]
[]
["ID","名字","半身像icon","道友ID","名称"]
[1,null,null,null,"玩家"]
[2,null,null,1,"道友1"]
[3,null,null,2,"道友2"]
[4,null,null,3,"道友3"]
[5,null,null,4,"道友4"]
[6,null,null,5,"道友5"]
[7,null,null,6,"道友6"]
[8,null,null,7,"道友7"]
[9,null,null,8,"道友8"]
[10,null,null,9,"道友9"]
[11,null,null,10,"道友10"]
[]
[100,3000,null,null,"玩家"]
[101,3001,null,null,"蜩鸟"]
[102,3002,null,null,"小麻雀"]
[103,3003,null,null,"疯道人"]
[104,3004,null,null,"痴道人"]
[105,3005,null,null,"尧帝"]
[106,3006,null,null,"许由"]
[107,3007,null,null,"村名甲"]
[108,3008,null,null,"村名乙"]
[109,3009,null,null,"村名丙"]
[110,3010,null,null,"樗木之灵"]
[111,null,null,null,"惠子"]
[112,3021,null,null,"风无咎"]
[113,3034,null,null,"北海剑妖"]
{"$rows_left_out":2}
{"sheet":"XianTuLogConfig","index":5,"n_rows":8,"n_cols":7,"rows_kept":8,"cut":false,"hidden":false,"merged":[]}
["ID","EventType","Title","Desc","BigMapID"]
["int","int","int","int","int"]
[]
["ID","1主线\n2事件","名称","描述","属于哪个章节"]
[1,1,2087,2089,1,"第一章.逍遥游","多次渡劫失败的你，误入“无何有之乡”，在这里受到了列子的指引，踏上了寻找七道心境的修仙之路。"]
[2,2,2088,2090,1,"无用的大葫芦","惠子种出了巨大葫芦，他觉得毫无用处，非常生气！"]
[3,2,2088,2090,2,"无用的大葫芦","惠子种出了巨大葫芦，他觉得毫无用处，非常生气！"]
[4,2,2088,2090,3,"无用的大葫芦","惠子种出了巨大葫芦，他觉得毫无用处，非常生气！"]