{"text_format":"2","workbook":"xlsx","n_sheets":8,"sheets":["DaoyouModelConfig","emotionConfig","daolvSkill","guajibuff","道友加成辅助","DaoyouLevelupConfig","DaoyouGiftConfig","DaoyouguajiResourcLevel"],"not_rendered":{"charts":0,"images":0,"macros":0,"external_links":2,"defined_names":1,"comments":0,"pivot_tables":0},"unopened":[],"bounds":{"document_bytes":16777216,"sheet_cells":100000,"run_cost":"one","rows_first":2000,"rows_last":500,"rows_between":2000,"halvings":0,"cell_chars":16384,"cell_head_chars":4096},"cells_cut":0,"cells_raw":0,"read":"whole","date_system":"1900"}

{"sheet":"DaoyouModelConfig","index":0,"n_rows":14,"n_cols":32,"rows_kept":14,"cut":false,"hidden":false,"merged":[]}
["ID","name",null,"quality","bodyIcon","headIcon","growupRate","des","desUnlockLv",{"$nulls":4},"PreferGiftID","shownPreferGiftID",{"$nulls":4},"guajiBuffID",{"$nulls":4},"daolvSkillID",null,"EmotionLvforQuest","QuestID",null,"EmotionLvforspecialGift","specialGiftID","specialGiftNum"]
["int","int",null,"int","string","string","int","int[]","int[]",{"$nulls":4},"int[]","int[]",{"$nulls":4},"int[]",{"$nulls":4},"int[]",null,"int","int",null,"int[]","int[]","int[]"]
[]
["ID","名称","名称","道友品质","半身像","头像","潜力\n80=80%\n等级差","介绍","介绍解锁相熟等级",{"$nulls":4},"喜好的礼物ID","默认显示的礼物ID","喜好礼物1","喜好礼物2","喜好礼物3",null,"挂机增益类型","产出概率","产出类型1","产出类型2",null,"成为道侣后提供的技能ID",null,"触发道侣任务的好感度等级","道侣任务ID",null,"特殊奖励好感度等级","特殊奖励ID","特殊奖励数量"]
[1,1953,"道友1",2,null,null,60,{"$f":"_xlfn.TEXTJOIN(\";\",1,J5:L5)","v":"1963;1964;1965"},"1;3;6",1963,1964,1965,null,{"$f":"_xlfn.TEXTJOIN(\";\",1,P5:R5)","v":"1201;1202;1203"},{"$f":"P5","v":1201},1201,1202,1203,null,{"$f":"_xlfn.TEXTJOIN(\";\",1,U5:W5)","v":"1;11;22"},1,11,22,null,1,null,2,9003,null,3,10002,1]
[2,1954,"道友2",2,null,null,60,{"$f":"_xlfn.TEXTJOIN(\";\",1,J6:L6)","v":"1966;1967;1968"},"1;3;6",1966,1967,1968,null,{"$f":"_xlfn.TEXTJOIN(\";\",1,P6:R6)","v":"1204;1205;1206"},{"$f":"P6","v":1204},1204,1205,1206,null,{"$f":"_xlfn.TEXTJOIN(\";\",1,U6:W6)","v":"1;21;32"},1,21,32,null,2,null,2,9002,null,4,10003,1]
[3,1955,"道友3",2,null,null,60,"1969;1970;1971","1;3;6",1969,1970,1971,null,"1207;1208;1209",1207,1207,1208,1209,null,"1;31;42",1,31,42,null,3,null,2,9001,null,5,10004,1]
[4,1956,"道友4",3,null,null,80,"1972;1973;1974","1;3;6",1972,1973,1974,null,"1301;1302;1303",1301,1301,1302,1303,null,"2;41;12",2,41,12,null,4,null,3,9002,null,4,10005,1]
[5,1957,"道友5",3,null,null,80,"1975;1976;1977","1;3;6",1975,1976,1977,null,"1401;1402;1403",1401,1401,1402,1403,null,"2;12;33",2,12,33,null,5,null,3,9001,null,5,10006,1]
[6,1958,"道友6",3,null,null,80,"1978;1979;1980","1;3;6",1978,1979,1980,null,"1201;1202;1203",1201,1201,1202,1203,null,"2;22;43",2,22,43,null,6,null,3,9002,null,6,10007,1]
[7,1959,"道友7",4,null,null,100,"1981;1982;1983","1;3;6",1981,1982,1983,null,"1204;1205;1206",1204,1204,1205,1206,null,"3;32;13",3,32,13,null,7,null,4,9001,null,5,10008,1]
[8,1960,"道友8",4,null,null,100,"1984;1985;1986","1;3;6",1984,1985,1986,null,"1207;1208;1209",1207,1207,1208,1209,null,"3;42;23",3,42,23,null,8,null,4,9002,null,6,10009,1]
[9,1961,"道友9",5,null,null,110,"1987;1988;1989","1;3;6",1987,1988,1989,null,"1301;1302;1303",1301,1301,1302,1303,null,"4;13;34",4,13,34,null,1,null,5,9001,null,7,10010,1]
[10,1962,"道友10",6,null,null,120,"1990;1991;1992","1;3;6",1990,1991,1992,null,"1401;1402;1403",1401,1401,1402,1403,null,"4;23;44",4,23,44,null,2,null,6,9002,null,8,10011,1]

{"sheet":"emotionConfig","index":1,"n_rows":7,"n_cols":7,"rows_kept":7,"cut":false,"hidden":false,"merged":[]}
["ID","type","icon","des",null,"hanganUpRate"]
["int","int","string","int",null,"int[]"]
[]
["ID","类型\n1=好心情\n2=平衡心情\n3=坏心情","icon","描述ID","描述（策划）","心情影响好感度的范围\n100=10%"]
[1,1,null,2043,"心情很好，送他礼物可获得更多好感度","1100;1300","开心"]
[2,2,null,2044,"心情一般","900;1100","一般"]
[3,3,null,2045,"心情失落，送他礼物获得低于标准值的好感度","700;900","失落"]

{"sheet":"daolvSkill","index":2,"n_rows":44,"n_cols":11,"rows_kept":44,"cut":false,"hidden":false,"merged":[]}
["ID","AttrID","lv","name",null,"des",null,"para","type"]
["int","int","int","int",null,"int",null,"int[]","int"]
[]
["ID","对应AttributeConfig中的ID","等级","名称","名称","描述","描述","参数","类型\n1=唯一\n2=叠加","成长所需礼物ID","每单位增加的值"]
[1,101,1,2046,"生命增幅",2054,"玩家生命+{0}%",3,2]
[2,101,2,2046,"生命增幅",2054,"玩家生命+{0}%",6,2]
[3,101,3,2046,"生命增幅",2054,"玩家生命+{0}%",9,2]
[4,101,4,2046,"生命增幅",2054,"玩家生命+{0}%",12,2]
[5,101,5,2046,"生命增幅",2054,"玩家生命+{0}%",15,2]
[6,102,{"$f":"C5","v":1},2047,"攻击增幅",2055,"玩家攻击+{0}%",3,2]
[7,102,{"$f":"C6","v":2},2047,"攻击增幅",2055,"玩家攻击+{0}%",6,2]
[8,102,3,2047,"攻击增幅",2055,"玩家攻击+{0}%",9,2]
[9,102,4,2047,"攻击增幅",2055,"玩家攻击+{0}%",12,2]
[10,102,5,2047,"攻击增幅",2055,"玩家攻击+{0}%",15,2]
[11,103,1,2048,"防御增幅",2056,"玩家防御+{0}%",3,2]
[12,103,2,2048,"防御增幅",2056,"玩家防御+{0}%",6,2]
[13,103,3,2048,"防御增幅",2056,"玩家防御+{0}%",9,2]
[14,103,4,2048,"防御增幅",2056,"玩家防御+{0}%",12,2]
[15,103,5,2048,"防御增幅",2056,"玩家防御+{0}%",15,2]
[16,106,1,2049,"金之灵根",2057,"玩家金灵根+{0}",2,1]
[17,106,2,2049,"金之灵根",2057,"玩家金灵根+{0}",4,1]
[18,106,3,2049,"金之灵根",2057,"玩家金灵根+{0}",6,1]
[19,106,4,2049,"金之灵根",2057,"玩家金灵根+{0}",8,1]
[20,106,5,2049,"金之灵根",2057,"玩家金灵根+{0}",10,1]
[21,107,1,2050,"水之灵根",2058,"玩家水灵根+{0}",2,1]
[22,107,2,2050,"水之灵根",2058,"玩家水灵根+{0}",4,1]
[23,107,3,2050,"水之灵根",2058,"玩家水灵根+{0}",6,1]
[24,107,4,2050,"水之灵根",2058,"玩家水灵根+{0}",8,1]
[25,107,5,2050,"水之灵根",2058,"玩家水灵根+{0}",10,1]
[26,108,1,2051,"木之灵根",2059,"玩家木灵根+{0}",2,1]
[27,108,2,2051,"木之灵根",2059,"玩家木灵根+{0}",4,1]
[28,108,3,2051,"木之灵根",2059,"玩家木灵根+{0}",6,1]
[29,108,4,2051,"木之灵根",2059,"玩家木灵根+{0}",8,1]
[30,108,5,2051,"木之灵根",2059,"玩家木灵根+{0}",10,1]
[31,109,1,2052,"火之灵根",2060,"玩家火灵根+{0}",2,1]
[32,109,2,2052,"火之灵根",2060,"玩家火灵根+{0}",4,1]
[33,109,3,2052,"火之灵根",2060,"玩家火灵根+{0}",6,1]
[34,109,4,2052,"火之灵根",2060,"玩家火灵根+{0}",8,1]
[35,109,5,2052,"火之灵根",2060,"玩家火灵根+{0}",10,1]
[36,110,1,2053,"土之灵根",2061,"玩家土灵根+{0}",2,1]
{"$rows_left_out":5}
{"sheet":"guajibuff","index":3,"n_rows":28,"n_cols":8,"rows_kept":28,"cut":false,"hidden":false,"merged":[]}
["ID","name",null,"Quality","GivingRate","paraValue","des"]
["int","int",null,"int","int","int","int"]
[]
["ID","名称","名称","品质","产出比例\n100=100%","对应的para值","描述","说明"]
[1,2063,"慷概之心·小",1,25,5,2062,"这位道友离开时有{0}%概率赠与玩家奖励"]
[2,2064,"慷概之心·中",1,50,5,2062,"这位道友离开时有{0}%概率赠与玩家奖励"]
[3,2065,"慷概之心·大",1,75,5,2062,"这位道友离开时有{0}%概率赠与玩家奖励"]
[4,2066,"慷概之心·极",1,100,5,2062,"这位道友离开时有{0}%概率赠与玩家奖励"]
[]
[11,1993,"双修之旅·小",2,25,1,{"$f":"B10+16","v":2009},"这位道友离开时会给与玩家少量修为奖励"]
[12,1994,"双修之旅·中",3,50,1,{"$f":"B11+16","v":2010},"这位道友离开时会给与玩家一些修为奖励"]
[13,1995,"双修之旅·大",4,75,1,2011,"这位道友离开时会给与玩家很多修为奖励"]
[14,1996,"双修之旅·极",5,100,1,2012,"这位道友离开时会给与玩家丰厚修为奖励"]
[]
[21,{"$f":"B10+4","v":1997},"商贾之道·小",2,25,2,{"$f":"B15+16","v":2013},"这位道友离开时会给与玩家少量铜钱奖励"]
[22,{"$f":"B11+4","v":1998},"商贾之道·中",3,50,2,{"$f":"B16+16","v":2014},"这位道友离开时会给与玩家一些铜钱奖励"]
[23,1999,"商贾之道·大",4,75,2,2015,"这位道友离开时会给与玩家很多铜钱奖励"]
[24,2000,"商贾之道·极",5,100,2,2016,"这位道友离开时会给与玩家丰厚铜钱奖励"]
[]
[31,{"$f":"B15+4","v":2001},"席地论法·小",2,25,3,{"$f":"B20+16","v":2017},"这位道友离开时会给与玩家少量功法灵气奖励"]
[32,{"$f":"B16+4","v":2002},"席地论法·中",3,50,3,{"$f":"B21+16","v":2018},"这位道友离开时会给与玩家一些功法灵气奖励"]
[33,2003,"席地论法·大",4,75,3,2019,"这位道友离开时会给与玩家很多功法灵气奖励"]
[34,2004,"席地论法·极",5,100,3,2020,"这位道友离开时会给与玩家丰厚功法灵气奖励"]
[]
[41,{"$f":"B20+4","v":2005},"坎山寻宝·小",2,25,4,{"$f":"B25+16","v":2021},"这位道友离开时会给与玩家少量法宝灵韵奖励"]
[42,{"$f":"B21+4","v":2006},"坎山寻宝·中",3,50,4,{"$f":"B26+16","v":2022},"这位道友离开时会给与玩家一些法宝灵韵奖励"]
[43,2007,"坎山寻宝·大",4,75,4,2023,"这位道友离开时会给与玩家很多法宝灵韵奖励"]
[44,2008,"坎山寻宝·极",5,100,4,2024,"这位道友离开时会给与玩家丰厚法宝灵韵奖励"]

{"sheet":"道友加成辅助","index":4,"n_rows":14,"n_cols":3,"rows_kept":14,"cut":false,"hidden":false,"merged":[]}
["BuffType",null,"BuffValue"]
[1,"属性加成","属性ID；加成数值"]
[2]
[3]
[4]
[5]
[6]
[7]
[8]
[9]
[10]
[11]
[12]
[13]

{"sheet":"DaoyouLevelupConfig","index":5,"n_rows":14,"n_cols":7,"rows_kept":14,"cut":false,"hidden":false,"merged":[]}
["ID","name",null,"exp","prizeID","prizeNum","guajiGrowup"]
["int","int",null,"int","int[]","int[]","int"]
[]
["LV","名称",null,"升级所需经验","道具奖励ID","道具奖励数量","挂机增益成长率\n100=100%"]
[1,2025,"好感度1",10,-1,-1,0]
[2,2026,"好感度2",20,1002,1,100]
[3,2027,"好感度3",30,1002,1,112]
[4,2028,"好感度4",40,1002,1,125]
[5,2029,"好感度5",50,1002,1,137]
[6,2030,"好感度6",60,1002,1,150]
[7,2031,"好感度7",70,1002,1,162]
[8,2032,"好感度8",80,1002,1,175]
[9,2033,"好感度9",90,1002,1,187]
[10,2034,"好感度10",-1,1002,1,200]

{"sheet":"DaoyouGiftConfig","index":6,"n_rows":67,"n_cols":4,"rows_kept":67,"cut":false,"hidden":false,"merged":[]}
["ID","ItemID",null,"emotionValue"]
["int","int",null,"int"]
[]
["ID","道具ID","道具名称","默认增加的好感度值"]
[1,1201,{"$f":"VLOOKUP(B5,[1]ItemConfig!$A:$C,3,FALSE)","v":"渡劫丹-A1"},10]
[2,1202,{"$f":"VLOOKUP(B6,[1]ItemConfig!$A:$C,3,FALSE)","v":"渡劫丹-A2"},20]
[3,1203,{"$f":"VLOOKUP(B7,[1]ItemConfig!$A:$C,3,FALSE)","v":"渡劫丹-A3"},30]
[4,1204,{"$f":"VLOOKUP(B8,[1]ItemConfig!$A:$C,3,FALSE)","v":"渡劫丹-B1"},10]
[5,1205,{"$f":"VLOOKUP(B9,[1]ItemConfig!$A:$C,3,FALSE)","v":"渡劫丹-B2"},20]
[6,1206,{"$f":"VLOOKUP(B10,[1]ItemConfig!$A:$C,3,FALSE)","v":"渡劫丹-B3"},30]
[7,1207,{"$f":"VLOOKUP(B11,[1]ItemConfig!$A:$C,3,FALSE)","v":"渡劫丹-C1"},10]
[8,1208,{"$f":"VLOOKUP(B12,[1]ItemConfig!$A:$C,3,FALSE)","v":"渡劫丹-C2"},20]
[9,1209,{"$f":"VLOOKUP(B13,[1]ItemConfig!$A:$C,3,FALSE)","v":"渡劫丹-C3"},30]
[10,1301,{"$f":"VLOOKUP(B14,[1]ItemConfig!$A:$C,3,FALSE)","v":"天材地宝1"},10]
[11,1302,{"$f":"VLOOKUP(B15,[1]ItemConfig!$A:$C,3,FALSE)","v":"天材地宝2"},15]
[12,1303,{"$f":"VLOOKUP(B16,[1]ItemConfig!$A:$C,3,FALSE)","v":"天材地宝3"},20]
[13,1304,{"$f":"VLOOKUP(B17,[1]ItemConfig!$A:$C,3,FALSE)","v":"天材地宝4"},25]
[14,1401,{"$f":"VLOOKUP(B18,[1]ItemConfig!$A:$C,3,FALSE)","v":"修为丹·下"},10]
[15,1402,{"$f":"VLOOKUP(B19,[1]ItemConfig!$A:$C,3,FALSE)","v":"修为丹·中"},15]
[16,1403,{"$f":"VLOOKUP(B20,[1]ItemConfig!$A:$C,3,FALSE)","v":"修为丹·上"},20]
[17,1404,{"$f":"VLOOKUP(B21,[1]ItemConfig!$A:$C,3,FALSE)","v":"修为丹·极"},30]
[18,1501,{"$f":"VLOOKUP(B22,[1]ItemConfig!$A:$C,3,FALSE)","v":"好感度礼物1"},50]
[19,1502,{"$f":"VLOOKUP(B23,[1]ItemConfig!$A:$C,3,FALSE)","v":"好感度礼物2"},100]
[20,11001,{"$f":"VLOOKUP(B24,[1]ItemConfig!$A:$C,3,FALSE)","v":"神龙鼎碎片"},20]
[21,11002,{"$f":"VLOOKUP(B25,[1]ItemConfig!$A:$C,3,FALSE)","v":"破天斧碎片"},20]
[22,11003,{"$f":"VLOOKUP(B26,[1]ItemConfig!$A:$C,3,FALSE)","v":"翡翠葫芦碎片"},20]
[23,11004,{"$f":"VLOOKUP(B27,[1]ItemConfig!$A:$C,3,FALSE)","v":"混沌珠碎片"},20]
[24,11005,{"$f":"VLOOKUP(B28,[1]ItemConfig!$A:$C,3,FALSE)","v":"琉璃宝塔碎片"},20]
[25,11006,{"$f":"VLOOKUP(B29,[1]ItemConfig!$A:$C,3,FALSE)","v":"九幽镇魂瓶碎片"},20]
[26,11007,{"$f":"VLOOKUP(B30,[1]ItemConfig!$A:$C,3,FALSE)","v":"玉莲守心灯碎片"},20]
[27,11008,{"$f":"VLOOKUP(B31,[1]ItemConfig!$A:$C,3,FALSE)","v":"融灵塔碎片"},20]
[28,11009,{"$f":"VLOOKUP(B32,[1]ItemConfig!$A:$C,3,FALSE)","v":"禁元珠碎片"},20]
[29,11010,{"$f":"VLOOKUP(B33,[1]ItemConfig!$A:$C,3,FALSE)","v":"玄龟盾碎片"},20]
[30,11011,{"$f":"VLOOKUP(B34,[1]ItemConfig!$A:$C,3,FALSE)","v":"天殇血刃剑碎片"},20]
[31,13001,{"$f":"VLOOKUP(B35,[1]ItemConfig!$A:$C,3,FALSE)","v":"太虚幻剑经碎片"},20]
[32,13002,{"$f":"VLOOKUP(B36,[1]ItemConfig!$A:$C,3,FALSE)","v":"天罡剑气诀碎片"},20]
[33,13003,{"$f":"VLOOKUP(B37,[1]ItemConfig!$A:$C,3,FALSE)","v":"血刃金煌功碎片"},20]
[34,13004,{"$f":"VLOOKUP(B38,[1]ItemConfig!$A:$C,3,FALSE)","v":"飞刃碎片"},20]
[35,13005,{"$f":"VLOOKUP(B39,[1]ItemConfig!$A:$C,3,FALSE)","v":"金针碎片"},20]
[36,13006,{"$f":"VLOOKUP(B40,[1]ItemConfig!$A:$C,3,FALSE)","v":"碧落幽冥劲碎片"},20]
{"$rows_left_out":28}
{"sheet":"DaoyouguajiResourcLevel","index":7,"n_rows":304,"n_cols":6,"rows_kept":304,"cut":false,"hidden":false,"merged":[]}
["ID","para1","para2","para3","para4","para5"]
["int","int","int","int","int","int"]
[]
["ID","玩家修为产出","铜钱产出","功法灵气","法宝灵韵","赠与概率"]
[1,{"$f":"ROUND([2]ResourceLevelConfig!$E5*0.05,0)","v":50},{"$f":"ROUND([2]ResourceLevelConfig!$C5*0.05,0)","v":50},{"$f":"ROUND([2]ResourceLevelConfig!$G5*0.05,0)","v":50},{"$f":"ROUND([2]ResourceLevelConfig!$H5*0.05,0)","v":50},201]
[2,{"$f":"ROUND([2]ResourceLevelConfig!$E6*0.05,0)","v":51},{"$f":"ROUND([2]ResourceLevelConfig!$C6*0.05,0)","v":51},{"$f":"ROUND([2]ResourceLevelConfig!$G6*0.05,0)","v":51},{"$f":"ROUND([2]ResourceLevelConfig!$H6*0.05,0)","v":51},202]
[3,{"$f":"ROUND([2]ResourceLevelConfig!$E7*0.05,0)","v":51},{"$f":"ROUND([2]ResourceLevelConfig!$C7*0.05,0)","v":51},{"$f":"ROUND([2]ResourceLevelConfig!$G7*0.05,0)","v":51},{"$f":"ROUND([2]ResourceLevelConfig!$H7*0.05,0)","v":51},203]
[4,{"$f":"ROUND([2]ResourceLevelConfig!$E8*0.05,0)","v":52},{"$f":"ROUND([2]ResourceLevelConfig!$C8*0.05,0)","v":52},{"$f":"ROUND([2]ResourceLevelConfig!$G8*0.05,0)","v":52},{"$f":"ROUND([2]ResourceLevelConfig!$H8*0.05,0)","v":52},204]
[5,{"$f":"ROUND([2]ResourceLevelConfig!$E9*0.05,0)","v":52},{"$f":"ROUND([2]ResourceLevelConfig!$C9*0.05,0)","v":52},{"$f":"ROUND([2]ResourceLevelConfig!$G9*0.05,0)","v":52},{"$f":"ROUND([2]ResourceLevelConfig!$H9*0.05,0)","v":52},205]
[6,{"$f":"ROUND([2]ResourceLevelConfig!$E10*0.05,0)","v":53},{"$f":"ROUND([2]ResourceLevelConfig!$C10*0.05,0)","v":53},{"$f":"ROUND([2]ResourceLevelConfig!$G10*0.05,0)","v":53},{"$f":"ROUND([2]ResourceLevelConfig!$H10*0.05,0)","v":53},206]
[7,{"$f":"ROUND([2]ResourceLevelConfig!$E11*0.05,0)","v":53},{"$f":"ROUND([2]ResourceLevelConfig!$C11*0.05,0)","v":53},{"$f":"ROUND([2]ResourceLevelConfig!$G11*0.05,0)","v":53},{"$f":"ROUND([2]ResourceLevelConfig!$H11*0.05,0)","v":53},207]
[8,{"$f":"ROUND([2]ResourceLevelConfig!$E12*0.05,0)","v":54},{"$f":"ROUND([2]ResourceLevelConfig!$C12*0.05,0)","v":54},{"$f":"ROUND([2]ResourceLevelConfig!$G12*0.05,0)","v":54},{"$f":"ROUND([2]ResourceLevelConfig!$H12*0.05,0)","v":54},208]
[9,{"$f":"ROUND([2]ResourceLevelConfig!$E13*0.05,0)","v":54},{"$f":"ROUND([2]ResourceLevelConfig!$C13*0.05,0)","v":54},{"$f":"ROUND([2]ResourceLevelConfig!$G13*0.05,0)","v":54},{"$f":"ROUND([2]ResourceLevelConfig!$H13*0.05,0)","v":54},209]
[10,{"$f":"ROUND([2]ResourceLevelConfig!$E14*0.05,0)","v":55},{"$f":"ROUND([2]ResourceLevelConfig!$C14*0.05,0)","v":55},{"$f":"ROUND([2]ResourceLevelConfig!$G14*0.05,0)","v":55},{"$f":"ROUND([2]ResourceLevelConfig!$H14*0.05,0)","v":55},210]
[11,{"$f":"ROUND([2]ResourceLevelConfig!$E15*0.05,0)","v":55},{"$f":"ROUND([2]ResourceLevelConfig!$C15*0.05,0)","v":55},{"$f":"ROUND([2]ResourceLevelConfig!$G15*0.05,0)","v":55},{"$f":"ROUND([2]ResourceLevelConfig!$H15*0.05,0)","v":55},211]
[12,{"$f":"ROUND([2]ResourceLevelConfig!$E16*0.05,0)","v":56},{"$f":"ROUND([2]ResourceLevelConfig!$C16*0.05,0)","v":56},{"$f":"ROUND([2]ResourceLevelConfig!$G16*0.05,0)","v":56},{"$f":"ROUND([2]ResourceLevelConfig!$H16*0.05,0)","v":56},212]
[13,{"$f":"ROUND([2]ResourceLevelConfig!$E17*0.05,0)","v":56},{"$f":"ROUND([2]ResourceLevelConfig!$C17*0.05,0)","v":56},{"$f":"ROUND([2]ResourceLevelConfig!$G17*0.05,0)","v":56},{"$f":"ROUND([2]ResourceLevelConfig!$H17*0.05,0)","v":56},213]
[14,{"$f":"ROUND([2]ResourceLevelConfig!$E18*0.05,0)","v":57},{"$f":"ROUND([2]ResourceLevelConfig!$C18*0.05,0)","v":57},{"$f":"ROUND([2]ResourceLevelConfig!$G18*0.05,0)","v":57},{"$f":"ROUND([2]ResourceLevelConfig!$H18*0.05,0)","v":57},214]
[15,{"$f":"ROUND([2]ResourceLevelConfig!$E19*0.05,0)","v":57},{"$f":"ROUND([2]ResourceLevelConfig!$C19*0.05,0)","v":57},{"$f":"ROUND([2]ResourceLevelConfig!$G19*0.05,0)","v":57},{"$f":"ROUND([2]ResourceLevelConfig!$H19*0.05,0)","v":57},215]
[16,{"$f":"ROUND([2]ResourceLevelConfig!$E20*0.05,0)","v":58},{"$f":"ROUND([2]ResourceLevelConfig!$C20*0.05,0)","v":58},{"$f":"ROUND([2]ResourceLevelConfig!$G20*0.05,0)","v":58},{"$f":"ROUND([2]ResourceLevelConfig!$H20*0.05,0)","v":58},216]
[17,{"$f":"ROUND([2]ResourceLevelConfig!$E21*0.05,0)","v":58},{"$f":"ROUND([2]ResourceLevelConfig!$C21*0.05,0)","v":58},{"$f":"ROUND([2]ResourceLevelConfig!$G21*0.05,0)","v":58},{"$f":"ROUND([2]ResourceLevelConfig!$H21*0.05,0)","v":58},217]
[18,{"$f":"ROUND([2]ResourceLevelConfig!$E22*0.05,0)","v":59},{"$f":"ROUND([2]ResourceLevelConfig!$C22*0.05,0)","v":59},{"$f":"ROUND([2]ResourceLevelConfig!$G22*0.05,0)","v":59},{"$f":"ROUND([2]ResourceLevelConfig!$H22*0.05,0)","v":59},218]
[19,{"$f":"ROUND([2]ResourceLevelConfig!$E23*0.05,0)","v":59},{"$f":"ROUND([2]ResourceLevelConfig!$C23*0.05,0)","v":59},{"$f":"ROUND([2]ResourceLevelConfig!$G23*0.05,0)","v":59},{"$f":"ROUND([2]ResourceLevelConfig!$H23*0.05,0)","v":59},219]
[20,{"$f":"ROUND([2]ResourceLevelConfig!$E24*0.05,0)","v":60},{"$f":"ROUND([2]ResourceLevelConfig!$C24*0.05,0)","v":60},{"$f":"ROUND([2]ResourceLevelConfig!$G24*0.05,0)","v":60},{"$f":"ROUND([2]ResourceLevelConfig!$H24*0.05,0)","v":60},220]
[21,{"$f":"ROUND([2]ResourceLevelConfig!$E25*0.05,0)","v":60},{"$f":"ROUND([2]ResourceLevelConfig!$C25*0.05,0)","v":60},{"$f":"ROUND([2]ResourceLevelConfig!$G25*0.05,0)","v":60},{"$f":"ROUND([2]ResourceLevelConfig!$H25*0.05,0)","v":60},221]
[22,{"$f":"ROUND([2]ResourceLevelConfig!$E26*0.05,0)","v":61},{"$f":"ROUND([2]ResourceLevelConfig!$C26*0.05,0)","v":61},{"$f":"ROUND([2]ResourceLevelConfig!$G26*0.05,0)","v":61},{"$f":"ROUND([2]ResourceLevelConfig!$H26*0.05,0)","v":61},222]
[23,{"$f":"ROUND([2]ResourceLevelConfig!$E27*0.05,0)","v":61},{"$f":"ROUND([2]ResourceLevelConfig!$C27*0.05,0)","v":61},{"$f":"ROUND([2]ResourceLevelConfig!$G27*0.05,0)","v":61},{"$f":"ROUND([2]ResourceLevelConfig!$H27*0.05,0)","v":61},223]
[24,{"$f":"ROUND([2]ResourceLevelConfig!$E28*0.05,0)","v":62},{"$f":"ROUND([2]ResourceLevelConfig!$C28*0.05,0)","v":62},{"$f":"ROUND([2]ResourceLevelConfig!$G28*0.05,0)","v":62},{"$f":"ROUND([2]ResourceLevelConfig!$H28*0.05,0)","v":62},224]
[25,{"$f":"ROUND([2]ResourceLevelConfig!$E29*0.05,0)","v":62},{"$f":"ROUND([2]ResourceLevelConfig!$C29*0.05,0)","v":62},{"$f":"ROUND([2]ResourceLevelConfig!$G29*0.05,0)","v":62},{"$f":"ROUND([2]ResourceLevelConfig!$H29*0.05,0)","v":62},225]
[26,{"$f":"ROUND([2]ResourceLevelConfig!$E30*0.05,0)","v":63},{"$f":"ROUND([2]ResourceLevelConfig!$C30*0.05,0)","v":63},{"$f":"ROUND([2]ResourceLevelConfig!$G30*0.05,0)","v":63},{"$f":"ROUND([2]ResourceLevelConfig!$H30*0.05,0)","v":63},226]
[27,{"$f":"ROUND([2]ResourceLevelConfig!$E31*0.05,0)","v":63},{"$f":"ROUND([2]ResourceLevelConfig!$C31*0.05,0)","v":63},{"$f":"ROUND([2]ResourceLevelConfig!$G31*0.05,0)","v":63},{"$f":"ROUND([2]ResourceLevelConfig!$H31*0.05,0)","v":63},227]
[28,{"$f":"ROUND([2]ResourceLevelConfig!$E32*0.05,0)","v":64},{"$f":"ROUND([2]ResourceLevelConfig!$C32*0.05,0)","v":64},{"$f":"ROUND([2]ResourceLevelConfig!$G32*0.05,0)","v":64},{"$f":"ROUND([2]ResourceLevelConfig!$H32*0.05,0)","v":64},228]
[29,{"$f":"ROUND([2]ResourceLevelConfig!$E33*0.05,0)","v":64},{"$f":"ROUND([2]ResourceLevelConfig!$C33*0.05,0)","v":64},{"$f":"ROUND([2]ResourceLevelConfig!$G33*0.05,0)","v":64},{"$f":"ROUND([2]ResourceLevelConfig!$H33*0.05,0)","v":64},229]
[30,{"$f":"ROUND([2]ResourceLevelConfig!$E34*0.05,0)","v":65},{"$f":"ROUND([2]ResourceLevelConfig!$C34*0.05,0)","v":65},{"$f":"ROUND([2]ResourceLevelConfig!$G34*0.05,0)","v":65},{"$f":"ROUND([2]ResourceLevelConfig!$H34*0.05,0)","v":65},230]
[31,{"$f":"ROUND([2]ResourceLevelConfig!$E35*0.05,0)","v":65},{"$f":"ROUND([2]ResourceLevelConfig!$C35*0.05,0)","v":65},{"$f":"ROUND([2]ResourceLevelConfig!$G35*0.05,0)","v":65},{"$f":"ROUND([2]ResourceLevelConfig!$H35*0.05,0)","v":65},231]
[32,{"$f":"ROUND([2]ResourceLevelConfig!$E36*0.05,0)","v":66},{"$f":"ROUND([2]ResourceLevelConfig!$C36*0.05,0)","v":66},{"$f":"ROUND([2]ResourceLevelConfig!$G36*0.05,0)","v":66},{"$f":"ROUND([2]ResourceLevelConfig!$H36*0.05,0)","v":66},232]
[33,{"$f":"ROUND([2]ResourceLevelConfig!$E37*0.05,0)","v":66},{"$f":"ROUND([2]ResourceLevelConfig!$C37*0.05,0)","v":66},{"$f":"ROUND([2]ResourceLevelConfig!$G37*0.05,0)","v":66},{"$f":"ROUND([2]ResourceLevelConfig!$H37*0.05,0)","v":66},233]
[34,{"$f":"ROUND([2]ResourceLevelConfig!$E38*0.05,0)","v":67},{"$f":"ROUND([2]ResourceLevelConfig!$C38*0.05,0)","v":67},{"$f":"ROUND([2]ResourceLevelConfig!$G38*0.05,0)","v":67},{"$f":"ROUND([2]ResourceLevelConfig!$H38*0.05,0)","v":67},234]
[35,{"$f":"ROUND([2]ResourceLevelConfig!$E39*0.05,0)","v":67},{"$f":"ROUND([2]ResourceLevelConfig!$C39*0.05,0)","v":67},{"$f":"ROUND([2]ResourceLevelConfig!$G39*0.05,0)","v":67},{"$f":"ROUND([2]ResourceLevelConfig!$H39*0.05,0)","v":67},235]
[36,{"$f":"ROUND([2]ResourceLevelConfig!$E40*0.05,0)","v":68},{"$f":"ROUND([2]ResourceLevelConfig!$C40*0.05,0)","v":68},{"$f":"ROUND([2]ResourceLevelConfig!$G40*0.05,0)","v":68},{"$f":"ROUND([2]ResourceLevelConfig!$H40*0.05,0)","v":68},236]
{"$rows_left_out":264}