{"text_format":"2","workbook":"xlsx","n_sheets":2,"sheets":["FabaoConfig","FabaoPowerupConfig"],"not_rendered":{"charts":0,"images":0,"macros":0,"external_links":2,"defined_names":2,"comments":0,"pivot_tables":0},"unopened":[],"bounds":{"document_bytes":16777216,"sheet_cells":100000,"run_cost":"one","rows_first":2000,"rows_last":500,"rows_between":2000,"halvings":0,"cell_chars":16384,"cell_head_chars":4096},"cells_cut":0,"cells_raw":0,"read":"whole","date_system":"1900"}

{"sheet":"FabaoConfig","index":0,"n_rows":15,"n_cols":18,"rows_kept":15,"cut":false,"hidden":false,"merged":[]}
["ID","ItemID","name","Type","magicAttribute","model","fragmentID",null,"ShuxingIDs","ShuxingPara","SkillGroupID"]
["int","int","string","int","int","string","int",null,"int[]","int[]","int"]
[{"$nulls":15},"输入等级",1]
[null,"法宝对应道具ID","法宝名称","法宝类型\n1攻击型\n2防御型","法宝类型\n1=金\n2=木\n4=水\n8=火\n16=土","模型名称","法宝对应碎片道具ID","法宝默认星级","法宝基础属性类型","法宝基础属性倍率","法宝技能ID组","生命","防御","攻击",null,"生命","防御","攻击"]
[10001,10001,"神龙鼎",1,1,"fb_3101",11001,1,{"$f":"_xlfn.TEXTJOIN(\";\",1,IF(L5=\"\",\"\",1),IF(M5=\"\",\"\",2),IF(N5=\"\",\"\",3))","v":"2;3"},{"$f":"_xlfn.TEXTJOIN(\";\",1,L5:N5)","v":"50;50"},3101,null,50,50,null,{"$f":"IF(L5=\"\",\"\",ROUND(VLOOKUP($Q$3,FabaoPowerupConfig!$A:$E,3,FALSE)*L5/100,0))","v":""},{"$f":"IF(M5=\"\",\"\",ROUND(VLOOKUP($Q$3,FabaoPowerupConfig!$A:$E,4,FALSE)*M5/100,0))","v":8},{"$f":"IF(N5=\"\",\"\",ROUND(VLOOKUP($Q$3,FabaoPowerupConfig!$A:$E,5,FALSE)*N5/100,0))","v":19}]
[10002,10002,"噬空齿刃",1,1,"fb_wulonglun",11002,1,{"$f":"_xlfn.TEXTJOIN(\";\",1,IF(L6=\"\",\"\",1),IF(M6=\"\",\"\",2),IF(N6=\"\",\"\",3))","v":"1;3"},{"$f":"_xlfn.TEXTJOIN(\";\",1,L6:N6)","v":"50;50"},3102,50,null,50,null,{"$f":"IF(L6=\"\",\"\",ROUND(VLOOKUP($Q$3,FabaoPowerupConfig!$A:$E,3,FALSE)*L6/100,0))","v":113},{"$f":"IF(M6=\"\",\"\",ROUND(VLOOKUP($Q$3,FabaoPowerupConfig!$A:$E,4,FALSE)*M6/100,0))","v":""},{"$f":"IF(N6=\"\",\"\",ROUND(VLOOKUP($Q$3,FabaoPowerupConfig!$A:$E,5,FALSE)*N6/100,0))","v":19}]
[10003,10003,"翡翠葫芦",1,2,"fb_feicuihulu",11003,1,"1;2","75;25",3201,75,25,null,null,{"$f":"IF(L7=\"\",\"\",ROUND(VLOOKUP($Q$3,FabaoPowerupConfig!$A:$E,3,FALSE)*L7/100,0))","v":169},{"$f":"IF(M7=\"\",\"\",ROUND(VLOOKUP($Q$3,FabaoPowerupConfig!$A:$E,4,FALSE)*M7/100,0))","v":4},{"$f":"IF(N7=\"\",\"\",ROUND(VLOOKUP($Q$3,FabaoPowerupConfig!$A:$E,5,FALSE)*N7/100,0))","v":""}]
[10004,10004,"混沌珠",1,2,"fb_3202",11004,1,"1;3","25;75",3202,25,null,75,null,{"$f":"IF(L8=\"\",\"\",ROUND(VLOOKUP($Q$3,FabaoPowerupConfig!$A:$E,3,FALSE)*L8/100,0))","v":56},{"$f":"IF(M8=\"\",\"\",ROUND(VLOOKUP($Q$3,FabaoPowerupConfig!$A:$E,4,FALSE)*M8/100,0))","v":""},{"$f":"IF(N8=\"\",\"\",ROUND(VLOOKUP($Q$3,FabaoPowerupConfig!$A:$E,5,FALSE)*N8/100,0))","v":28}]
[10005,10005,"绝脉瓶",1,2,"fb_3203",11005,1,"2;3","50;50",3203,null,50,50,null,{"$f":"IF(L9=\"\",\"\",ROUND(VLOOKUP($Q$3,FabaoPowerupConfig!$A:$E,3,FALSE)*L9/100,0))","v":""},{"$f":"IF(M9=\"\",\"\",ROUND(VLOOKUP($Q$3,FabaoPowerupConfig!$A:$E,4,FALSE)*M9/100,0))","v":8},{"$f":"IF(N9=\"\",\"\",ROUND(VLOOKUP($Q$3,FabaoPowerupConfig!$A:$E,5,FALSE)*N9/100,0))","v":19}]
[10006,10006,"九幽镇魂瓶",1,4,"fb_BossPing",11006,1,"1;3","50;50",3301,50,null,50,null,{"$f":"IF(L10=\"\",\"\",ROUND(VLOOKUP($Q$3,FabaoPowerupConfig!$A:$E,3,FALSE)*L10/100,0))","v":113},{"$f":"IF(M10=\"\",\"\",ROUND(VLOOKUP($Q$3,FabaoPowerupConfig!$A:$E,4,FALSE)*M10/100,0))","v":""},{"$f":"IF(N10=\"\",\"\",ROUND(VLOOKUP($Q$3,FabaoPowerupConfig!$A:$E,5,FALSE)*N10/100,0))","v":19}]
[10007,10007,"玉莲守心灯",1,4,"fb_3302",11007,1,"1;2","75;25",3302,75,25,null,null,{"$f":"IF(L11=\"\",\"\",ROUND(VLOOKUP($Q$3,FabaoPowerupConfig!$A:$E,3,FALSE)*L11/100,0))","v":169},{"$f":"IF(M11=\"\",\"\",ROUND(VLOOKUP($Q$3,FabaoPowerupConfig!$A:$E,4,FALSE)*M11/100,0))","v":4},{"$f":"IF(N11=\"\",\"\",ROUND(VLOOKUP($Q$3,FabaoPowerupConfig!$A:$E,5,FALSE)*N11/100,0))","v":""}]
[10008,10008,"融灵塔",1,8,"fb_3401",11008,1,"2;3","75;25",3401,null,75,25,null,{"$f":"IF(L12=\"\",\"\",ROUND(VLOOKUP($Q$3,FabaoPowerupConfig!$A:$E,3,FALSE)*L12/100,0))","v":""},{"$f":"IF(M12=\"\",\"\",ROUND(VLOOKUP($Q$3,FabaoPowerupConfig!$A:$E,4,FALSE)*M12/100,0))","v":11},{"$f":"IF(N12=\"\",\"\",ROUND(VLOOKUP($Q$3,FabaoPowerupConfig!$A:$E,5,FALSE)*N12/100,0))","v":9}]
[null,10009,"禁元珠",1,8,"fb_BossPing",11009,1,"","",3402,{"$nulls":4},{"$f":"IF(L13=\"\",\"\",ROUND(VLOOKUP($Q$3,FabaoPowerupConfig!$A:$E,3,FALSE)*L13/100,0))","v":""},{"$f":"IF(M13=\"\",\"\",ROUND(VLOOKUP($Q$3,FabaoPowerupConfig!$A:$E,4,FALSE)*M13/100,0))","v":""},{"$f":"IF(N13=\"\",\"\",ROUND(VLOOKUP($Q$3,FabaoPowerupConfig!$A:$E,5,FALSE)*N13/100,0))","v":""}]
[10010,10010,"玄龟盾",1,16,"fb_xuanguidun",11010,1,"1;2","25;75",3501,25,75,null,null,{"$f":"IF(L14=\"\",\"\",ROUND(VLOOKUP($Q$3,FabaoPowerupConfig!$A:$E,3,FALSE)*L14/100,0))","v":56},{"$f":"IF(M14=\"\",\"\",ROUND(VLOOKUP($Q$3,FabaoPowerupConfig!$A:$E,4,FALSE)*M14/100,0))","v":11},{"$f":"IF(N14=\"\",\"\",ROUND(VLOOKUP($Q$3,FabaoPowerupConfig!$A:$E,5,FALSE)*N14/100,0))","v":""}]
[null,10011,"天殇血刃剑",1,16,"fb_ding1",11011,1,"","",3502,{"$nulls":4},{"$f":"IF(L15=\"\",\"\",ROUND(VLOOKUP($Q$3,FabaoPowerupConfig!$A:$E,3,FALSE)*L15/100,0))","v":""},{"$f":"IF(M15=\"\",\"\",ROUND(VLOOKUP($Q$3,FabaoPowerupConfig!$A:$E,4,FALSE)*M15/100,0))","v":""},{"$f":"IF(N15=\"\",\"\",ROUND(VLOOKUP($Q$3,FabaoPowerupConfig!$A:$E,5,FALSE)*N15/100,0))","v":""}]

{"sheet":"FabaoPowerupConfig","index":1,"n_rows":35,"n_cols":23,"rows_kept":35,"cut":false,"hidden":false,"merged":[]}
["ID","Power","HP","DEF","ATK",null,"NeedLv","PowerupItemIDs","PowerupItemCosts",{"$nulls":4},"PromotePieceNum","SkillLevel"]
["int","int","float","float","float",null,"int","int[]","int[]",{"$nulls":4},"int[]","int"]
[]
["ID序列","法宝的基础强度成长","法宝的生命标准成长1","法宝的防御标准成长2","法宝的攻击标准成长3","实力等级","升级所需修为等级","强化所需道具ID","强化所需道具数量","道具1","数量1","道具2","数量2","突破所需对应碎片数量","对应的技能等级",1.26]
[1,100,{"$f":"ROUND(VLOOKUP(F5,[1]主表!$A:$B,2,FALSE)*[1]主表!$D$1*[1]升级!$AA$4*(1+VLOOKUP(F5,[1]主表!$A:$F,6,FALSE)),2)","v":225},{"$f":"ROUND(VLOOKUP(F5,[1]主表!$A:$B,2,FALSE)*[1]主表!$D$1*[1]升级!$X$4,2)","v":15},{"$f":"ROUND(VLOOKUP(F5,[1]主表!$A:$B,2,FALSE)*[1]主表!$D$1*[1]升级!$U$4,2)","v":37.5},1,11,{"$f":"_xlfn.TEXTJOIN(\";\",1,J5,L5)","v":"1001;1006"},{"$f":"_xlfn.TEXTJOIN(\";\",1,K5,M5)","v":"6000;500"},1001,{"$f":"ROUND(40*VLOOKUP(G5,[2]ResourceLevelConfig!$A:$H,3,FALSE)/4,0)","v":6000},1006,{"$f":"ROUND(100*VLOOKUP(G5,[2]ResourceLevelConfig!$A:$H,8,FALSE)/4,0)","v":500},-1,1]
[2,{"$f":"ROUND(B5*P$4,0)","v":126},{"$f":"ROUND(VLOOKUP(F6,[1]主表!$A:$B,2,FALSE)*[1]主表!$D$1*[1]升级!$AA$4*(1+VLOOKUP(F6,[1]主表!$A:$F,6,FALSE)),2)","v":265.01},{"$f":"ROUND(VLOOKUP(F6,[1]主表!$A:$B,2,FALSE)*[1]主表!$D$1*[1]升级!$X$4,2)","v":17.15},{"$f":"ROUND(VLOOKUP(F6,[1]主表!$A:$B,2,FALSE)*[1]主表!$D$1*[1]升级!$U$4,2)","v":42.88},10,21,{"$f":"_xlfn.TEXTJOIN(\";\",1,J6,L6)","v":"1001;1006"},{"$f":"_xlfn.TEXTJOIN(\";\",1,K6,M6)","v":"9000;750"},1001,{"$f":"ROUND(40*VLOOKUP(G6,[2]ResourceLevelConfig!$A:$H,3,FALSE)/4,0)","v":9000},1006,{"$f":"ROUND(100*VLOOKUP(G6,[2]ResourceLevelConfig!$A:$H,8,FALSE)/4,0)","v":750},-1,1]
[3,{"$f":"ROUND(B6*P$4,0)","v":159},{"$f":"ROUND(VLOOKUP(F7,[1]主表!$A:$B,2,FALSE)*[1]主表!$D$1*[1]升级!$AA$4*(1+VLOOKUP(F7,[1]主表!$A:$F,6,FALSE)),2)","v":344.13},{"$f":"ROUND(VLOOKUP(F7,[1]主表!$A:$B,2,FALSE)*[1]主表!$D$1*[1]升级!$X$4,2)","v":21.57},{"$f":"ROUND(VLOOKUP(F7,[1]主表!$A:$B,2,FALSE)*[1]主表!$D$1*[1]升级!$U$4,2)","v":53.93},20,31,"1001;1006","12000;1000",1001,{"$f":"ROUND(40*VLOOKUP(G7,[2]ResourceLevelConfig!$A:$H,3,FALSE)/4,0)","v":12000},1006,{"$f":"ROUND(100*VLOOKUP(G7,[2]ResourceLevelConfig!$A:$H,8,FALSE)/4,0)","v":1000},-1,1,{"$nulls":6},1,1]
[4,200,{"$f":"ROUND(VLOOKUP(F8,[1]主表!$A:$B,2,FALSE)*[1]主表!$D$1*[1]升级!$AA$4*(1+VLOOKUP(F8,[1]主表!$A:$F,6,FALSE)),2)","v":446.43},{"$f":"ROUND(VLOOKUP(F8,[1]主表!$A:$B,2,FALSE)*[1]主表!$D$1*[1]升级!$X$4,2)","v":27.13},{"$f":"ROUND(VLOOKUP(F8,[1]主表!$A:$B,2,FALSE)*[1]主表!$D$1*[1]升级!$U$4,2)","v":67.83},30,41,"1001;1006","15000;1250",1001,{"$f":"ROUND(40*VLOOKUP(G8,[2]ResourceLevelConfig!$A:$H,3,FALSE)/4,0)","v":15000},1006,{"$f":"ROUND(100*VLOOKUP(G8,[2]ResourceLevelConfig!$A:$H,8,FALSE)/4,0)","v":1250},-1,1,{"$nulls":6},2,6]
[5,252,{"$f":"ROUND(VLOOKUP(F9,[1]主表!$A:$B,2,FALSE)*[1]主表!$D$1*[1]升级!$AA$4*(1+VLOOKUP(F9,[1]主表!$A:$F,6,FALSE)),2)","v":789.01},{"$f":"ROUND(VLOOKUP(F9,[1]主表!$A:$B,2,FALSE)*[1]主表!$D$1*[1]升级!$X$4,2)","v":46.53},{"$f":"ROUND(VLOOKUP(F9,[1]主表!$A:$B,2,FALSE)*[1]主表!$D$1*[1]升级!$U$4,2)","v":116.33},40,51,"1001;1006","18280;1500",1001,{"$f":"ROUND(40*VLOOKUP(G9,[2]ResourceLevelConfig!$A:$H,3,FALSE)/4,0)","v":18280},1006,{"$f":"ROUND(100*VLOOKUP(G9,[2]ResourceLevelConfig!$A:$H,8,FALSE)/4,0)","v":1500},-1,1,{"$nulls":6},3,10]
[6,318,{"$f":"ROUND(VLOOKUP(F10,[1]主表!$A:$B,2,FALSE)*[1]主表!$D$1*[1]升级!$AA$4*(1+VLOOKUP(F10,[1]主表!$A:$F,6,FALSE)),2)","v":1021.72},{"$f":"ROUND(VLOOKUP(F10,[1]主表!$A:$B,2,FALSE)*[1]主表!$D$1*[1]升级!$X$4,2)","v":58.52},{"$f":"ROUND(VLOOKUP(F10,[1]主表!$A:$B,2,FALSE)*[1]主表!$D$1*[1]升级!$U$4,2)","v":146.31},50,61,"1001;1006","22290;1750",1001,{"$f":"ROUND(40*VLOOKUP(G10,[2]ResourceLevelConfig!$A:$H,3,FALSE)/4,0)","v":22290},1006,{"$f":"ROUND(100*VLOOKUP(G10,[2]ResourceLevelConfig!$A:$H,8,FALSE)/4,0)","v":1750},10,1,{"$nulls":6},4,15]
[7,401,{"$f":"ROUND(VLOOKUP(F11,[1]主表!$A:$B,2,FALSE)*[1]主表!$D$1*[1]升级!$AA$4*(1+VLOOKUP(F11,[1]主表!$A:$F,6,FALSE)),2)","v":1321.97},{"$f":"ROUND(VLOOKUP(F11,[1]主表!$A:$B,2,FALSE)*[1]主表!$D$1*[1]升级!$X$4,2)","v":73.61},{"$f":"ROUND(VLOOKUP(F11,[1]主表!$A:$B,2,FALSE)*[1]主表!$D$1*[1]升级!$U$4,2)","v":184.02},60,71,"1001;1006","27150;2125",1001,{"$f":"ROUND(40*VLOOKUP(G11,[2]ResourceLevelConfig!$A:$H,3,FALSE)/4,0)","v":27150},1006,{"$f":"ROUND(100*VLOOKUP(G11,[2]ResourceLevelConfig!$A:$H,8,FALSE)/4,0)","v":2125},-1,{"$f":"O5+1","v":2},{"$nulls":6},5,20]
[8,505,{"$f":"ROUND(VLOOKUP(F12,[1]主表!$A:$B,2,FALSE)*[1]主表!$D$1*[1]升级!$AA$4*(1+VLOOKUP(F12,[1]主表!$A:$F,6,FALSE)),2)","v":2330.63},{"$f":"ROUND(VLOOKUP(F12,[1]主表!$A:$B,2,FALSE)*[1]主表!$D$1*[1]升级!$X$4,2)","v":126.24},{"$f":"ROUND(VLOOKUP(F12,[1]主表!$A:$B,2,FALSE)*[1]主表!$D$1*[1]升级!$U$4,2)","v":315.61},70,81,"1001;1006","33090;2625",1001,{"$f":"ROUND(40*VLOOKUP(G12,[2]ResourceLevelConfig!$A:$H,3,FALSE)/4,0)","v":33090},1006,{"$f":"ROUND(100*VLOOKUP(G12,[2]ResourceLevelConfig!$A:$H,8,FALSE)/4,0)","v":2625},-1,{"$f":"O6+1","v":2},{"$nulls":6},6,25]
[9,636,{"$f":"ROUND(VLOOKUP(F13,[1]主表!$A:$B,2,FALSE)*[1]主表!$D$1*[1]升级!$AA$4*(1+VLOOKUP(F13,[1]主表!$A:$F,6,FALSE)),2)","v":3010.95},{"$f":"ROUND(VLOOKUP(F13,[1]主表!$A:$B,2,FALSE)*[1]主表!$D$1*[1]升级!$X$4,2)","v":158.78},{"$f":"ROUND(VLOOKUP(F13,[1]主表!$A:$B,2,FALSE)*[1]主表!$D$1*[1]升级!$U$4,2)","v":396.95},80,91,"1001;1006","40350;3125",1001,{"$f":"ROUND(40*VLOOKUP(G13,[2]ResourceLevelConfig!$A:$H,3,FALSE)/4,0)","v":40350},1006,{"$f":"ROUND(100*VLOOKUP(G13,[2]ResourceLevelConfig!$A:$H,8,FALSE)/4,0)","v":3125},-1,2]
[10,801,{"$f":"ROUND(VLOOKUP(F14,[1]主表!$A:$B,2,FALSE)*[1]主表!$D$1*[1]升级!$AA$4*(1+VLOOKUP(F14,[1]主表!$A:$F,6,FALSE)),2)","v":3887.15},{"$f":"ROUND(VLOOKUP(F14,[1]主表!$A:$B,2,FALSE)*[1]主表!$D$1*[1]升级!$X$4,2)","v":199.7},{"$f":"ROUND(VLOOKUP(F14,[1]主表!$A:$B,2,FALSE)*[1]主表!$D$1*[1]升级!$U$4,2)","v":499.25},90,101,"1001;1006","49190;3875",1001,{"$f":"ROUND(40*VLOOKUP(G14,[2]ResourceLevelConfig!$A:$H,3,FALSE)/4,0)","v":49190},1006,{"$f":"ROUND(100*VLOOKUP(G14,[2]ResourceLevelConfig!$A:$H,8,FALSE)/4,0)","v":3875},-1,2]
[11,1009,{"$f":"ROUND(VLOOKUP(F15,[1]主表!$A:$B,2,FALSE)*[1]主表!$D$1*[1]升级!$AA$4*(1+VLOOKUP(F15,[1]主表!$A:$F,6,FALSE)),2)","v":6838.61},{"$f":"ROUND(VLOOKUP(F15,[1]主表!$A:$B,2,FALSE)*[1]主表!$D$1*[1]升级!$X$4,2)","v":342.5},{"$f":"ROUND(VLOOKUP(F15,[1]主表!$A:$B,2,FALSE)*[1]主表!$D$1*[1]升级!$U$4,2)","v":856.26},100,111,"1001;1006","59950;4700",1001,{"$f":"ROUND(40*VLOOKUP(G15,[2]ResourceLevelConfig!$A:$H,3,FALSE)/4,0)","v":59950},1006,{"$f":"ROUND(100*VLOOKUP(G15,[2]ResourceLevelConfig!$A:$H,8,FALSE)/4,0)","v":4700},-1,2]
[12,1271,{"$f":"ROUND(VLOOKUP(F16,[1]主表!$A:$B,2,FALSE)*[1]主表!$D$1*[1]升级!$AA$4*(1+VLOOKUP(F16,[1]主表!$A:$F,6,FALSE)),2)","v":8817.23},{"$f":"ROUND(VLOOKUP(F16,[1]主表!$A:$B,2,FALSE)*[1]主表!$D$1*[1]升级!$X$4,2)","v":430.78},{"$f":"ROUND(VLOOKUP(F16,[1]主表!$A:$B,2,FALSE)*[1]主表!$D$1*[1]升级!$U$4,2)","v":1076.94},110,121,"1001;1006","73070;5700",1001,{"$f":"ROUND(40*VLOOKUP(G16,[2]ResourceLevelConfig!$A:$H,3,FALSE)/4,0)","v":73070},1006,{"$f":"ROUND(100*VLOOKUP(G16,[2]ResourceLevelConfig!$A:$H,8,FALSE)/4,0)","v":5700},10,2]
[13,1601,{"$f":"ROUND(VLOOKUP(F17,[1]主表!$A:$B,2,FALSE)*[1]主表!$D$1*[1]升级!$AA$4*(1+VLOOKUP(F17,[1]主表!$A:$F,6,FALSE)),2)","v":11361.49},{"$f":"ROUND(VLOOKUP(F17,[1]主表!$A:$B,2,FALSE)*[1]主表!$D$1*[1]升级!$X$4,2)","v":541.8},{"$f":"ROUND(VLOOKUP(F17,[1]主表!$A:$B,2,FALSE)*[1]主表!$D$1*[1]升级!$U$4,2)","v":1354.5},120,131,"1001;1006","89070;6950",1001,{"$f":"ROUND(40*VLOOKUP(G17,[2]ResourceLevelConfig!$A:$H,3,FALSE)/4,0)","v":89070},1006,{"$f":"ROUND(100*VLOOKUP(G17,[2]ResourceLevelConfig!$A:$H,8,FALSE)/4,0)","v":6950},-1,3]
[14,2017,{"$f":"ROUND(VLOOKUP(F18,[1]主表!$A:$B,2,FALSE)*[1]主表!$D$1*[1]升级!$AA$4*(1+VLOOKUP(F18,[1]主表!$A:$F,6,FALSE)),2)","v":19952.1},{"$f":"ROUND(VLOOKUP(F18,[1]主表!$A:$B,2,FALSE)*[1]主表!$D$1*[1]升级!$X$4,2)","v":929.23},{"$f":"ROUND(VLOOKUP(F18,[1]主表!$A:$B,2,FALSE)*[1]主表!$D$1*[1]升级!$U$4,2)","v":2323.08},130,141,"1001;1006","108590;8500",1001,{"$f":"ROUND(40*VLOOKUP(G18,[2]ResourceLevelConfig!$A:$H,3,FALSE)/4,0)","v":108590},1006,{"$f":"ROUND(100*VLOOKUP(G18,[2]ResourceLevelConfig!$A:$H,8,FALSE)/4,0)","v":8500},-1,3]
[15,2541,{"$f":"ROUND(VLOOKUP(F19,[1]主表!$A:$B,2,FALSE)*[1]主表!$D$1*[1]升级!$AA$4*(1+VLOOKUP(F19,[1]主表!$A:$F,6,FALSE)),2)","v":25680.65},{"$f":"ROUND(VLOOKUP(F19,[1]主表!$A:$B,2,FALSE)*[1]主表!$D$1*[1]升级!$X$4,2)","v":1168.72},{"$f":"ROUND(VLOOKUP(F19,[1]主表!$A:$B,2,FALSE)*[1]主表!$D$1*[1]升级!$U$4,2)","v":2921.81},140,151,"1001;1006","132370;10375",1001,{"$f":"ROUND(40*VLOOKUP(G19,[2]ResourceLevelConfig!$A:$H,3,FALSE)/4,0)","v":132370},1006,{"$f":"ROUND(100*VLOOKUP(G19,[2]ResourceLevelConfig!$A:$H,8,FALSE)/4,0)","v":10375},-1,3]
[16,3202,{"$f":"ROUND(VLOOKUP(F20,[1]主表!$A:$B,2,FALSE)*[1]主表!$D$1*[1]升级!$AA$4*(1+VLOOKUP(F20,[1]主表!$A:$F,6,FALSE)),2)","v":33036.72},{"$f":"ROUND(VLOOKUP(F20,[1]主表!$A:$B,2,FALSE)*[1]主表!$D$1*[1]升级!$X$4,2)","v":1469.94},{"$f":"ROUND(VLOOKUP(F20,[1]主表!$A:$B,2,FALSE)*[1]主表!$D$1*[1]升级!$U$4,2)","v":3674.84},150,161,"1001;1006","161350;12650",1001,{"$f":"ROUND(40*VLOOKUP(G20,[2]ResourceLevelConfig!$A:$H,3,FALSE)/4,0)","v":161350},1006,{"$f":"ROUND(100*VLOOKUP(G20,[2]ResourceLevelConfig!$A:$H,8,FALSE)/4,0)","v":12650},-1,3]
[17,4035,{"$f":"ROUND(VLOOKUP(F21,[1]主表!$A:$B,2,FALSE)*[1]主表!$D$1*[1]升级!$AA$4*(1+VLOOKUP(F21,[1]主表!$A:$F,6,FALSE)),2)","v":57925.53},{"$f":"ROUND(VLOOKUP(F21,[1]主表!$A:$B,2,FALSE)*[1]主表!$D$1*[1]升级!$X$4,2)","v":2521.07},{"$f":"ROUND(VLOOKUP(F21,[1]主表!$A:$B,2,FALSE)*[1]主表!$D$1*[1]升级!$U$4,2)","v":6302.67},160,171,"1001;1006","196680;15425",1001,{"$f":"ROUND(40*VLOOKUP(G21,[2]ResourceLevelConfig!$A:$H,3,FALSE)/4,0)","v":196680},1006,{"$f":"ROUND(100*VLOOKUP(G21,[2]ResourceLevelConfig!$A:$H,8,FALSE)/4,0)","v":15425},-1,3]
[18,5084,{"$f":"ROUND(VLOOKUP(F22,[1]主表!$A:$B,2,FALSE)*[1]主表!$D$1*[1]升级!$AA$4*(1+VLOOKUP(F22,[1]主表!$A:$F,6,FALSE)),2)","v":74445.33},{"$f":"ROUND(VLOOKUP(F22,[1]主表!$A:$B,2,FALSE)*[1]主表!$D$1*[1]升级!$X$4,2)","v":3170.82},{"$f":"ROUND(VLOOKUP(F22,[1]主表!$A:$B,2,FALSE)*[1]主表!$D$1*[1]升级!$U$4,2)","v":7927.05},170,181,"1001;1006","239740;18800",1001,{"$f":"ROUND(40*VLOOKUP(G22,[2]ResourceLevelConfig!$A:$H,3,FALSE)/4,0)","v":239740},1006,{"$f":"ROUND(100*VLOOKUP(G22,[2]ResourceLevelConfig!$A:$H,8,FALSE)/4,0)","v":18800},10,3]
[19,6406,{"$f":"ROUND(VLOOKUP(F23,[1]主表!$A:$B,2,FALSE)*[1]主表!$D$1*[1]升级!$AA$4*(1+VLOOKUP(F23,[1]主表!$A:$F,6,FALSE)),2)","v":95632.74},{"$f":"ROUND(VLOOKUP(F23,[1]主表!$A:$B,2,FALSE)*[1]主表!$D$1*[1]升级!$X$4,2)","v":3988.03},{"$f":"ROUND(VLOOKUP(F23,[1]主表!$A:$B,2,FALSE)*[1]主表!$D$1*[1]升级!$U$4,2)","v":9970.08},180,191,"1001;1006","292240;22925",1001,{"$f":"ROUND(40*VLOOKUP(G23,[2]ResourceLevelConfig!$A:$H,3,FALSE)/4,0)","v":292240},1006,{"$f":"ROUND(100*VLOOKUP(G23,[2]ResourceLevelConfig!$A:$H,8,FALSE)/4,0)","v":22925},-1,4]
[20,8072,{"$f":"ROUND(VLOOKUP(F24,[1]主表!$A:$B,2,FALSE)*[1]主表!$D$1*[1]升级!$AA$4*(1+VLOOKUP(F24,[1]主表!$A:$F,6,FALSE)),2)","v":167449.61},{"$f":"ROUND(VLOOKUP(F24,[1]主表!$A:$B,2,FALSE)*[1]主表!$D$1*[1]升级!$X$4,2)","v":6839.81},{"$f":"ROUND(VLOOKUP(F24,[1]主表!$A:$B,2,FALSE)*[1]主表!$D$1*[1]升级!$U$4,2)","v":17099.53},190,201,"1001;1006","356220;27925",1001,{"$f":"ROUND(40*VLOOKUP(G24,[2]ResourceLevelConfig!$A:$H,3,FALSE)/4,0)","v":356220},1006,{"$f":"ROUND(100*VLOOKUP(G24,[2]ResourceLevelConfig!$A:$H,8,FALSE)/4,0)","v":27925},-1,4]
[21,10171,{"$f":"ROUND(VLOOKUP(F25,[1]主表!$A:$B,2,FALSE)*[1]主表!$D$1*[1]升级!$AA$4*(1+VLOOKUP(F25,[1]主表!$A:$F,6,FALSE)),2)","v":214921.93},{"$f":"ROUND(VLOOKUP(F25,[1]主表!$A:$B,2,FALSE)*[1]主表!$D$1*[1]升级!$X$4,2)","v":8602.63},{"$f":"ROUND(VLOOKUP(F25,[1]主表!$A:$B,2,FALSE)*[1]主表!$D$1*[1]升级!$U$4,2)","v":21506.58},200,211,"1001;1006","434220;34050",1001,{"$f":"ROUND(40*VLOOKUP(G25,[2]ResourceLevelConfig!$A:$H,3,FALSE)/4,0)","v":434220},1006,{"$f":"ROUND(100*VLOOKUP(G25,[2]ResourceLevelConfig!$A:$H,8,FALSE)/4,0)","v":34050},-1,4]
[22,12815,{"$f":"ROUND(VLOOKUP(F26,[1]主表!$A:$B,2,FALSE)*[1]主表!$D$1*[1]升级!$AA$4*(1+VLOOKUP(F26,[1]主表!$A:$F,6,FALSE)),2)","v":275741.53},{"$f":"ROUND(VLOOKUP(F26,[1]主表!$A:$B,2,FALSE)*[1]主表!$D$1*[1]升级!$X$4,2)","v":10819.78},{"$f":"ROUND(VLOOKUP(F26,[1]主表!$A:$B,2,FALSE)*[1]主表!$D$1*[1]升级!$U$4,2)","v":27049.45},210,221,"1001;1006","529330;41500",1001,{"$f":"ROUND(40*VLOOKUP(G26,[2]ResourceLevelConfig!$A:$H,3,FALSE)/4,0)","v":529330},1006,{"$f":"ROUND(100*VLOOKUP(G26,[2]ResourceLevelConfig!$A:$H,8,FALSE)/4,0)","v":41500},-1,4]
[23,16147,{"$f":"ROUND(VLOOKUP(F27,[1]主表!$A:$B,2,FALSE)*[1]主表!$D$1*[1]升级!$AA$4*(1+VLOOKUP(F27,[1]主表!$A:$F,6,FALSE)),2)","v":482229.6},{"$f":"ROUND(VLOOKUP(F27,[1]主表!$A:$B,2,FALSE)*[1]主表!$D$1*[1]升级!$X$4,2)","v":18556.84},{"$f":"ROUND(VLOOKUP(F27,[1]主表!$A:$B,2,FALSE)*[1]主表!$D$1*[1]升级!$U$4,2)","v":46392.1},220,231,"1001;1006","645240;50600",1001,{"$f":"ROUND(40*VLOOKUP(G27,[2]ResourceLevelConfig!$A:$H,3,FALSE)/4,0)","v":645240},1006,{"$f":"ROUND(100*VLOOKUP(G27,[2]ResourceLevelConfig!$A:$H,8,FALSE)/4,0)","v":50600},-1,4]
[24,20345,{"$f":"ROUND(VLOOKUP(F28,[1]主表!$A:$B,2,FALSE)*[1]主表!$D$1*[1]升级!$AA$4*(1+VLOOKUP(F28,[1]主表!$A:$F,6,FALSE)),2)","v":618222.9},{"$f":"ROUND(VLOOKUP(F28,[1]主表!$A:$B,2,FALSE)*[1]主表!$D$1*[1]升级!$X$4,2)","v":23339.48},{"$f":"ROUND(VLOOKUP(F28,[1]主表!$A:$B,2,FALSE)*[1]主表!$D$1*[1]升级!$U$4,2)","v":58348.69},230,241,"1001;1006","786530;61675",1001,{"$f":"ROUND(40*VLOOKUP(G28,[2]ResourceLevelConfig!$A:$H,3,FALSE)/4,0)","v":786530},1006,{"$f":"ROUND(100*VLOOKUP(G28,[2]ResourceLevelConfig!$A:$H,8,FALSE)/4,0)","v":61675},10,4]
[25,25635,{"$f":"ROUND(VLOOKUP(F29,[1]主表!$A:$B,2,FALSE)*[1]主表!$D$1*[1]升级!$AA$4*(1+VLOOKUP(F29,[1]主表!$A:$F,6,FALSE)),2)","v":792283.31},{"$f":"ROUND(VLOOKUP(F29,[1]主表!$A:$B,2,FALSE)*[1]主表!$D$1*[1]升级!$X$4,2)","v":29354.73},{"$f":"ROUND(VLOOKUP(F29,[1]主表!$A:$B,2,FALSE)*[1]主表!$D$1*[1]升级!$U$4,2)","v":73386.84},240,251,"1001;1006","958790;75150",1001,{"$f":"ROUND(40*VLOOKUP(G29,[2]ResourceLevelConfig!$A:$H,3,FALSE)/4,0)","v":958790},1006,{"$f":"ROUND(100*VLOOKUP(G29,[2]ResourceLevelConfig!$A:$H,8,FALSE)/4,0)","v":75150},-1,5]
[26,32300,{"$f":"ROUND(VLOOKUP(F30,[1]主表!$A:$B,2,FALSE)*[1]主表!$D$1*[1]升级!$AA$4*(1+VLOOKUP(F30,[1]主表!$A:$F,6,FALSE)),2)","v":1384090.31},{"$f":"ROUND(VLOOKUP(F30,[1]主表!$A:$B,2,FALSE)*[1]主表!$D$1*[1]升级!$X$4,2)","v":50345.86},{"$f":"ROUND(VLOOKUP(F30,[1]主表!$A:$B,2,FALSE)*[1]主表!$D$1*[1]升级!$U$4,2)","v":125864.66},250,261,"1001;1006","1168780;91600",1001,{"$f":"ROUND(40*VLOOKUP(G30,[2]ResourceLevelConfig!$A:$H,3,FALSE)/4,0)","v":1168780},1006,{"$f":"ROUND(100*VLOOKUP(G30,[2]ResourceLevelConfig!$A:$H,8,FALSE)/4,0)","v":91600},-1,5]
[27,40698,{"$f":"ROUND(VLOOKUP(F31,[1]主表!$A:$B,2,FALSE)*[1]主表!$D$1*[1]升级!$AA$4*(1+VLOOKUP(F31,[1]主表!$A:$F,6,FALSE)),2)","v":1772577.1},{"$f":"ROUND(VLOOKUP(F31,[1]主表!$A:$B,2,FALSE)*[1]主表!$D$1*[1]升级!$X$4,2)","v":63321.45},{"$f":"ROUND(VLOOKUP(F31,[1]主表!$A:$B,2,FALSE)*[1]主表!$D$1*[1]升级!$U$4,2)","v":158303.63},260,271,"1001;1006","1424740;111675",1001,{"$f":"ROUND(40*VLOOKUP(G31,[2]ResourceLevelConfig!$A:$H,3,FALSE)/4,0)","v":1424740},1006,{"$f":"ROUND(100*VLOOKUP(G31,[2]ResourceLevelConfig!$A:$H,8,FALSE)/4,0)","v":111675},-1,5]
[28,51279,{"$f":"ROUND(VLOOKUP(F32,[1]主表!$A:$B,2,FALSE)*[1]主表!$D$1*[1]升级!$AA$4*(1+VLOOKUP(F32,[1]主表!$A:$F,6,FALSE)),2)","v":2269375.37},{"$f":"ROUND(VLOOKUP(F32,[1]主表!$A:$B,2,FALSE)*[1]主表!$D$1*[1]升级!$X$4,2)","v":79641.22},{"$f":"ROUND(VLOOKUP(F32,[1]主表!$A:$B,2,FALSE)*[1]主表!$D$1*[1]升级!$U$4,2)","v":199103.06},270,281,"1001;1006","1736740;136175",1001,{"$f":"ROUND(40*VLOOKUP(G32,[2]ResourceLevelConfig!$A:$H,3,FALSE)/4,0)","v":1736740},1006,{"$f":"ROUND(100*VLOOKUP(G32,[2]ResourceLevelConfig!$A:$H,8,FALSE)/4,0)","v":136175},-1,5]
[29,64612,{"$f":"ROUND(VLOOKUP(F33,[1]主表!$A:$B,2,FALSE)*[1]主表!$D$1*[1]升级!$AA$4*(1+VLOOKUP(F33,[1]主表!$A:$F,6,FALSE)),2)","v":3960695.72},{"$f":"ROUND(VLOOKUP(F33,[1]主表!$A:$B,2,FALSE)*[1]主表!$D$1*[1]升级!$X$4,2)","v":136591.47},{"$f":"ROUND(VLOOKUP(F33,[1]主表!$A:$B,2,FALSE)*[1]主表!$D$1*[1]升级!$U$4,2)","v":341478.67},280,291,"1001;1006","2117080;166000",1001,{"$f":"ROUND(40*VLOOKUP(G33,[2]ResourceLevelConfig!$A:$H,3,FALSE)/4,0)","v":2117080},1006,{"$f":"ROUND(100*VLOOKUP(G33,[2]ResourceLevelConfig!$A:$H,8,FALSE)/4,0)","v":166000},-1,5]
[30,81411,{"$f":"ROUND(VLOOKUP(F34,[1]主表!$A:$B,2,FALSE)*[1]主表!$D$1*[1]升级!$AA$4*(1+VLOOKUP(F34,[1]主表!$A:$F,6,FALSE)),2)","v":5067666.57},{"$f":"ROUND(VLOOKUP(F34,[1]主表!$A:$B,2,FALSE)*[1]主表!$D$1*[1]升级!$X$4,2)","v":171795.05},{"$f":"ROUND(VLOOKUP(F34,[1]主表!$A:$B,2,FALSE)*[1]主表!$D$1*[1]升级!$U$4,2)","v":429487.61},290,300,"1001;1006","2530100;198425",1001,{"$f":"ROUND(40*VLOOKUP(G34,[2]ResourceLevelConfig!$A:$H,3,FALSE)/4,0)","v":2530100},1006,{"$f":"ROUND(100*VLOOKUP(G34,[2]ResourceLevelConfig!$A:$H,8,FALSE)/4,0)","v":198425},10,5]
[31,102578,{"$f":"ROUND(VLOOKUP(F35,[1]主表!$A:$B,2,FALSE)*[1]主表!$D$1*[1]升级!$AA$4*(1+VLOOKUP(F35,[1]主表!$A:$F,6,FALSE)),2)","v":6482148.2},{"$f":"ROUND(VLOOKUP(F35,[1]主表!$A:$B,2,FALSE)*[1]主表!$D$1*[1]升级!$X$4,2)","v":216071.61},{"$f":"ROUND(VLOOKUP(F35,[1]主表!$A:$B,2,FALSE)*[1]主表!$D$1*[1]升级!$U$4,2)","v":540179.02},300,310,{"$f":"_xlfn.TEXTJOIN(\";\",1,J35,L35)","v":"1001;1006"},{"$f":"_xlfn.TEXTJOIN(\";\",1,K35,M35)","v":"9999999;999999"},1001,9999999,1006,999999,-1,6]