{"text_format":"2","workbook":"xlsx","n_sheets":2,"sheets":["FabaoConfig","FabaoPowerupConfig"],"not_rendered":{"charts":0,"images":0,"macros":0,"external_links":2,"defined_names":2,"comments":0,"pivot_tables":0},"unopened":[],"bounds":{"document_bytes":16777216,"sheet_cells":100000,"run_cost":"one","rows_first":2000,"rows_last":500,"rows_between":2000,"halvings":0,"cell_chars":16384,"cell_head_chars":4096},"cells_cut":0,"cells_raw":0,"read":"whole","date_system":"1900"}

{"sheet":"FabaoConfig","index":0,"n_rows":15,"n_cols":19,"rows_kept":15,"cut":false,"hidden":false,"merged":[]}
["ID","ItemID","name","Type","magicAttribute","model","fragmentID",null,"ShuxingIDs","ShuxingPara","SkillGroupID"]
["int","int","string","int","int","string","int",null,"int[]","int[]","int"]
[{"$nulls":15},"输入等级",10]
[null,"法宝对应道具ID","法宝名称","法宝类型\n1攻击型\n2防御型","法宝类型\n1=金\n2=木\n4=水\n8=火\n16=土","模型名称","法宝对应碎片道具ID","法宝默认星级","法宝基础属性类型","法宝基础属性倍率","法宝技能ID组","生命","防御","攻击",null,"生命","防御","攻击","品质"]
[10001,10001,"神龙鼎",1,1,"fb_3101",11001,1,{"$f":"_xlfn.TEXTJOIN(\";\",1,IF(L5=\"\",\"\",1),IF(M5=\"\",\"\",2),IF(N5=\"\",\"\",3))","v":"2;3"},{"$f":"_xlfn.TEXTJOIN(\";\",1,L5:N5)","v":"50;50"},3101,null,50,50,null,{"$f":"IF(L5=\"\",\"\",ROUND(VLOOKUP($Q$3,FabaoPowerupConfig!$A:$E,3,FALSE)*L5/100,0))","v":""},{"$f":"IF(M5=\"\",\"\",ROUND(VLOOKUP($Q$3,FabaoPowerupConfig!$A:$E,4,FALSE)*M5/100,0))","v":11},{"$f":"IF(N5=\"\",\"\",ROUND(VLOOKUP($Q$3,FabaoPowerupConfig!$A:$E,5,FALSE)*N5/100,0))","v":11},4]
[10002,10002,"噬空齿刃",1,1,"fb_wulonglun",11002,1,{"$f":"_xlfn.TEXTJOIN(\";\",1,IF(L6=\"\",\"\",1),IF(M6=\"\",\"\",2),IF(N6=\"\",\"\",3))","v":"1;3"},{"$f":"_xlfn.TEXTJOIN(\";\",1,L6:N6)","v":"50;50"},3102,50,null,50,null,{"$f":"IF(L6=\"\",\"\",ROUND(VLOOKUP($Q$3,FabaoPowerupConfig!$A:$E,3,FALSE)*L6/100,0))","v":127},{"$f":"IF(M6=\"\",\"\",ROUND(VLOOKUP($Q$3,FabaoPowerupConfig!$A:$E,4,FALSE)*M6/100,0))","v":""},{"$f":"IF(N6=\"\",\"\",ROUND(VLOOKUP($Q$3,FabaoPowerupConfig!$A:$E,5,FALSE)*N6/100,0))","v":11},5]
[10003,10003,"翡翠葫芦",1,2,"fb_feicuihulu",11003,1,"1;2","75;25",3201,75,25,null,null,{"$f":"IF(L7=\"\",\"\",ROUND(VLOOKUP($Q$3,FabaoPowerupConfig!$A:$E,3,FALSE)*L7/100,0))","v":191},{"$f":"IF(M7=\"\",\"\",ROUND(VLOOKUP($Q$3,FabaoPowerupConfig!$A:$E,4,FALSE)*M7/100,0))","v":5},{"$f":"IF(N7=\"\",\"\",ROUND(VLOOKUP($Q$3,FabaoPowerupConfig!$A:$E,5,FALSE)*N7/100,0))","v":""},4]
[10004,10004,"混沌珠",1,2,"fb_3202",11004,1,"1;3","25;75",3202,25,null,75,null,{"$f":"IF(L8=\"\",\"\",ROUND(VLOOKUP($Q$3,FabaoPowerupConfig!$A:$E,3,FALSE)*L8/100,0))","v":64},{"$f":"IF(M8=\"\",\"\",ROUND(VLOOKUP($Q$3,FabaoPowerupConfig!$A:$E,4,FALSE)*M8/100,0))","v":""},{"$f":"IF(N8=\"\",\"\",ROUND(VLOOKUP($Q$3,FabaoPowerupConfig!$A:$E,5,FALSE)*N8/100,0))","v":16},5]
[10005,10005,"绝脉瓶",1,2,"fb_3203",11005,1,"2;3","50;50",3203,null,50,50,null,{"$f":"IF(L9=\"\",\"\",ROUND(VLOOKUP($Q$3,FabaoPowerupConfig!$A:$E,3,FALSE)*L9/100,0))","v":""},{"$f":"IF(M9=\"\",\"\",ROUND(VLOOKUP($Q$3,FabaoPowerupConfig!$A:$E,4,FALSE)*M9/100,0))","v":11},{"$f":"IF(N9=\"\",\"\",ROUND(VLOOKUP($Q$3,FabaoPowerupConfig!$A:$E,5,FALSE)*N9/100,0))","v":11},5]
[10006,10006,"九幽镇魂瓶",1,4,"fb_BossPing",11006,1,"1;3","50;50",3301,50,null,50,null,{"$f":"IF(L10=\"\",\"\",ROUND(VLOOKUP($Q$3,FabaoPowerupConfig!$A:$E,3,FALSE)*L10/100,0))","v":127},{"$f":"IF(M10=\"\",\"\",ROUND(VLOOKUP($Q$3,FabaoPowerupConfig!$A:$E,4,FALSE)*M10/100,0))","v":""},{"$f":"IF(N10=\"\",\"\",ROUND(VLOOKUP($Q$3,FabaoPowerupConfig!$A:$E,5,FALSE)*N10/100,0))","v":11},4]
[10007,10007,"玉莲守心灯",1,4,"fb_3302",11007,1,"1;2","75;25",3302,75,25,null,null,{"$f":"IF(L11=\"\",\"\",ROUND(VLOOKUP($Q$3,FabaoPowerupConfig!$A:$E,3,FALSE)*L11/100,0))","v":191},{"$f":"IF(M11=\"\",\"\",ROUND(VLOOKUP($Q$3,FabaoPowerupConfig!$A:$E,4,FALSE)*M11/100,0))","v":5},{"$f":"IF(N11=\"\",\"\",ROUND(VLOOKUP($Q$3,FabaoPowerupConfig!$A:$E,5,FALSE)*N11/100,0))","v":""},5]
[10008,10008,"融灵塔",1,8,"fb_3401",11008,1,"2;3","75;25",3401,null,75,25,null,{"$f":"IF(L12=\"\",\"\",ROUND(VLOOKUP($Q$3,FabaoPowerupConfig!$A:$E,3,FALSE)*L12/100,0))","v":""},{"$f":"IF(M12=\"\",\"\",ROUND(VLOOKUP($Q$3,FabaoPowerupConfig!$A:$E,4,FALSE)*M12/100,0))","v":16},{"$f":"IF(N12=\"\",\"\",ROUND(VLOOKUP($Q$3,FabaoPowerupConfig!$A:$E,5,FALSE)*N12/100,0))","v":5},4]
[null,10009,"禁元珠",1,8,"fb_BossPing",11009,1,"","",3402,{"$nulls":4},{"$f":"IF(L13=\"\",\"\",ROUND(VLOOKUP($Q$3,FabaoPowerupConfig!$A:$E,3,FALSE)*L13/100,0))","v":""},{"$f":"IF(M13=\"\",\"\",ROUND(VLOOKUP($Q$3,FabaoPowerupConfig!$A:$E,4,FALSE)*M13/100,0))","v":""},{"$f":"IF(N13=\"\",\"\",ROUND(VLOOKUP($Q$3,FabaoPowerupConfig!$A:$E,5,FALSE)*N13/100,0))","v":""},5]
[10010,10010,"玄龟盾",1,16,"fb_xuanguidun",11010,1,"1;2","25;75",3501,25,75,null,null,{"$f":"IF(L14=\"\",\"\",ROUND(VLOOKUP($Q$3,FabaoPowerupConfig!$A:$E,3,FALSE)*L14/100,0))","v":64},{"$f":"IF(M14=\"\",\"\",ROUND(VLOOKUP($Q$3,FabaoPowerupConfig!$A:$E,4,FALSE)*M14/100,0))","v":16},{"$f":"IF(N14=\"\",\"\",ROUND(VLOOKUP($Q$3,FabaoPowerupConfig!$A:$E,5,FALSE)*N14/100,0))","v":""},4]
[null,10011,"天殇血刃剑",1,16,"fb_ding1",11011,1,"","",3502,{"$nulls":4},{"$f":"IF(L15=\"\",\"\",ROUND(VLOOKUP($Q$3,FabaoPowerupConfig!$A:$E,3,FALSE)*L15/100,0))","v":""},{"$f":"IF(M15=\"\",\"\",ROUND(VLOOKUP($Q$3,FabaoPowerupConfig!$A:$E,4,FALSE)*M15/100,0))","v":""},{"$f":"IF(N15=\"\",\"\",ROUND(VLOOKUP($Q$3,FabaoPowerupConfig!$A:$E,5,FALSE)*N15/100,0))","v":""},5]

{"sheet":"FabaoPowerupConfig","index":1,"n_rows":154,"n_cols":25,"rows_kept":154,"cut":false,"hidden":false,"merged":[]}
["ID","Power","HP","DEF","ATK",null,"NeedLv","PowerupItemIDs","PowerupItemCosts",{"$nulls":4},"PromotePieceNum","SkillLevel"]
["int","int","float","float","float",null,"int","int[]","int[]",{"$nulls":4},"int[]","int"]
[]
["ID序列","法宝的基础强度成长","法宝的生命标准成长1","法宝的防御标准成长2","法宝的攻击标准成长3","实力等级","升级所需修为等级","强化所需道具ID","强化所需道具数量","道具1","数量1","道具2","数量2","突破所需对应碎片数量\n索引0=quality1","对应的技能等级",1.08,"白色","绿色","蓝色","紫色","橙色","大约升几级"]
[1,100,{"$f":"ROUND(VLOOKUP(F5,[1]主表!$A:$B,2,FALSE)*[1]主表!$D$1*[1]升级!$AC$4*(1+VLOOKUP(F5,[1]主表!$A:$F,6,FALSE)),2)","v":81.69},{"$f":"ROUND(VLOOKUP(F5,[1]主表!$A:$B,2,FALSE)*[1]主表!$D$1*[1]升级!$Z$4,2)","v":15.2},{"$f":"ROUND(VLOOKUP(F5,[1]主表!$A:$B,2,FALSE)*[1]主表!$D$1*[1]升级!$W$4,2)","v":15.2},2,3,{"$f":"_xlfn.TEXTJOIN(\";\",1,J5,L5)","v":"1001;1006"},{"$f":"_xlfn.TEXTJOIN(\";\",1,K5,M5)","v":"2040;1224"},1001,{"$f":"ROUND(40*VLOOKUP(G5,[2]ResourceLevelConfig!$A:$H,3,FALSE)/20,0)","v":2040},1006,{"$f":"ROUND(VLOOKUP(G5,[2]ResourceLevelConfig!$A:$H,8,FALSE)*12,0)","v":1224},{"$f":"_xlfn.TEXTJOIN(\";\",1,Q5:U5)","v":"-1"},1,null,-1,{"$nulls":4},45]
[2,{"$f":"ROUND(B5*P$4,0)","v":108},{"$f":"ROUND(VLOOKUP(F6,[1]主表!$A:$B,2,FALSE)*[1]主表!$D$1*[1]升级!$AC$4*(1+VLOOKUP(F6,[1]主表!$A:$F,6,FALSE)),2)","v":95.57},{"$f":"ROUND(VLOOKUP(F6,[1]主表!$A:$B,2,FALSE)*[1]主表!$D$1*[1]升级!$Z$4,2)","v":15.62},{"$f":"ROUND(VLOOKUP(F6,[1]主表!$A:$B,2,FALSE)*[1]主表!$D$1*[1]升级!$W$4,2)","v":15.62},4,5,{"$f":"_xlfn.TEXTJOIN(\";\",1,J6,L6)","v":"1001;1006"},{"$f":"_xlfn.TEXTJOIN(\";\",1,K6,M6)","v":"2082;1248"},1001,{"$f":"ROUND(40*VLOOKUP(G6,[2]ResourceLevelConfig!$A:$H,3,FALSE)/20,0)","v":2082},1006,{"$f":"ROUND(VLOOKUP(G6,[2]ResourceLevelConfig!$A:$H,8,FALSE)*12,0)","v":1248},"-1",1,null,-1]
[3,{"$f":"ROUND(B6*P$4,0)","v":117},{"$f":"ROUND(VLOOKUP(F7,[1]主表!$A:$B,2,FALSE)*[1]主表!$D$1*[1]升级!$AC$4*(1+VLOOKUP(F7,[1]主表!$A:$F,6,FALSE)),2)","v":110.15},{"$f":"ROUND(VLOOKUP(F7,[1]主表!$A:$B,2,FALSE)*[1]主表!$D$1*[1]升级!$Z$4,2)","v":16.04},{"$f":"ROUND(VLOOKUP(F7,[1]主表!$A:$B,2,FALSE)*[1]主表!$D$1*[1]升级!$W$4,2)","v":16.04},6,7,"1001;1006","2124;1272",1001,{"$f":"ROUND(40*VLOOKUP(G7,[2]ResourceLevelConfig!$A:$H,3,FALSE)/20,0)","v":2124},1006,{"$f":"ROUND(VLOOKUP(G7,[2]ResourceLevelConfig!$A:$H,8,FALSE)*12,0)","v":1272},"-1",1,null,-1,{"$nulls":6},1,1]
[4,126,{"$f":"ROUND(VLOOKUP(F8,[1]主表!$A:$B,2,FALSE)*[1]主表!$D$1*[1]升级!$AC$4*(1+VLOOKUP(F8,[1]主表!$A:$F,6,FALSE)),2)","v":125.45},{"$f":"ROUND(VLOOKUP(F8,[1]主表!$A:$B,2,FALSE)*[1]主表!$D$1*[1]升级!$Z$4,2)","v":16.48},{"$f":"ROUND(VLOOKUP(F8,[1]主表!$A:$B,2,FALSE)*[1]主表!$D$1*[1]升级!$W$4,2)","v":16.48},8,9,"1001;1006","2166;1296",1001,{"$f":"ROUND(40*VLOOKUP(G8,[2]ResourceLevelConfig!$A:$H,3,FALSE)/20,0)","v":2166},1006,{"$f":"ROUND(VLOOKUP(G8,[2]ResourceLevelConfig!$A:$H,8,FALSE)*12,0)","v":1296},"-1",1,null,-1,{"$nulls":6},2,6]
[5,136,{"$f":"ROUND(VLOOKUP(F9,[1]主表!$A:$B,2,FALSE)*[1]主表!$D$1*[1]升级!$AC$4*(1+VLOOKUP(F9,[1]主表!$A:$F,6,FALSE)),2)","v":141.5},{"$f":"ROUND(VLOOKUP(F9,[1]主表!$A:$B,2,FALSE)*[1]主表!$D$1*[1]升级!$Z$4,2)","v":16.920000000000002},{"$f":"ROUND(VLOOKUP(F9,[1]主表!$A:$B,2,FALSE)*[1]主表!$D$1*[1]升级!$W$4,2)","v":16.920000000000002},10,11,"1001;1006","2210;1332",1001,{"$f":"ROUND(40*VLOOKUP(G9,[2]ResourceLevelConfig!$A:$H,3,FALSE)/20,0)","v":2210},1006,{"$f":"ROUND(VLOOKUP(G9,[2]ResourceLevelConfig!$A:$H,8,FALSE)*12,0)","v":1332},"-1",1,null,-1,{"$nulls":6},3,10]
[6,147,{"$f":"ROUND(VLOOKUP(F10,[1]主表!$A:$B,2,FALSE)*[1]主表!$D$1*[1]升级!$AC$4*(1+VLOOKUP(F10,[1]主表!$A:$F,6,FALSE)),2)","v":171.84},{"$f":"ROUND(VLOOKUP(F10,[1]主表!$A:$B,2,FALSE)*[1]主表!$D$1*[1]升级!$Z$4,2)","v":18.87},{"$f":"ROUND(VLOOKUP(F10,[1]主表!$A:$B,2,FALSE)*[1]主表!$D$1*[1]升级!$W$4,2)","v":18.87},12,13,"1001;1006","2256;1356",1001,{"$f":"ROUND(40*VLOOKUP(G10,[2]ResourceLevelConfig!$A:$H,3,FALSE)/20,0)","v":2256},1006,{"$f":"ROUND(VLOOKUP(G10,[2]ResourceLevelConfig!$A:$H,8,FALSE)*12,0)","v":1356},"-1",1,null,-1,{"$nulls":6},4,15]
[7,159,{"$f":"ROUND(VLOOKUP(F11,[1]主表!$A:$B,2,FALSE)*[1]主表!$D$1*[1]升级!$AC$4*(1+VLOOKUP(F11,[1]主表!$A:$F,6,FALSE)),2)","v":190.99},{"$f":"ROUND(VLOOKUP(F11,[1]主表!$A:$B,2,FALSE)*[1]主表!$D$1*[1]升级!$Z$4,2)","v":19.38},{"$f":"ROUND(VLOOKUP(F11,[1]主表!$A:$B,2,FALSE)*[1]主表!$D$1*[1]升级!$W$4,2)","v":19.38},14,15,"1001;1006","2302;1380",1001,{"$f":"ROUND(40*VLOOKUP(G11,[2]ResourceLevelConfig!$A:$H,3,FALSE)/20,0)","v":2302},1006,{"$f":"ROUND(VLOOKUP(G11,[2]ResourceLevelConfig!$A:$H,8,FALSE)*12,0)","v":1380},"-1",1,null,-1,{"$nulls":6},5,20]
[8,172,{"$f":"ROUND(VLOOKUP(F12,[1]主表!$A:$B,2,FALSE)*[1]主表!$D$1*[1]升级!$AC$4*(1+VLOOKUP(F12,[1]主表!$A:$F,6,FALSE)),2)","v":211.05},{"$f":"ROUND(VLOOKUP(F12,[1]主表!$A:$B,2,FALSE)*[1]主表!$D$1*[1]升级!$Z$4,2)","v":19.91},{"$f":"ROUND(VLOOKUP(F12,[1]主表!$A:$B,2,FALSE)*[1]主表!$D$1*[1]升级!$W$4,2)","v":19.91},16,17,"1001;1006","2348;1404",1001,{"$f":"ROUND(40*VLOOKUP(G12,[2]ResourceLevelConfig!$A:$H,3,FALSE)/20,0)","v":2348},1006,{"$f":"ROUND(VLOOKUP(G12,[2]ResourceLevelConfig!$A:$H,8,FALSE)*12,0)","v":1404},"-1",1,null,-1,{"$nulls":6},6,25]
[9,186,{"$f":"ROUND(VLOOKUP(F13,[1]主表!$A:$B,2,FALSE)*[1]主表!$D$1*[1]升级!$AC$4*(1+VLOOKUP(F13,[1]主表!$A:$F,6,FALSE)),2)","v":232.06},{"$f":"ROUND(VLOOKUP(F13,[1]主表!$A:$B,2,FALSE)*[1]主表!$D$1*[1]升级!$Z$4,2)","v":20.45},{"$f":"ROUND(VLOOKUP(F13,[1]主表!$A:$B,2,FALSE)*[1]主表!$D$1*[1]升级!$W$4,2)","v":20.45},18,19,"1001;1006","2396;1440",1001,{"$f":"ROUND(40*VLOOKUP(G13,[2]ResourceLevelConfig!$A:$H,3,FALSE)/20,0)","v":2396},1006,{"$f":"ROUND(VLOOKUP(G13,[2]ResourceLevelConfig!$A:$H,8,FALSE)*12,0)","v":1440},"-1",1,null,-1]
[10,201,{"$f":"ROUND(VLOOKUP(F14,[1]主表!$A:$B,2,FALSE)*[1]主表!$D$1*[1]升级!$AC$4*(1+VLOOKUP(F14,[1]主表!$A:$F,6,FALSE)),2)","v":254.05},{"$f":"ROUND(VLOOKUP(F14,[1]主表!$A:$B,2,FALSE)*[1]主表!$D$1*[1]升级!$Z$4,2)","v":21.01},{"$f":"ROUND(VLOOKUP(F14,[1]主表!$A:$B,2,FALSE)*[1]主表!$D$1*[1]升级!$W$4,2)","v":21.01},20,21,"1001;1006","2444;1464",1001,{"$f":"ROUND(40*VLOOKUP(G14,[2]ResourceLevelConfig!$A:$H,3,FALSE)/20,0)","v":2444},1006,{"$f":"ROUND(VLOOKUP(G14,[2]ResourceLevelConfig!$A:$H,8,FALSE)*12,0)","v":1464},"-1",1,null,-1,{"$nulls":4},40]
[11,217,{"$f":"ROUND(VLOOKUP(F15,[1]主表!$A:$B,2,FALSE)*[1]主表!$D$1*[1]升级!$AC$4*(1+VLOOKUP(F15,[1]主表!$A:$F,6,FALSE)),2)","v":300.72000000000003},{"$f":"ROUND(VLOOKUP(F15,[1]主表!$A:$B,2,FALSE)*[1]主表!$D$1*[1]升级!$Z$4,2)","v":23.42},{"$f":"ROUND(VLOOKUP(F15,[1]主表!$A:$B,2,FALSE)*[1]主表!$D$1*[1]升级!$W$4,2)","v":23.42},22,23,"1001;1006","2494;1500",1001,{"$f":"ROUND(40*VLOOKUP(G15,[2]ResourceLevelConfig!$A:$H,3,FALSE)/20,0)","v":2494},1006,{"$f":"ROUND(VLOOKUP(G15,[2]ResourceLevelConfig!$A:$H,8,FALSE)*12,0)","v":1500},"-1",1,null,-1]
[12,234,{"$f":"ROUND(VLOOKUP(F16,[1]主表!$A:$B,2,FALSE)*[1]主表!$D$1*[1]升级!$AC$4*(1+VLOOKUP(F16,[1]主表!$A:$F,6,FALSE)),2)","v":326.86},{"$f":"ROUND(VLOOKUP(F16,[1]主表!$A:$B,2,FALSE)*[1]主表!$D$1*[1]升级!$Z$4,2)","v":24.05},{"$f":"ROUND(VLOOKUP(F16,[1]主表!$A:$B,2,FALSE)*[1]主表!$D$1*[1]升级!$W$4,2)","v":24.05},24,25,"1001;1006","2544;1524",1001,{"$f":"ROUND(40*VLOOKUP(G16,[2]ResourceLevelConfig!$A:$H,3,FALSE)/20,0)","v":2544},1006,{"$f":"ROUND(VLOOKUP(G16,[2]ResourceLevelConfig!$A:$H,8,FALSE)*12,0)","v":1524},"-1",1,null,-1]
[13,253,{"$f":"ROUND(VLOOKUP(F17,[1]主表!$A:$B,2,FALSE)*[1]主表!$D$1*[1]升级!$AC$4*(1+VLOOKUP(F17,[1]主表!$A:$F,6,FALSE)),2)","v":354.2},{"$f":"ROUND(VLOOKUP(F17,[1]主表!$A:$B,2,FALSE)*[1]主表!$D$1*[1]升级!$Z$4,2)","v":24.71},{"$f":"ROUND(VLOOKUP(F17,[1]主表!$A:$B,2,FALSE)*[1]主表!$D$1*[1]升级!$W$4,2)","v":24.71},26,27,"1001;1006","2596;1560",1001,{"$f":"ROUND(40*VLOOKUP(G17,[2]ResourceLevelConfig!$A:$H,3,FALSE)/20,0)","v":2596},1006,{"$f":"ROUND(VLOOKUP(G17,[2]ResourceLevelConfig!$A:$H,8,FALSE)*12,0)","v":1560},"-1",1,null,-1]
[14,273,{"$f":"ROUND(VLOOKUP(F18,[1]主表!$A:$B,2,FALSE)*[1]主表!$D$1*[1]升级!$AC$4*(1+VLOOKUP(F18,[1]主表!$A:$F,6,FALSE)),2)","v":382.78},{"$f":"ROUND(VLOOKUP(F18,[1]主表!$A:$B,2,FALSE)*[1]主表!$D$1*[1]升级!$Z$4,2)","v":25.38},{"$f":"ROUND(VLOOKUP(F18,[1]主表!$A:$B,2,FALSE)*[1]主表!$D$1*[1]升级!$W$4,2)","v":25.38},28,29,"1001;1006","2648;1584",1001,{"$f":"ROUND(40*VLOOKUP(G18,[2]ResourceLevelConfig!$A:$H,3,FALSE)/20,0)","v":2648},1006,{"$f":"ROUND(VLOOKUP(G18,[2]ResourceLevelConfig!$A:$H,8,FALSE)*12,0)","v":1584},"-1",1,null,-1]
[15,295,{"$f":"ROUND(VLOOKUP(F19,[1]主表!$A:$B,2,FALSE)*[1]主表!$D$1*[1]升级!$AC$4*(1+VLOOKUP(F19,[1]主表!$A:$F,6,FALSE)),2)","v":412.66},{"$f":"ROUND(VLOOKUP(F19,[1]主表!$A:$B,2,FALSE)*[1]主表!$D$1*[1]升级!$Z$4,2)","v":26.07},{"$f":"ROUND(VLOOKUP(F19,[1]主表!$A:$B,2,FALSE)*[1]主表!$D$1*[1]升级!$W$4,2)","v":26.07},30,31,"1001;1006","2702;1620",1001,{"$f":"ROUND(40*VLOOKUP(G19,[2]ResourceLevelConfig!$A:$H,3,FALSE)/20,0)","v":2702},1006,{"$f":"ROUND(VLOOKUP(G19,[2]ResourceLevelConfig!$A:$H,8,FALSE)*12,0)","v":1620},"-1",1,null,-1]
[16,319,{"$f":"ROUND(VLOOKUP(F20,[1]主表!$A:$B,2,FALSE)*[1]主表!$D$1*[1]升级!$AC$4*(1+VLOOKUP(F20,[1]主表!$A:$F,6,FALSE)),2)","v":569.35},{"$f":"ROUND(VLOOKUP(F20,[1]主表!$A:$B,2,FALSE)*[1]主表!$D$1*[1]升级!$Z$4,2)","v":34.35},{"$f":"ROUND(VLOOKUP(F20,[1]主表!$A:$B,2,FALSE)*[1]主表!$D$1*[1]升级!$W$4,2)","v":34.35},32,33,"1001;1006","2756;1656",1001,{"$f":"ROUND(40*VLOOKUP(G20,[2]ResourceLevelConfig!$A:$H,3,FALSE)/20,0)","v":2756},1006,{"$f":"ROUND(VLOOKUP(G20,[2]ResourceLevelConfig!$A:$H,8,FALSE)*12,0)","v":1656},"-1",1,null,-1]
[17,345,{"$f":"ROUND(VLOOKUP(F21,[1]主表!$A:$B,2,FALSE)*[1]主表!$D$1*[1]升级!$AC$4*(1+VLOOKUP(F21,[1]主表!$A:$F,6,FALSE)),2)","v":611.17999999999995},{"$f":"ROUND(VLOOKUP(F21,[1]主表!$A:$B,2,FALSE)*[1]主表!$D$1*[1]升级!$Z$4,2)","v":35.28},{"$f":"ROUND(VLOOKUP(F21,[1]主表!$A:$B,2,FALSE)*[1]主表!$D$1*[1]升级!$W$4,2)","v":35.28},34,35,"1001;1006","2812;1692",1001,{"$f":"ROUND(40*VLOOKUP(G21,[2]ResourceLevelConfig!$A:$H,3,FALSE)/20,0)","v":2812},1006,{"$f":"ROUND(VLOOKUP(G21,[2]ResourceLevelConfig!$A:$H,8,FALSE)*12,0)","v":1692},"-1",1,null,-1]
[18,373,{"$f":"ROUND(VLOOKUP(F22,[1]主表!$A:$B,2,FALSE)*[1]主表!$D$1*[1]升级!$AC$4*(1+VLOOKUP(F22,[1]主表!$A:$F,6,FALSE)),2)","v":654.86},{"$f":"ROUND(VLOOKUP(F22,[1]主表!$A:$B,2,FALSE)*[1]主表!$D$1*[1]升级!$Z$4,2)","v":36.24},{"$f":"ROUND(VLOOKUP(F22,[1]主表!$A:$B,2,FALSE)*[1]主表!$D$1*[1]升级!$W$4,2)","v":36.24},36,37,"1001;1006","2868;1716",1001,{"$f":"ROUND(40*VLOOKUP(G22,[2]ResourceLevelConfig!$A:$H,3,FALSE)/20,0)","v":2868},1006,{"$f":"ROUND(VLOOKUP(G22,[2]ResourceLevelConfig!$A:$H,8,FALSE)*12,0)","v":1716},"-1",1,null,-1]
[19,403,{"$f":"ROUND(VLOOKUP(F23,[1]主表!$A:$B,2,FALSE)*[1]主表!$D$1*[1]升级!$AC$4*(1+VLOOKUP(F23,[1]主表!$A:$F,6,FALSE)),2)","v":700.47},{"$f":"ROUND(VLOOKUP(F23,[1]主表!$A:$B,2,FALSE)*[1]主表!$D$1*[1]升级!$Z$4,2)","v":37.229999999999997},{"$f":"ROUND(VLOOKUP(F23,[1]主表!$A:$B,2,FALSE)*[1]主表!$D$1*[1]升级!$W$4,2)","v":37.229999999999997},38,39,"1001;1006","2926;1752",1001,{"$f":"ROUND(40*VLOOKUP(G23,[2]ResourceLevelConfig!$A:$H,3,FALSE)/20,0)","v":2926},1006,{"$f":"ROUND(VLOOKUP(G23,[2]ResourceLevelConfig!$A:$H,8,FALSE)*12,0)","v":1752},"-1",1,null,-1]
[20,435,{"$f":"ROUND(VLOOKUP(F24,[1]主表!$A:$B,2,FALSE)*[1]主表!$D$1*[1]升级!$AC$4*(1+VLOOKUP(F24,[1]主表!$A:$F,6,FALSE)),2)","v":748.07},{"$f":"ROUND(VLOOKUP(F24,[1]主表!$A:$B,2,FALSE)*[1]主表!$D$1*[1]升级!$Z$4,2)","v":38.24},{"$f":"ROUND(VLOOKUP(F24,[1]主表!$A:$B,2,FALSE)*[1]主表!$D$1*[1]升级!$W$4,2)","v":38.24},40,41,"1001;1006","2986;1788",1001,{"$f":"ROUND(40*VLOOKUP(G24,[2]ResourceLevelConfig!$A:$H,3,FALSE)/20,0)","v":2986},1006,{"$f":"ROUND(VLOOKUP(G24,[2]ResourceLevelConfig!$A:$H,8,FALSE)*12,0)","v":1788},"-1",1,null,-1,{"$nulls":4},35]
[21,470,{"$f":"ROUND(VLOOKUP(F25,[1]主表!$A:$B,2,FALSE)*[1]主表!$D$1*[1]升级!$AC$4*(1+VLOOKUP(F25,[1]主表!$A:$F,6,FALSE)),2)","v":865.82},{"$f":"ROUND(VLOOKUP(F25,[1]主表!$A:$B,2,FALSE)*[1]主表!$D$1*[1]升级!$Z$4,2)","v":42.63},{"$f":"ROUND(VLOOKUP(F25,[1]主表!$A:$B,2,FALSE)*[1]主表!$D$1*[1]升级!$W$4,2)","v":42.63},42,43,"1001;1006","3046;1824",1001,{"$f":"ROUND(40*VLOOKUP(G25,[2]ResourceLevelConfig!$A:$H,3,FALSE)/20,0)","v":3046},1006,{"$f":"ROUND(VLOOKUP(G25,[2]ResourceLevelConfig!$A:$H,8,FALSE)*12,0)","v":1824},"-1",1,null,-1]
[22,508,{"$f":"ROUND(VLOOKUP(F26,[1]主表!$A:$B,2,FALSE)*[1]主表!$D$1*[1]升级!$AC$4*(1+VLOOKUP(F26,[1]主表!$A:$F,6,FALSE)),2)","v":922.06},{"$f":"ROUND(VLOOKUP(F26,[1]主表!$A:$B,2,FALSE)*[1]主表!$D$1*[1]升级!$Z$4,2)","v":43.79},{"$f":"ROUND(VLOOKUP(F26,[1]主表!$A:$B,2,FALSE)*[1]主表!$D$1*[1]升级!$W$4,2)","v":43.79},44,45,"1001;1006","3108;1860",1001,{"$f":"ROUND(40*VLOOKUP(G26,[2]ResourceLevelConfig!$A:$H,3,FALSE)/20,0)","v":3108},1006,{"$f":"ROUND(VLOOKUP(G26,[2]ResourceLevelConfig!$A:$H,8,FALSE)*12,0)","v":1860},"-1",1,null,-1]
[23,549,{"$f":"ROUND(VLOOKUP(F27,[1]主表!$A:$B,2,FALSE)*[1]主表!$D$1*[1]升级!$AC$4*(1+VLOOKUP(F27,[1]主表!$A:$F,6,FALSE)),2)","v":980.72},{"$f":"ROUND(VLOOKUP(F27,[1]主表!$A:$B,2,FALSE)*[1]主表!$D$1*[1]升级!$Z$4,2)","v":44.98},{"$f":"ROUND(VLOOKUP(F27,[1]主表!$A:$B,2,FALSE)*[1]主表!$D$1*[1]升级!$W$4,2)","v":44.98},46,47,"1001;1006","3170;1908",1001,{"$f":"ROUND(40*VLOOKUP(G27,[2]ResourceLevelConfig!$A:$H,3,FALSE)/20,0)","v":3170},1006,{"$f":"ROUND(VLOOKUP(G27,[2]ResourceLevelConfig!$A:$H,8,FALSE)*12,0)","v":1908},"-1",1,null,-1]
[24,593,{"$f":"ROUND(VLOOKUP(F28,[1]主表!$A:$B,2,FALSE)*[1]主表!$D$1*[1]升级!$AC$4*(1+VLOOKUP(F28,[1]主表!$A:$F,6,FALSE)),2)","v":1041.8900000000001},{"$f":"ROUND(VLOOKUP(F28,[1]主表!$A:$B,2,FALSE)*[1]主表!$D$1*[1]升级!$Z$4,2)","v":46.2},{"$f":"ROUND(VLOOKUP(F28,[1]主表!$A:$B,2,FALSE)*[1]主表!$D$1*[1]升级!$W$4,2)","v":46.2},48,49,"1001;1006","3236;1944",1001,{"$f":"ROUND(40*VLOOKUP(G28,[2]ResourceLevelConfig!$A:$H,3,FALSE)/20,0)","v":3236},1006,{"$f":"ROUND(VLOOKUP(G28,[2]ResourceLevelConfig!$A:$H,8,FALSE)*12,0)","v":1944},"-1",1,null,-1]
[25,640,{"$f":"ROUND(VLOOKUP(F29,[1]主表!$A:$B,2,FALSE)*[1]主表!$D$1*[1]升级!$AC$4*(1+VLOOKUP(F29,[1]主表!$A:$F,6,FALSE)),2)","v":1105.6600000000001},{"$f":"ROUND(VLOOKUP(F29,[1]主表!$A:$B,2,FALSE)*[1]主表!$D$1*[1]升级!$Z$4,2)","v":47.46},{"$f":"ROUND(VLOOKUP(F29,[1]主表!$A:$B,2,FALSE)*[1]主表!$D$1*[1]升级!$W$4,2)","v":47.46},50,51,"1001;1006","3300;1980",1001,{"$f":"ROUND(40*VLOOKUP(G29,[2]ResourceLevelConfig!$A:$H,3,FALSE)/20,0)","v":3300},1006,{"$f":"ROUND(VLOOKUP(G29,[2]ResourceLevelConfig!$A:$H,8,FALSE)*12,0)","v":1980},"-1",1,null,-1]
[26,691,{"$f":"ROUND(VLOOKUP(F30,[1]主表!$A:$B,2,FALSE)*[1]主表!$D$1*[1]升级!$AC$4*(1+VLOOKUP(F30,[1]主表!$A:$F,6,FALSE)),2)","v":1272.1600000000001},{"$f":"ROUND(VLOOKUP(F30,[1]主表!$A:$B,2,FALSE)*[1]主表!$D$1*[1]升级!$Z$4,2)","v":52.91},{"$f":"ROUND(VLOOKUP(F30,[1]主表!$A:$B,2,FALSE)*[1]主表!$D$1*[1]升级!$W$4,2)","v":52.91},52,53,"1001;1006","3368;2016",1001,{"$f":"ROUND(40*VLOOKUP(G30,[2]ResourceLevelConfig!$A:$H,3,FALSE)/20,0)","v":3368},1006,{"$f":"ROUND(VLOOKUP(G30,[2]ResourceLevelConfig!$A:$H,8,FALSE)*12,0)","v":2016},"-1",1,null,-1]
[27,746,{"$f":"ROUND(VLOOKUP(F31,[1]主表!$A:$B,2,FALSE)*[1]主表!$D$1*[1]升级!$AC$4*(1+VLOOKUP(F31,[1]主表!$A:$F,6,FALSE)),2)","v":1347.33},{"$f":"ROUND(VLOOKUP(F31,[1]主表!$A:$B,2,FALSE)*[1]主表!$D$1*[1]升级!$Z$4,2)","v":54.35},{"$f":"ROUND(VLOOKUP(F31,[1]主表!$A:$B,2,FALSE)*[1]主表!$D$1*[1]升级!$W$4,2)","v":54.35},54,55,"1001;1006","3436;2064",1001,{"$f":"ROUND(40*VLOOKUP(G31,[2]ResourceLevelConfig!$A:$H,3,FALSE)/20,0)","v":3436},1006,{"$f":"ROUND(VLOOKUP(G31,[2]ResourceLevelConfig!$A:$H,8,FALSE)*12,0)","v":2064},"-1",1,null,-1]
[28,806,{"$f":"ROUND(VLOOKUP(F32,[1]主表!$A:$B,2,FALSE)*[1]主表!$D$1*[1]升级!$AC$4*(1+VLOOKUP(F32,[1]主表!$A:$F,6,FALSE)),2)","v":1425.65},{"$f":"ROUND(VLOOKUP(F32,[1]主表!$A:$B,2,FALSE)*[1]主表!$D$1*[1]升级!$Z$4,2)","v":55.83},{"$f":"ROUND(VLOOKUP(F32,[1]主表!$A:$B,2,FALSE)*[1]主表!$D$1*[1]升级!$W$4,2)","v":55.83},56,57,"1001;1006","3506;2100",1001,{"$f":"ROUND(40*VLOOKUP(G32,[2]ResourceLevelConfig!$A:$H,3,FALSE)/20,0)","v":3506},1006,{"$f":"ROUND(VLOOKUP(G32,[2]ResourceLevelConfig!$A:$H,8,FALSE)*12,0)","v":2100},"-1",1,null,-1]
[29,870,{"$f":"ROUND(VLOOKUP(F33,[1]主表!$A:$B,2,FALSE)*[1]主表!$D$1*[1]升级!$AC$4*(1+VLOOKUP(F33,[1]主表!$A:$F,6,FALSE)),2)","v":1507.23},{"$f":"ROUND(VLOOKUP(F33,[1]主表!$A:$B,2,FALSE)*[1]主表!$D$1*[1]升级!$Z$4,2)","v":57.34},{"$f":"ROUND(VLOOKUP(F33,[1]主表!$A:$B,2,FALSE)*[1]主表!$D$1*[1]升级!$W$4,2)","v":57.34},58,59,"1001;1006","3576;2148",1001,{"$f":"ROUND(40*VLOOKUP(G33,[2]ResourceLevelConfig!$A:$H,3,FALSE)/20,0)","v":3576},1006,{"$f":"ROUND(VLOOKUP(G33,[2]ResourceLevelConfig!$A:$H,8,FALSE)*12,0)","v":2148},"-1",1,null,-1]
[30,940,{"$f":"ROUND(VLOOKUP(F34,[1]主表!$A:$B,2,FALSE)*[1]主表!$D$1*[1]升级!$AC$4*(1+VLOOKUP(F34,[1]主表!$A:$F,6,FALSE)),2)","v":1592.2},{"$f":"ROUND(VLOOKUP(F34,[1]主表!$A:$B,2,FALSE)*[1]主表!$D$1*[1]升级!$Z$4,2)","v":58.9},{"$f":"ROUND(VLOOKUP(F34,[1]主表!$A:$B,2,FALSE)*[1]主表!$D$1*[1]升级!$W$4,2)","v":58.9},60,61,"1001;1006","3648;2184",1001,{"$f":"ROUND(40*VLOOKUP(G34,[2]ResourceLevelConfig!$A:$H,3,FALSE)/20,0)","v":3648},1006,{"$f":"ROUND(VLOOKUP(G34,[2]ResourceLevelConfig!$A:$H,8,FALSE)*12,0)","v":2184},{"$f":"_xlfn.TEXTJOIN(\";\",1,Q34:U34)","v":"-1;0;30;50;60"},2,null,-1,0,{"$f":"[1]抽卡!$S$10","v":30},{"$f":"[1]抽卡!$S$11","v":50},{"$f":"[1]抽卡!$S$12","v":60},30]
[31,1015,{"$f":"ROUND(VLOOKUP(F35,[1]主表!$A:$B,2,FALSE)*[1]主表!$D$1*[1]升级!$AC$4*(1+VLOOKUP(F35,[1]主表!$A:$F,6,FALSE)),2)","v":2155.7600000000002},{"$f":"ROUND(VLOOKUP(F35,[1]主表!$A:$B,2,FALSE)*[1]主表!$D$1*[1]升级!$Z$4,2)","v":77.61},{"$f":"ROUND(VLOOKUP(F35,[1]主表!$A:$B,2,FALSE)*[1]主表!$D$1*[1]升级!$W$4,2)","v":77.61},62,63,{"$f":"_xlfn.TEXTJOIN(\";\",1,J35,L35)","v":"1001;1006"},{"$f":"_xlfn.TEXTJOIN(\";\",1,K35,M35)","v":"3722;2232"},1001,{"$f":"ROUND(40*VLOOKUP(G35,[2]ResourceLevelConfig!$A:$H,3,FALSE)/20,0)","v":3722},1006,{"$f":"ROUND(VLOOKUP(G35,[2]ResourceLevelConfig!$A:$H,8,FALSE)*12,0)","v":2232},"-1",2,null,-1]
[32,{"$f":"ROUND(B35*P$4,0)","v":1096},{"$f":"ROUND(VLOOKUP(F36,[1]主表!$A:$B,2,FALSE)*[1]主表!$D$1*[1]升级!$AC$4*(1+VLOOKUP(F36,[1]主表!$A:$F,6,FALSE)),2)","v":2273.9},{"$f":"ROUND(VLOOKUP(F36,[1]主表!$A:$B,2,FALSE)*[1]主表!$D$1*[1]升级!$Z$4,2)","v":79.72},{"$f":"ROUND(VLOOKUP(F36,[1]主表!$A:$B,2,FALSE)*[1]主表!$D$1*[1]升级!$W$4,2)","v":79.72},64,65,"1001;1006","3798;2280",1001,{"$f":"ROUND(40*VLOOKUP(G36,[2]ResourceLevelConfig!$A:$H,3,FALSE)/20,0)","v":3798},1006,{"$f":"ROUND(VLOOKUP(G36,[2]ResourceLevelConfig!$A:$H,8,FALSE)*12,0)","v":2280},"-1",2,null,-1]
[33,1184,{"$f":"ROUND(VLOOKUP(F37,[1]主表!$A:$B,2,FALSE)*[1]主表!$D$1*[1]升级!$AC$4*(1+VLOOKUP(F37,[1]主表!$A:$F,6,FALSE)),2)","v":2396.87},{"$f":"ROUND(VLOOKUP(F37,[1]主表!$A:$B,2,FALSE)*[1]主表!$D$1*[1]升级!$Z$4,2)","v":81.88},{"$f":"ROUND(VLOOKUP(F37,[1]主表!$A:$B,2,FALSE)*[1]主表!$D$1*[1]升级!$W$4,2)","v":81.88},66,67,{"$f":"_xlfn.TEXTJOIN(\";\",1,J37,L37)","v":"1001;1006"},{"$f":"_xlfn.TEXTJOIN(\";\",1,K37,M37)","v":"3874;2328"},1001,{"$f":"ROUND(40*VLOOKUP(G37,[2]ResourceLevelConfig!$A:$H,3,FALSE)/20,0)","v":3874},1006,{"$f":"ROUND(VLOOKUP(G37,[2]ResourceLevelConfig!$A:$H,8,FALSE)*12,0)","v":2328},"-1",2,null,-1]
[34,1279,{"$f":"ROUND(VLOOKUP(F38,[1]主表!$A:$B,2,FALSE)*[1]主表!$D$1*[1]升级!$AC$4*(1+VLOOKUP(F38,[1]主表!$A:$F,6,FALSE)),2)","v":2524.85},{"$f":"ROUND(VLOOKUP(F38,[1]主表!$A:$B,2,FALSE)*[1]主表!$D$1*[1]升级!$Z$4,2)","v":84.11},{"$f":"ROUND(VLOOKUP(F38,[1]主表!$A:$B,2,FALSE)*[1]主表!$D$1*[1]升级!$W$4,2)","v":84.11},68,69,"1001;1006","3952;2376",1001,{"$f":"ROUND(40*VLOOKUP(G38,[2]ResourceLevelConfig!$A:$H,3,FALSE)/20,0)","v":3952},1006,{"$f":"ROUND(VLOOKUP(G38,[2]ResourceLevelConfig!$A:$H,8,FALSE)*12,0)","v":2376},"-1",2,null,-1]
[35,1381,{"$f":"ROUND(VLOOKUP(F39,[1]主表!$A:$B,2,FALSE)*[1]主表!$D$1*[1]升级!$AC$4*(1+VLOOKUP(F39,[1]主表!$A:$F,6,FALSE)),2)","v":2658.01},{"$f":"ROUND(VLOOKUP(F39,[1]主表!$A:$B,2,FALSE)*[1]主表!$D$1*[1]升级!$Z$4,2)","v":86.4},{"$f":"ROUND(VLOOKUP(F39,[1]主表!$A:$B,2,FALSE)*[1]主表!$D$1*[1]升级!$W$4,2)","v":86.4},70,71,"1001;1006","4032;2424",1001,{"$f":"ROUND(40*VLOOKUP(G39,[2]ResourceLevelConfig!$A:$H,3,FALSE)/20,0)","v":4032},1006,{"$f":"ROUND(VLOOKUP(G39,[2]ResourceLevelConfig!$A:$H,8,FALSE)*12,0)","v":2424},"-1",2,null,-1]
[36,1491,{"$f":"ROUND(VLOOKUP(F40,[1]主表!$A:$B,2,FALSE)*[1]主表!$D$1*[1]升级!$AC$4*(1+VLOOKUP(F40,[1]主表!$A:$F,6,FALSE)),2)","v":3035.22},{"$f":"ROUND(VLOOKUP(F40,[1]主表!$A:$B,2,FALSE)*[1]主表!$D$1*[1]升级!$Z$4,2)","v":96.32},{"$f":"ROUND(VLOOKUP(F40,[1]主表!$A:$B,2,FALSE)*[1]主表!$D$1*[1]升级!$W$4,2)","v":96.32},72,73,"1001;1006","4114;2472",1001,{"$f":"ROUND(40*VLOOKUP(G40,[2]ResourceLevelConfig!$A:$H,3,FALSE)/20,0)","v":4114},1006,{"$f":"ROUND(VLOOKUP(G40,[2]ResourceLevelConfig!$A:$H,8,FALSE)*12,0)","v":2472},"-1",2,null,-1]
{"$rows_left_out":114}