{"text_format":"2","workbook":"xlsx","n_sheets":3,"sheets":["SkillConfig","SkillUpConfig","技能设计"],"not_rendered":{"charts":0,"images":0,"macros":0,"external_links":1,"defined_names":2,"comments":0,"pivot_tables":0},"unopened":[],"bounds":{"document_bytes":16777216,"sheet_cells":100000,"run_cost":"one","rows_first":2000,"rows_last":500,"rows_between":2000,"halvings":0,"cell_chars":16384,"cell_head_chars":4096},"cells_cut":0,"cells_raw":0,"read":"whole","date_system":"1900"}

{"sheet":"SkillConfig","index":0,"n_rows":110,"n_cols":19,"rows_kept":110,"cut":false,"hidden":false,"merged":[]}
["ID",null,null,null,"icon","scriptName","IDGroup","cd","SkillType","level","name","desc","effectValue","addPropertyType","addPropertyValue"]
["int",null,null,"使用神器","string","string","int","int","int","int","int","int","float[]","int[]","int[]"]
[null,null,null,{"$f":"SUBTOTAL(3,D6:D9322)","v":0}]
["技能ID\nIDGroup+技能等级",null,"所属英雄名字\n（策划用）","所属英雄ID\n（策划用）","图标","脚本名称","技能序列\n所属英雄ID+技能类型\n潜规则5=远程普攻","技能CD\n普攻无CD","技能类型:\n1= 基础\n2= 小招\n3= 大招\n4= 被动\n5= 简单被动(加属性)\n6 =职业被动\n7 =觉醒新技能效果|专属遗物效果","等级","技能名\n语言表ID","技能描述\n语言表ID","效果值","1=生命百分比\n2=攻击百分比\n3=防御百分比\n","具体效果值"]
[10011,null,"普通攻击技能",null,null,"NormalSkill",1001,null,1,1,405077,null,100]
[100011,null,{"$f":"VLOOKUP(K6,[1]语言配置表!$A:$B,2,FALSE)","v":"旋风斩"},null,{"$f":"\"icon_skill_\"&G6","v":"icon_skill_10001"},"S10001",10001,6,2,1,45,33,200,{"$nulls":5},1]
[100012,null,{"$f":"VLOOKUP(K7,[1]语言配置表!$A:$B,2,FALSE)","v":"旋风斩"},null,{"$f":"\"icon_skill_\"&G7","v":"icon_skill_10001"},"S10001",10001,6,2,2,45,34,260,{"$nulls":5},1.1]
[100013,null,{"$f":"VLOOKUP(K8,[1]语言配置表!$A:$B,2,FALSE)","v":"旋风斩"},null,{"$f":"\"icon_skill_\"&G8","v":"icon_skill_10001"},"S10001",10001,6,2,3,45,35,320,{"$nulls":5},1.2]
[100014,null,{"$f":"VLOOKUP(K9,[1]语言配置表!$A:$B,2,FALSE)","v":"旋风斩"},null,{"$f":"\"icon_skill_\"&G9","v":"icon_skill_10001"},"S10001",10001,6,2,4,45,36,480,{"$nulls":5},1.3]
[100021,null,{"$f":"VLOOKUP(K10,[1]语言配置表!$A:$B,2,FALSE)","v":"生命之力"},null,{"$f":"\"icon_skill_\"&G10","v":"icon_skill_10002"},null,10002,null,5,1,65,69,null,1,10]
[100022,null,{"$f":"VLOOKUP(K11,[1]语言配置表!$A:$B,2,FALSE)","v":"生命之力"},null,"icon_skill_10002",null,10002,null,5,2,65,69,null,1,20]
[100023,null,{"$f":"VLOOKUP(K12,[1]语言配置表!$A:$B,2,FALSE)","v":"生命之力"},null,"icon_skill_10002",null,10002,null,5,3,65,69,null,1,30]
[100024,null,{"$f":"VLOOKUP(K13,[1]语言配置表!$A:$B,2,FALSE)","v":"生命之力"},null,"icon_skill_10002",null,10002,null,5,4,65,69,null,1,40]
[100031,null,{"$f":"VLOOKUP(K14,[1]语言配置表!$A:$B,2,FALSE)","v":"钢铁意志"},null,"icon_skill_10003",null,10003,null,5,1,66,70,null,3,10]
[100032,null,{"$f":"VLOOKUP(K15,[1]语言配置表!$A:$B,2,FALSE)","v":"钢铁意志"},null,"icon_skill_10003",null,10003,null,5,2,66,70,null,3,20]
[100033,null,{"$f":"VLOOKUP(K16,[1]语言配置表!$A:$B,2,FALSE)","v":"钢铁意志"},null,"icon_skill_10003",null,10003,null,5,3,66,70,null,3,30]
[100034,null,{"$f":"VLOOKUP(K17,[1]语言配置表!$A:$B,2,FALSE)","v":"钢铁意志"},null,"icon_skill_10003",null,10003,null,5,4,66,70,null,3,40]
[100041,null,{"$f":"VLOOKUP(K18,[1]语言配置表!$A:$B,2,FALSE)","v":"斩风之力"},null,"icon_skill_10004","S10004",10004,null,4,1,67,71,1]
[100042,null,{"$f":"VLOOKUP(K19,[1]语言配置表!$A:$B,2,FALSE)","v":"斩风之力"},null,"icon_skill_10004","S10004",10004,null,4,2,67,71,1]
[100043,null,{"$f":"VLOOKUP(K20,[1]语言配置表!$A:$B,2,FALSE)","v":"斩风之力"},null,"icon_skill_10004","S10004",10004,null,4,3,67,71,2]
[100044,null,{"$f":"VLOOKUP(K21,[1]语言配置表!$A:$B,2,FALSE)","v":"斩风之力"},null,"icon_skill_10004","S10004",10004,null,4,4,67,71,3]
[100051,null,{"$f":"VLOOKUP(K22,[1]语言配置表!$A:$B,2,FALSE)","v":"抗暴之力"},null,"icon_skill_10005","S10005",10005,null,4,1,68,72,10]
[100052,null,{"$f":"VLOOKUP(K23,[1]语言配置表!$A:$B,2,FALSE)","v":"抗暴之力"},null,"icon_skill_10005","S10005",10005,null,4,2,68,72,11]
[100053,null,{"$f":"VLOOKUP(K24,[1]语言配置表!$A:$B,2,FALSE)","v":"抗暴之力"},null,"icon_skill_10005","S10005",10005,null,4,3,68,72,12]
[100054,null,{"$f":"VLOOKUP(K25,[1]语言配置表!$A:$B,2,FALSE)","v":"抗暴之力"},null,"icon_skill_10005","S10005",10005,null,4,4,68,72,13]
[300011,null,{"$f":"VLOOKUP(K26,[1]语言配置表!$A:$B,2,FALSE)","v":"烈焰喷涌"},null,"icon_skill_30001","S30001",30001,6,2,1,50,46,"60;3",{"$nulls":4},{"$f":"H26*S6/2/5","v":0.6}]
[300012,null,{"$f":"VLOOKUP(K27,[1]语言配置表!$A:$B,2,FALSE)","v":"烈焰喷涌"},null,"icon_skill_30001","S30001",30001,6,2,2,50,47,"66;3",{"$nulls":4},{"$f":"H27*S7/2/5","v":0.66}]
[300013,null,{"$f":"VLOOKUP(K28,[1]语言配置表!$A:$B,2,FALSE)","v":"烈焰喷涌"},null,"icon_skill_30001","S30001",30001,6,2,3,50,48,"72;3",{"$nulls":4},{"$f":"H28*S8/2/5","v":0.72}]
[300014,null,{"$f":"VLOOKUP(K29,[1]语言配置表!$A:$B,2,FALSE)","v":"烈焰喷涌"},null,"icon_skill_30001","S30001",30001,6,2,4,50,49,"78;4",{"$nulls":4},{"$f":"H29*S9/2/5","v":0.78}]
[300021,null,{"$f":"VLOOKUP(K30,[1]语言配置表!$A:$B,2,FALSE)","v":"智者之力"},null,{"$f":"\"icon_skill_\"&G30","v":"icon_skill_30002"},null,30002,null,5,1,93,73,null,2,10]
[300022,null,{"$f":"VLOOKUP(K31,[1]语言配置表!$A:$B,2,FALSE)","v":"智者之力"},null,"icon_skill_30002",null,30002,null,5,2,93,73,null,2,20]
[300023,null,{"$f":"VLOOKUP(K32,[1]语言配置表!$A:$B,2,FALSE)","v":"智者之力"},null,"icon_skill_30002",null,30002,null,5,3,93,73,null,2,30]
[300024,null,{"$f":"VLOOKUP(K33,[1]语言配置表!$A:$B,2,FALSE)","v":"智者之力"},null,"icon_skill_30002",null,30002,null,5,4,93,73,null,2,40]
[300031,null,{"$f":"VLOOKUP(K34,[1]语言配置表!$A:$B,2,FALSE)","v":"生命之力"},null,"icon_skill_10002",null,30003,null,5,1,94,74,null,1,10]
[300032,null,{"$f":"VLOOKUP(K35,[1]语言配置表!$A:$B,2,FALSE)","v":"生命之力"},null,"icon_skill_10002",null,30003,null,5,2,94,74,null,1,20]
[300033,null,{"$f":"VLOOKUP(K36,[1]语言配置表!$A:$B,2,FALSE)","v":"生命之力"},null,"icon_skill_10002",null,30003,null,5,3,94,74,null,1,30]
[300034,null,{"$f":"VLOOKUP(K37,[1]语言配置表!$A:$B,2,FALSE)","v":"生命之力"},null,"icon_skill_10002",null,30003,null,5,4,94,74,null,1,40]
[300041,null,{"$f":"VLOOKUP(K38,[1]语言配置表!$A:$B,2,FALSE)","v":"烈焰持续"},null,{"$f":"\"icon_skill_\"&G38","v":"icon_skill_30004"},"S30004",30004,null,4,1,95,75,1]
[300042,null,{"$f":"VLOOKUP(K39,[1]语言配置表!$A:$B,2,FALSE)","v":"烈焰持续"},null,"icon_skill_30004","S30004",30004,null,4,2,95,75,2]
[300043,null,{"$f":"VLOOKUP(K40,[1]语言配置表!$A:$B,2,FALSE)","v":"烈焰持续"},null,"icon_skill_30004","S30004",30004,null,4,3,95,75,3]
[300044,null,{"$f":"VLOOKUP(K41,[1]语言配置表!$A:$B,2,FALSE)","v":"烈焰持续"},null,"icon_skill_30004","S30004",30004,null,4,4,95,75,4]
[300051,null,{"$f":"VLOOKUP(K42,[1]语言配置表!$A:$B,2,FALSE)","v":"超凡暴击"},null,"icon_skill_30005","S30005",30005,null,4,1,96,76,10]
[300052,null,{"$f":"VLOOKUP(K43,[1]语言配置表!$A:$B,2,FALSE)","v":"超凡暴击"},null,"icon_skill_30005","S30005",30005,null,4,2,96,76,20]
[300053,null,{"$f":"VLOOKUP(K44,[1]语言配置表!$A:$B,2,FALSE)","v":"超凡暴击"},null,"icon_skill_30005","S30005",30005,null,4,3,96,76,30]
[300054,null,{"$f":"VLOOKUP(K45,[1]语言配置表!$A:$B,2,FALSE)","v":"超凡暴击"},null,"icon_skill_30005","S30005",30005,null,4,4,96,76,40]
[200011,null,{"$f":"VLOOKUP(K46,[1]语言配置表!$A:$B,2,FALSE)","v":"光辉治愈"},null,"icon_skill_20001","S20001",20001,6,2,1,55,51,800]
[200012,null,{"$f":"VLOOKUP(K47,[1]语言配置表!$A:$B,2,FALSE)","v":"光辉治愈"},null,"icon_skill_20001","S20001",20001,6,2,2,55,52,900]
[200013,null,{"$f":"VLOOKUP(K48,[1]语言配置表!$A:$B,2,FALSE)","v":"光辉治愈"},null,"icon_skill_20001","S20001",20001,6,2,3,55,53,1100]
[200014,null,{"$f":"VLOOKUP(K49,[1]语言配置表!$A:$B,2,FALSE)","v":"光辉治愈"},null,"icon_skill_20001","S20001",20001,6,2,4,55,54,1200]
[200021,null,{"$f":"VLOOKUP(K50,[1]语言配置表!$A:$B,2,FALSE)","v":"神圣力量"},null,{"$f":"\"icon_skill_\"&G50","v":"icon_skill_20002"},null,20002,null,5,1,77,81,null,2,10]
[200022,null,{"$f":"VLOOKUP(K51,[1]语言配置表!$A:$B,2,FALSE)","v":"神圣力量"},null,"icon_skill_20002",null,20002,null,5,2,77,81,null,2,20]
[200023,null,{"$f":"VLOOKUP(K52,[1]语言配置表!$A:$B,2,FALSE)","v":"神圣力量"},null,"icon_skill_20002",null,20002,null,5,3,77,81,null,2,30]
[200024,null,{"$f":"VLOOKUP(K53,[1]语言配置表!$A:$B,2,FALSE)","v":"神圣力量"},null,"icon_skill_20002",null,20002,null,5,4,77,81,null,2,40]
[200031,null,{"$f":"VLOOKUP(K54,[1]语言配置表!$A:$B,2,FALSE)","v":"生命之力"},null,"icon_skill_10002",null,20003,null,5,1,78,82,null,1,10]
[200032,null,{"$f":"VLOOKUP(K55,[1]语言配置表!$A:$B,2,FALSE)","v":"生命之力"},null,"icon_skill_10002",null,20003,null,5,2,78,82,null,1,20]
[200033,null,{"$f":"VLOOKUP(K56,[1]语言配置表!$A:$B,2,FALSE)","v":"生命之力"},null,"icon_skill_10002",null,20003,null,5,3,78,82,null,1,30]
[200034,null,{"$f":"VLOOKUP(K57,[1]语言配置表!$A:$B,2,FALSE)","v":"生命之力"},null,"icon_skill_10002",null,20003,null,5,4,78,82,null,1,40]
[200041,null,{"$f":"VLOOKUP(K58,[1]语言配置表!$A:$B,2,FALSE)","v":"急救之光"},null,"icon_skill_20004",null,20004,null,4,1,79,83,"50;50"]
[200042,null,{"$f":"VLOOKUP(K59,[1]语言配置表!$A:$B,2,FALSE)","v":"急救之光"},null,"icon_skill_20004",null,20004,null,4,2,79,83,"60;51"]
[200043,null,{"$f":"VLOOKUP(K60,[1]语言配置表!$A:$B,2,FALSE)","v":"急救之光"},null,"icon_skill_20004",null,20004,null,4,3,79,83,"70;51"]
[200044,null,{"$f":"VLOOKUP(K61,[1]语言配置表!$A:$B,2,FALSE)","v":"急救之光"},null,"icon_skill_20004",null,20004,null,4,4,79,83,"80;52"]
[200051,null,{"$f":"VLOOKUP(K62,[1]语言配置表!$A:$B,2,FALSE)","v":"光辉复苏"},null,"icon_skill_20005",null,20005,null,4,1,80,84,1]
[200052,null,{"$f":"VLOOKUP(K63,[1]语言配置表!$A:$B,2,FALSE)","v":"光辉复苏"},null,"icon_skill_20005",null,20005,null,4,2,80,84,2]
[200053,null,{"$f":"VLOOKUP(K64,[1]语言配置表!$A:$B,2,FALSE)","v":"光辉复苏"},null,"icon_skill_20005",null,20005,null,4,3,80,84,3]
[200054,null,{"$f":"VLOOKUP(K65,[1]语言配置表!$A:$B,2,FALSE)","v":"光辉复苏"},null,"icon_skill_20005",null,20005,null,4,4,80,84,4]
[400011,null,{"$f":"VLOOKUP(K66,[1]语言配置表!$A:$B,2,FALSE)","v":"箭羽风暴"},null,"icon_skill_40001","S40001",40001,6,2,1,60,56,100]
[400012,null,{"$f":"VLOOKUP(K67,[1]语言配置表!$A:$B,2,FALSE)","v":"箭羽风暴"},null,"icon_skill_40001","S40001",40001,6,2,2,60,57,120]
[400013,null,{"$f":"VLOOKUP(K68,[1]语言配置表!$A:$B,2,FALSE)","v":"箭羽风暴"},null,"icon_skill_40001","S40001",40001,6,2,3,60,58,140]
[400014,null,{"$f":"VLOOKUP(K69,[1]语言配置表!$A:$B,2,FALSE)","v":"箭羽风暴"},null,"icon_skill_40001","S40001",40001,6,2,4,60,59,180]
[400021,null,{"$f":"VLOOKUP(K70,[1]语言配置表!$A:$B,2,FALSE)","v":"弓箭精通"},null,{"$f":"\"icon_skill_\"&G70","v":"icon_skill_40002"},null,40002,null,5,1,85,89,null,2,10]
[400022,null,{"$f":"VLOOKUP(K71,[1]语言配置表!$A:$B,2,FALSE)","v":"弓箭精通"},null,"icon_skill_40002",null,40002,null,5,2,85,89,null,2,20]
[400023,null,{"$f":"VLOOKUP(K72,[1]语言配置表!$A:$B,2,FALSE)","v":"弓箭精通"},null,"icon_skill_40002",null,40002,null,5,3,85,89,null,2,30]
[400024,null,{"$f":"VLOOKUP(K73,[1]语言配置表!$A:$B,2,FALSE)","v":"弓箭精通"},null,"icon_skill_40002",null,40002,null,5,4,85,89,null,2,40]
[400031,null,{"$f":"VLOOKUP(K74,[1]语言配置表!$A:$B,2,FALSE)","v":"生命之力"},null,"icon_skill_10002",null,40003,null,5,1,86,90,null,1,10]
[400032,null,{"$f":"VLOOKUP(K75,[1]语言配置表!$A:$B,2,FALSE)","v":"生命之力"},null,"icon_skill_10002",null,40003,null,5,2,86,90,null,1,20]
[400033,null,{"$f":"VLOOKUP(K76,[1]语言配置表!$A:$B,2,FALSE)","v":"生命之力"},null,"icon_skill_10002",null,40003,null,5,3,86,90,null,1,30]
[400034,null,{"$f":"VLOOKUP(K77,[1]语言配置表!$A:$B,2,FALSE)","v":"生命之力"},null,"icon_skill_10002",null,40003,null,5,4,86,90,null,1,40]
[400041,null,{"$f":"VLOOKUP(K78,[1]语言配置表!$A:$B,2,FALSE)","v":"无尽射击"},null,"icon_skill_40004",null,40004,null,4,1,87,91,3]
[400042,null,{"$f":"VLOOKUP(K79,[1]语言配置表!$A:$B,2,FALSE)","v":"无尽射击"},null,"icon_skill_40004",null,40004,null,4,2,87,91,5]
[400043,null,{"$f":"VLOOKUP(K80,[1]语言配置表!$A:$B,2,FALSE)","v":"无尽射击"},null,"icon_skill_40004",null,40004,null,4,3,87,91,7]
[400044,null,{"$f":"VLOOKUP(K81,[1]语言配置表!$A:$B,2,FALSE)","v":"无尽射击"},null,"icon_skill_40004",null,40004,null,4,4,87,91,9]
[400051,null,{"$f":"VLOOKUP(K82,[1]语言配置表!$A:$B,2,FALSE)","v":"终结射击"},null,"icon_skill_40005",null,40005,null,4,1,88,92,"10;20"]
[400052,null,{"$f":"VLOOKUP(K83,[1]语言配置表!$A:$B,2,FALSE)","v":"终结射击"},null,"icon_skill_40005",null,40005,null,4,2,88,92,"15;30"]
[400053,null,{"$f":"VLOOKUP(K84,[1]语言配置表!$A:$B,2,FALSE)","v":"终结射击"},null,"icon_skill_40005",null,40005,null,4,3,88,92,"20;40"]
[400054,null,{"$f":"VLOOKUP(K85,[1]语言配置表!$A:$B,2,FALSE)","v":"终结射击"},null,"icon_skill_40005",null,40005,null,4,4,88,92,"25;50"]
[1100011,null,"大蛇第一个技能，对敌人照成伤害，并将敌人击退一段距离",null,{"$f":"\"icon_skill_\"&G86","v":"icon_skill_110001"},"S110001",110001,5,2,1,405077,null,250,null,null,null,"蛇BOSS"]
[1100012,null,"大蛇第一个技能，对敌人照成伤害，并将敌人击退一段距离",null,"icon_skill_110001","S110001",110001,5,2,2,405077,null,270]
[1100013,null,"大蛇第一个技能，对敌人照成伤害，并将敌人击退一段距离",null,"icon_skill_110001","S110001",110001,5,2,3,405077,null,290]
[1100014,null,"大蛇第一个技能，对敌人照成伤害，并将敌人击退一段距离",null,"icon_skill_110001","S110001",110001,5,2,4,405077,null,310]
[1100021,null,"大蛇技能2，吐火焰经过的敌人收到伤害,没0.2秒收到一次伤害",null,"icon_skill_110002","S110002",110002,10,2,1,405077,null,40,null,null,null,"蛇BOSS"]
[1100022,null,"大蛇技能2，吐火焰经过的敌人收到伤害,没0.2秒收到一次伤害",null,"icon_skill_110002","S110002",110002,10,2,2,405077,null,50]
[1100023,null,"大蛇技能2，吐火焰经过的敌人收到伤害,没0.2秒收到一次伤害",null,"icon_skill_110002","S110002",110002,10,2,3,405077,null,60]
[1100024,null,"大蛇技能2，吐火焰经过的敌人收到伤害,没0.2秒收到一次伤害",null,"icon_skill_110002","S110002",110002,10,2,4,405077,null,70]
[1200011,null,"小蛇精英怪技能 向前冲撞，对冲撞的敌人造成伤害",null,"icon_skill_120001","S120001",120001,4,2,1,405077,null,120,null,null,null,"精英蛇"]
[1200012,null,"小蛇精英怪技能 向前冲撞，对冲撞的敌人造成伤害",null,"icon_skill_120001","S120001",120001,4,2,2,405077,null,130]
[1200013,null,"小蛇精英怪技能 向前冲撞，对冲撞的敌人造成伤害",null,"icon_skill_120001","S120001",120001,4,2,3,405077,null,140]
[1200014,null,"小蛇精英怪技能 向前冲撞，对冲撞的敌人造成伤害",null,"icon_skill_120001","S120001",120001,4,2,4,405077,null,150]
[1300011,null,"狼精英技能",null,"icon_skill_130001","S130001",130001,5,2,1,405077,null,120,null,null,null,"精英狗"]
[1300012,null,"狼精英技能",null,"icon_skill_130001","S130001",130001,5,2,2,405077,null,130]
[1300013,null,"狼精英技能",null,"icon_skill_130001","S130001",130001,5,2,3,405077,null,140]
[1300014,null,"狼精英技能",null,"icon_skill_130001","S130001",130001,5,2,4,405077,null,150]
[1400011,null,"狼boss的第一个技能",null,"icon_skill_140001","S140001",140001,3,2,1,405077,null,250,null,null,null,"狗BOSS"]
[1400012,null,"狼boss的第一个技能",null,"icon_skill_140001","S140001",140001,3,2,2,405077,null,270]
[1400013,null,"狼boss的第一个技能",null,"icon_skill_140001","S140001",140001,3,2,3,405077,null,290]
[1400014,null,"狼boss的第一个技能",null,"icon_skill_140001","S140001",140001,3,2,4,405077,null,310]
[1400031,null,"狼boss 第3个技能，跳跃攻击范围那的敌人",null,"icon_skill_140003","S140003",140003,8,2,1,405077,null,300,null,null,null,"狗BOSS"]
[1400032,null,"狼boss 第3个技能，跳跃攻击范围那的敌人",null,"icon_skill_140003","S140003",140003,8,2,2,405077,null,350]
[1400033,null,"狼boss 第3个技能，跳跃攻击范围那的敌人",null,"icon_skill_140003","S140003",140003,8,2,3,405077,null,400]
[1400034,null,"狼boss 第3个技能，跳跃攻击范围那的敌人",null,"icon_skill_140003","S140003",140003,8,2,4,405077,null,450]
[9000011,null,"玩家点击屏幕的技能",null,{"$f":"\"icon_skill_\"&G110","v":"icon_skill_900001"},"S900001",900001,0,4,4,405077,null,10]

{"sheet":"SkillUpConfig","index":1,"n_rows":24,"n_cols":5,"rows_kept":24,"cut":false,"hidden":false,"merged":[]}
["ID","upType","upValue","idx","skillLv"]
["int","int","int","int","int"]
[]
["表ID\n技能ID的最后两位\n1=普攻","1.等级\n2.星级","具体星级\n或等级","技能位置\n对应HeroModel表的下标","对应HeroModel表的下标的等级\n"]
[1,1,1,0,1]
[11,1,1,1,1]
[12,1,31,1,2]
[13,1,131,1,3]
[14,1,231,1,4]
[21,1,11,2,1]
[22,1,51,2,2]
[23,1,151,2,3]
[24,1,251,2,4]
[31,2,5,3,1]
[32,1,71,3,2]
[33,1,171,3,3]
[34,1,271,3,4]
[41,2,7,4,1]
[42,1,91,4,2]
[43,1,191,4,3]
[44,1,291,4,4]
[51,2,9,5,1]
[52,1,111,5,2]
[53,1,211,5,3]

{"sheet":"技能设计","index":2,"n_rows":13,"n_cols":9,"rows_kept":13,"cut":false,"hidden":false,"merged":[[1,0,3,0],[4,0,6,0],[7,0,9,0],[10,0,12,0],[1,1,3,1],[4,1,6,1],[7,1,9,1],[10,1,12,1],[1,2,3,2],[4,2,6,2],[7,2,9,2],[10,2,12,2],[1,3,3,3],[4,3,6,3],[7,3,9,3],[10,3,12,3],[1,4,3,4],[4,4,6,4],[7,4,9,4],[10,4,12,4],[1,5,3,5],[4,5,6,5],[7,5,9,5],[10,5,12,5],[1,6,3,6],[4,6,6,6],[7,6,9,6],[10,6,12,6],[1,7,3,7],[4,7,6,7],[7,7,9,7],[10,7,12,7],[1,8,3,8],[4,8,6,8],[7,8,9,8],[10,8,12,8]]}
["英雄ID","英雄名","职业","品质","技能1","技能2","技能3","技能4","技能5"]
[105,"加雷斯·风暴","1.战士","传说ssr","旋风斩:\n释放1道剑气，造成伤害","加血:\n提升血量{0}","防御:\n提升防御{0}","专精:\n增加{0}道[旋风斩]的剑气数量","坚韧:\n降低{0}的暴击伤害"]
[]
[]
[107,"马修·星辰","2.法师","传说ssr","火焰烧烤:\n对前方范围释放火焰，对范围内的敌人进行多次灼烧","加攻:\n提升攻击力{0}","加血:\n提升血量{0}","专精:\n延长{0}秒[火焰烧烤]的持续时间","技能暴击:\n提升{0}技能暴击率"]
[]
[]
[113,"卢克·净魂","3.牧师","传说ssr","治疗:\n对生命最低的英雄进行治疗","加攻:\n提升攻击力{0}","加血:\n提升血量{0}","专精:\n对生命值低于{0}%的英雄，提高{1}%的治疗量","平等:\n同时治疗{0}名英雄"]
[]
[]
[116,"莱恩·影踪","4.游侠","传说ssr","连续射击:\n向前方连续射出多支魔法箭","加攻:\n提升攻击力{0}","加血:\n提升血量{0}","专精:\n增加{0}支[连续射击]的魔法箭","追击:\n对生命值低于{0}的敌人，额外造成{1}伤害"]
[]
[null,null,"4.游侠"]