{"text_format":"2","workbook":"xlsx","n_sheets":4,"sheets":["语言配置表","LanguageChineseConfig","说明页","关卡内常用"],"not_rendered":{"charts":0,"images":0,"macros":0,"external_links":0,"defined_names":1,"comments":0,"pivot_tables":0},"unopened":[],"bounds":{"document_bytes":16777216,"sheet_cells":100000,"run_cost":"one","rows_first":2000,"rows_last":500,"rows_between":2000,"halvings":0,"cell_chars":16384,"cell_head_chars":4096},"cells_cut":0,"cells_raw":0,"read":"whole","date_system":"1900"}

{"sheet":"语言配置表","index":0,"n_rows":5,"n_cols":26,"rows_kept":5,"cut":false,"hidden":false,"merged":[]}
["序列","版本","操作人","类别/模块",null,"注释","序列",null,"号段",10,11,12,13,14,15,16,17,18,20,21,22,30,40,50,80,90]
[null,null,null,"见右边黄色区域 →→",{"$nulls":4},"类别/模块",{"$f":"VLOOKUP(J1,说明页!$B$2:$C$99,2,FALSE)","v":"道具"},{"$f":"VLOOKUP(K1,说明页!$B$2:$C$99,2,FALSE)","v":"武器"},{"$f":"VLOOKUP(L1,说明页!$B$2:$C$99,2,FALSE)","v":"秘石"},{"$f":"VLOOKUP(M1,说明页!$B$2:$C$99,2,FALSE)","v":"料理"},{"$f":"VLOOKUP(N1,说明页!$B$2:$C$99,2,FALSE)","v":"地图道具"},{"$f":"VLOOKUP(O1,说明页!$B$2:$C$99,2,FALSE)","v":"遗物"},{"$f":"VLOOKUP(P1,说明页!$B$2:$C$99,2,FALSE)","v":"藏宝图"},{"$f":"VLOOKUP(Q1,说明页!$B$2:$C$99,2,FALSE)","v":"神器"},{"$f":"VLOOKUP(R1,说明页!$B$2:$C$99,2,FALSE)","v":"材料"},{"$f":"VLOOKUP(S1,说明页!$B$2:$C$99,2,FALSE)","v":"英雄"},{"$f":"VLOOKUP(T1,说明页!$B$2:$C$99,2,FALSE)","v":"怪物"},{"$f":"VLOOKUP(U1,说明页!$B$2:$C$99,2,FALSE)","v":"技能"},{"$f":"VLOOKUP(V1,说明页!$B$2:$C$99,2,FALSE)","v":"任务"},{"$f":"VLOOKUP(W1,说明页!$B$2:$C$99,2,FALSE)","v":"UI"},{"$f":"VLOOKUP(X1,说明页!$B$2:$C$99,2,FALSE)","v":"战斗"},{"$f":"VLOOKUP(Y1,说明页!$B$2:$C$99,2,FALSE)","v":"杂项&通用"},{"$f":"VLOOKUP(Z1,说明页!$B$2:$C$99,2,FALSE)","v":"剧情"}]
[{"$nulls":8},"当前号段已用的最大值\n新增ID=右侧数字+1",{"$f":"MAX(J1*10000,MAX(IF($A:$A<J1*10000+(K1-J1)*10000-1,$A:$A)))","v":100002},{"$f":"MAX(K1*10000,MAX(IF($A:$A<K1*10000+(L1-K1)*10000-1,$A:$A)))","v":110000},{"$f":"MAX(L1*10000,MAX(IF($A:$A<L1*10000+(M1-L1)*10000-1,$A:$A)))","v":120000},{"$f":"MAX(M1*10000,MAX(IF($A:$A<M1*10000+(N1-M1)*10000-1,$A:$A)))","v":130000},{"$f":"MAX(N1*10000,MAX(IF($A:$A<N1*10000+(O1-N1)*10000-1,$A:$A)))","v":140000},{"$f":"MAX(O1*10000,MAX(IF($A:$A<O1*10000+(P1-O1)*10000-1,$A:$A)))","v":150000},{"$f":"MAX(P1*10000,MAX(IF($A:$A<P1*10000+(Q1-P1)*10000-1,$A:$A)))","v":160000},{"$f":"MAX(Q1*10000,MAX(IF($A:$A<Q1*10000+(R1-Q1)*10000-1,$A:$A)))","v":170000},{"$f":"MAX(R1*10000,MAX(IF($A:$A<R1*10000+(S1-R1)*10000-1,$A:$A)))","v":180000},{"$f":"MAX(S1*10000,MAX(IF($A:$A<S1*10000+(T1-S1)*10000-1,$A:$A)))","v":200000},{"$f":"MAX(T1*10000,MAX(IF($A:$A<T1*10000+(U1-T1)*10000-1,$A:$A)))","v":210000},{"$f":"MAX(U1*10000,MAX(IF($A:$A<U1*10000+(V1-U1)*10000-1,$A:$A)))","v":220000},{"$f":"MAX(V1*10000,MAX(IF($A:$A<V1*10000+(W1-V1)*10000-1,$A:$A)))","v":300000},{"$f":"MAX(W1*10000,MAX(IF($A:$A<W1*10000+(X1-W1)*10000-2001,$A:$A)))","v":400000},{"$f":"MAX(X1*10000,MAX(IF($A:$A<X1*10000+(Y1-X1)*10000-1,$A:$A)))","v":500000},{"$f":"MAX(Y1*10000,MAX(IF($A:$A<Y1*10000+(Z1-Y1)*10000-1,$A:$A)))","v":800000},{"$f":"MAX(Z1*10000,MAX(IF($A:$A<Z1*10000+(Z1)*10000-1,$A:$A)))","v":900000}]
[100001,null,"邹舸","道具","金币",null,{"$f":"IF(A4=\"\",\"\",A4)","v":100001}]
[100002,null,"邹舸","道具","道具"]

{"sheet":"LanguageChineseConfig","index":1,"n_rows":6,"n_cols":2,"rows_kept":6,"cut":false,"hidden":false,"merged":[]}
["ID","txt"]
["int","string"]
[]
["ID","文本内容"]
[{"$f":"IF(语言配置表!A4=\"\",\"\",语言配置表!A4)","v":100001},{"$f":"IF(语言配置表!A4=\"\",\"CN_待填充内容\",语言配置表!E4)","v":"金币"}]
[{"$f":"IF(语言配置表!A5=\"\",\"\",语言配置表!A5)","v":100002},{"$f":"IF(语言配置表!A5=\"\",\"CN_待填充内容\",语言配置表!E5)","v":"道具"}]

{"sheet":"说明页","index":2,"n_rows":44,"n_cols":10,"rows_kept":44,"cut":false,"hidden":false,"merged":[[0,4,0,5],[0,7,0,8],[1,0,10,0]]}
["大模块","小模块","类别/模块说明","同模块下如果需要细分可以新增小类，以进行区别\n新增后一定通知邹舸加监测，否则语言表ID号段监听会失效！！","UI文本按照系统分配ID段，每个ID段默认占用100个ID，如果觉得需要可以预留，请新加UI的策划都在这里申明ID段",null,"已用最大值","战斗文本按照系统分配ID段，每个ID段默认占用100个ID，如果觉得需要可以预留，请新加UI的策划都在这里申明ID段",null,"已用最大值"]
["道具模块",10,"道具",null,"401001-401100","招募",{"$f":"MAX(INT(LEFT(E2,6)),MAX(IF(语言配置表!$A:$A<INT(RIGHT(E2,6)),语言配置表!$A:$A)))","v":401001},"500001-501000","战斗技能/BUFF",{"$f":"MAX(INT(LEFT(H2,6)),MAX(IF(语言配置表!$A:$A<INT(RIGHT(H2,6)),语言配置表!$A:$A)))","v":500001}]
[null,11,"武器",null,"401101-401200","卡池信息文本",{"$f":"MAX(INT(LEFT(E3,6)),MAX(IF(语言配置表!$A:$A<INT(RIGHT(E3,6)),语言配置表!$A:$A)))","v":401101},"501001-501200","选拔赛",{"$f":"MAX(INT(LEFT(H3,6)),MAX(IF(语言配置表!$A:$A<INT(RIGHT(H3,6)),语言配置表!$A:$A)))","v":501001}]
[null,12,"秘石",null,"401201-401400","冒险相关UI文本",{"$f":"MAX(INT(LEFT(E4,6)),MAX(IF(语言配置表!$A:$A<INT(RIGHT(E4,6)),语言配置表!$A:$A)))","v":401201},"501201-501400","资源本",{"$f":"MAX(INT(LEFT(H4,6)),MAX(IF(语言配置表!$A:$A<INT(RIGHT(H4,6)),语言配置表!$A:$A)))","v":501201}]
[null,13,"料理",null,"401401-401600","商业街",{"$f":"MAX(INT(LEFT(E5,6)),MAX(IF(语言配置表!$A:$A<INT(RIGHT(E5,6)),语言配置表!$A:$A)))","v":401401}]
[null,14,"地图道具",null,"401601-401700","背包",{"$f":"MAX(INT(LEFT(E6,6)),MAX(IF(语言配置表!$A:$A<INT(RIGHT(E6,6)),语言配置表!$A:$A)))","v":401601}]
[null,15,"遗物",null,"401701-401800","编队和队伍预设",{"$f":"MAX(INT(LEFT(E7,6)),MAX(IF(语言配置表!$A:$A<INT(RIGHT(E7,6)),语言配置表!$A:$A)))","v":401701}]
[null,16,"藏宝图",null,"401801-402000","英雄养成",{"$f":"MAX(INT(LEFT(E8,6)),MAX(IF(语言配置表!$A:$A<INT(RIGHT(E8,6)),语言配置表!$A:$A)))","v":401801}]
[null,17,"神器",null,"402001-402100","商城",{"$f":"MAX(INT(LEFT(E9,6)),MAX(IF(语言配置表!$A:$A<INT(RIGHT(E9,6)),语言配置表!$A:$A)))","v":402001}]
[null,18,"材料",null,"403001-403100","主界面/账号",{"$f":"MAX(INT(LEFT(E10,6)),MAX(IF(语言配置表!$A:$A<INT(RIGHT(E10,6)),语言配置表!$A:$A)))","v":403001}]
[null,19,null,null,"402101-402200","秘石&符文",{"$f":"MAX(INT(LEFT(E11,6)),MAX(IF(语言配置表!$A:$A<INT(RIGHT(E11,6)),语言配置表!$A:$A)))","v":402101}]
["英雄模块",20,"英雄",null,"400001-400100","通用UI",{"$f":"MAX(INT(LEFT(E12,6)),MAX(IF(语言配置表!$A:$A<INT(RIGHT(E12,6)),语言配置表!$A:$A)))","v":400001}]
[null,21,"怪物",null,"402201-402300","藏宝图",{"$f":"MAX(INT(LEFT(E13,6)),MAX(IF(语言配置表!$A:$A<INT(RIGHT(E13,6)),语言配置表!$A:$A)))","v":402201}]
[null,22,"技能",null,"402301-402400","商业街",{"$f":"MAX(INT(LEFT(E14,6)),MAX(IF(语言配置表!$A:$A<INT(RIGHT(E14,6)),语言配置表!$A:$A)))","v":402301}]
["任务模块",30,"任务",null,"402401-402500","聊天&好友",{"$f":"MAX(INT(LEFT(E15,6)),MAX(IF(语言配置表!$A:$A<INT(RIGHT(E15,6)),语言配置表!$A:$A)))","v":402401}]
["UI模块",40,"UI",null,"402501-402600","共斗",{"$f":"MAX(INT(LEFT(E16,6)),MAX(IF(语言配置表!$A:$A<INT(RIGHT(E16,6)),语言配置表!$A:$A)))","v":402501}]
["战斗模块",50,"战斗",null,"498001-499999","新手引导",{"$f":"MAX(INT(LEFT(E17,6)),MAX(IF(语言配置表!$A:$A<INT(RIGHT(E17,6)),语言配置表!$A:$A)))","v":498001}]
["通用模块",80,"杂项&通用"]
["剧情模块",90,"剧情"]
{"$rows_empty":8}
[{"$nulls":4},"200+","英雄名"]
[{"$nulls":4},"201+","英雄称号"]
[{"$nulls":4},"202+","英雄台词"]
[{"$nulls":4},"203+","英雄道具说明"]
[{"$nulls":4},"204+","英雄碎片道具"]
[{"$nulls":4},"205+","英雄碎片道具说明"]
[]
[{"$nulls":4},"字段关联表缩写字母","关联表"]
[{"$nulls":4},"l","LanguageChinese"]
[{"$nulls":4},"w","Item"]
[{"$nulls":4},"c","chouka"]
[]
[]
[]
[{"$nulls":4},"300001-301000","悬赏任务（少量混杂冒险地图内任务）"]
[{"$nulls":4},"301001-310000","冒险地图内任务"]
[{"$nulls":4},"310001-","周常日常等任务"]

{"sheet":"关卡内常用","index":3,"n_rows":1127,"n_cols":13,"rows_kept":1127,"cut":false,"hidden":false,"merged":[]}
["ID","文本内容","哪儿用到"]
[140025,{"$f":"VLOOKUP(A2,语言配置表!$A$1:$E$9722,5,0)","v":{"$error":"#N/A"}},"石碑机关用",null,null,null,"离魂三角铁","致命体验",null,null,null,101126,{"$f":"COUNTIF(语言配置表!A:A,关卡内常用!L2)","v":0}]
[900453,{"$f":"VLOOKUP(A3,语言配置表!$A$1:$E$9722,5,0)","v":{"$error":"#N/A"}},"对话常用",null,null,null,"冥河的引航灯",{"$nulls":4},101125,{"$f":"COUNTIF(语言配置表!A:A,关卡内常用!L3)","v":0}]
[900124,{"$f":"VLOOKUP(A4,语言配置表!$A$1:$E$9722,5,0)","v":{"$error":"#N/A"}},"篝火",null,null,null,"彼岸之花",{"$nulls":4},101124,{"$f":"COUNTIF(语言配置表!A:A,关卡内常用!L4)","v":0}]
[900125,{"$f":"VLOOKUP(A5,语言配置表!$A$1:$E$9722,5,0)","v":{"$error":"#N/A"}},"篝火",null,null,null,"剧毒研磨皿",{"$nulls":4},101123,{"$f":"COUNTIF(语言配置表!A:A,关卡内常用!L5)","v":0}]
[900478,{"$f":"VLOOKUP(A6,语言配置表!$A$1:$E$9722,5,0)","v":{"$error":"#N/A"}},"藏宝图挖掘玩法倒计时开始提示",null,null,null,"震魂手鼓","强者之魂",null,null,null,101122,{"$f":"COUNTIF(语言配置表!A:A,关卡内常用!L6)","v":0}]
[900460,{"$f":"VLOOKUP(A7,语言配置表!$A$1:$E$9722,5,0)","v":{"$error":"#N/A"}},"挖掘刷精英怪",null,null,null,"不熄之桶",{"$nulls":4},101121,{"$f":"COUNTIF(语言配置表!A:A,关卡内常用!L7)","v":0}]
[900465,{"$f":"VLOOKUP(A8,语言配置表!$A$1:$E$9722,5,0)","v":{"$error":"#N/A"}},"挖掘刷BOSS",null,null,null,"躁动焚香",{"$nulls":4},101120,{"$f":"COUNTIF(语言配置表!A:A,关卡内常用!L8)","v":0}]
[900503,{"$f":"VLOOKUP(A9,语言配置表!$A$1:$E$9722,5,0)","v":{"$error":"#N/A"}},"复活",null,null,null,"爆裂留声机",{"$nulls":4},101119,{"$f":"COUNTIF(语言配置表!A:A,关卡内常用!L9)","v":0}]
[900979,{"$f":"VLOOKUP(A10,语言配置表!$A$1:$E$9722,5,0)","v":{"$error":"#N/A"}},"藏宝图被炸到掉贝壳",null,null,null,"仍在走动的计时器","爆破专家",null,null,null,101118,{"$f":"COUNTIF(语言配置表!A:A,关卡内常用!L10)","v":0}]
[{"$nulls":6},"机械式打火机",{"$nulls":4},101117,{"$f":"COUNTIF(语言配置表!A:A,关卡内常用!L11)","v":0}]
[{"$nulls":6},"硫磺粉末",{"$nulls":4},101116,{"$f":"COUNTIF(语言配置表!A:A,关卡内常用!L12)","v":0}]
[{"$nulls":6},"爆破雷管",{"$nulls":4},101115,{"$f":"COUNTIF(语言配置表!A:A,关卡内常用!L13)","v":0}]
[{"$nulls":6},"寒风唱机","冰冷笑话",null,null,null,101114,{"$f":"COUNTIF(语言配置表!A:A,关卡内常用!L14)","v":0}]
[{"$nulls":6},"速冻烈焰",{"$nulls":4},101113,{"$f":"COUNTIF(语言配置表!A:A,关卡内常用!L15)","v":0}]
[{"$nulls":6},"“凌冽”香水",{"$nulls":4},101112,{"$f":"COUNTIF(语言配置表!A:A,关卡内常用!L16)","v":0}]
[{"$nulls":6},"冷饮制造器",{"$nulls":4},101111,{"$f":"COUNTIF(语言配置表!A:A,关卡内常用!L17)","v":0}]
[{"$nulls":6},"春醒之弦","破茧成蝶",null,null,null,101110,{"$f":"COUNTIF(语言配置表!A:A,关卡内常用!L18)","v":0}]
[{"$nulls":6},"扑火之光",{"$nulls":4},101109,{"$f":"COUNTIF(语言配置表!A:A,关卡内常用!L19)","v":0}]
[{"$nulls":6},"孕育之露",{"$nulls":4},101108,{"$f":"COUNTIF(语言配置表!A:A,关卡内常用!L20)","v":0}]
[{"$nulls":6},"蛰伏之匣",{"$nulls":4},101107,{"$f":"COUNTIF(语言配置表!A:A,关卡内常用!L21)","v":0}]
[{"$nulls":6},"地牛号角","三百勇士",null,null,null,101106,{"$f":"COUNTIF(语言配置表!A:A,关卡内常用!L22)","v":0}]
[{"$nulls":6},"焦油火把",{"$nulls":4},101105,{"$f":"COUNTIF(语言配置表!A:A,关卡内常用!L23)","v":0}]
[{"$nulls":6},"涂满药膏的绷带",{"$nulls":4},101104,{"$f":"COUNTIF(语言配置表!A:A,关卡内常用!L24)","v":0}]
[{"$nulls":6},"骨灰瓮",{"$nulls":4},101103,{"$f":"COUNTIF(语言配置表!A:A,关卡内常用!L25)","v":0}]
[{"$nulls":6},"舒心留声机","天才的抚慰",null,null,null,101102,{"$f":"COUNTIF(语言配置表!A:A,关卡内常用!L26)","v":0}]
[{"$nulls":6},"和煦随身炉",{"$nulls":4},101101,{"$f":"COUNTIF(语言配置表!A:A,关卡内常用!L27)","v":0}]
[{"$nulls":6},"宁神试剂",{"$nulls":4},101100,{"$f":"COUNTIF(语言配置表!A:A,关卡内常用!L28)","v":0}]
[{"$nulls":6},"惊奇收纳盒",{"$nulls":4},101099,{"$f":"COUNTIF(语言配置表!A:A,关卡内常用!L29)","v":0}]
[{"$nulls":6},"鸣沙瓶","坚若磐石",null,null,null,101098,{"$f":"COUNTIF(语言配置表!A:A,关卡内常用!L30)","v":0}]
[{"$nulls":6},"莹矿原石",{"$nulls":4},101097,{"$f":"COUNTIF(语言配置表!A:A,关卡内常用!L31)","v":0}]
[{"$nulls":6},"熏香玉丸",{"$nulls":4},101096,{"$f":"COUNTIF(语言配置表!A:A,关卡内常用!L32)","v":0}]
[{"$nulls":6},"机关石匣",{"$nulls":4},101095,{"$f":"COUNTIF(语言配置表!A:A,关卡内常用!L33)","v":0}]
[{"$nulls":6},"银质陀飞轮","永动机器",null,null,null,101094,{"$f":"COUNTIF(语言配置表!A:A,关卡内常用!L34)","v":0}]
[{"$nulls":6},"永恒辉光管",{"$nulls":4},101093,{"$f":"COUNTIF(语言配置表!A:A,关卡内常用!L35)","v":0}]
[{"$nulls":6},"电子拟态香水",{"$nulls":4},101092,{"$f":"COUNTIF(语言配置表!A:A,关卡内常用!L36)","v":0}]
[{"$nulls":6},"微型约束磁场",{"$nulls":4},101091,{"$f":"COUNTIF(语言配置表!A:A,关卡内常用!L37)","v":0}]
[{"$nulls":6},"呼唤灵兽的哨子","意外的发现",null,null,null,101090,{"$f":"COUNTIF(语言配置表!A:A,关卡内常用!L38)","v":0}]
[{"$nulls":6},"萤光虫卵",{"$nulls":4},101089,{"$f":"COUNTIF(语言配置表!A:A,关卡内常用!L39)","v":0}]
[{"$nulls":6},"炎烧杖",{"$nulls":4},101088,{"$f":"COUNTIF(语言配置表!A:A,关卡内常用!L40)","v":0}]
[{"$nulls":6},"炼金坩埚",{"$nulls":4},101087,{"$f":"COUNTIF(语言配置表!A:A,关卡内常用!L41)","v":0}]
[{"$nulls":6},"巨大海螺","共生",null,null,null,101086,{"$f":"COUNTIF(语言配置表!A:A,关卡内常用!L42)","v":0}]
[{"$nulls":6},"微光珊瑚",{"$nulls":4},101085,{"$f":"COUNTIF(语言配置表!A:A,关卡内常用!L43)","v":0}]
[{"$nulls":6},"海风提取剂",{"$nulls":4},101084,{"$f":"COUNTIF(语言配置表!A:A,关卡内常用!L44)","v":0}]
[{"$nulls":6},"寄居蟹盒子",{"$nulls":4},101083,{"$f":"COUNTIF(语言配置表!A:A,关卡内常用!L45)","v":0}]
[{"$nulls":6},"异域短笛","召唤大师",null,null,null,101082,{"$f":"COUNTIF(语言配置表!A:A,关卡内常用!L46)","v":0}]
[{"$nulls":6},"晶莹琥珀",{"$nulls":4},101081,{"$f":"COUNTIF(语言配置表!A:A,关卡内常用!L47)","v":0}]
[{"$nulls":6},"引魂线香",{"$nulls":4},101080,{"$f":"COUNTIF(语言配置表!A:A,关卡内常用!L48)","v":0}]
[{"$nulls":6},"妖怪手账",{"$nulls":4},101079,{"$f":"COUNTIF(语言配置表!A:A,关卡内常用!L49)","v":0}]
[{"$nulls":11},101078,{"$f":"COUNTIF(语言配置表!A:A,关卡内常用!L50)","v":0}]
[{"$nulls":11},101077,{"$f":"COUNTIF(语言配置表!A:A,关卡内常用!L51)","v":0}]
[{"$nulls":11},101076,{"$f":"COUNTIF(语言配置表!A:A,关卡内常用!L52)","v":0}]
[{"$nulls":11},101075,{"$f":"COUNTIF(语言配置表!A:A,关卡内常用!L53)","v":0}]
[{"$nulls":11},101074,{"$f":"COUNTIF(语言配置表!A:A,关卡内常用!L54)","v":0}]
[{"$nulls":11},101073,{"$f":"COUNTIF(语言配置表!A:A,关卡内常用!L55)","v":0}]
[{"$nulls":11},101072,{"$f":"COUNTIF(语言配置表!A:A,关卡内常用!L56)","v":0}]
[{"$nulls":11},101071,{"$f":"COUNTIF(语言配置表!A:A,关卡内常用!L57)","v":0}]
[{"$nulls":11},101070,{"$f":"COUNTIF(语言配置表!A:A,关卡内常用!L58)","v":0}]
[{"$nulls":11},101069,{"$f":"COUNTIF(语言配置表!A:A,关卡内常用!L59)","v":0}]
[{"$nulls":11},101068,{"$f":"COUNTIF(语言配置表!A:A,关卡内常用!L60)","v":0}]
[{"$nulls":11},101067,{"$f":"COUNTIF(语言配置表!A:A,关卡内常用!L61)","v":0}]
[{"$nulls":11},101066,{"$f":"COUNTIF(语言配置表!A:A,关卡内常用!L62)","v":0}]
[{"$nulls":11},101065,{"$f":"COUNTIF(语言配置表!A:A,关卡内常用!L63)","v":0}]
[{"$nulls":11},101064,{"$f":"COUNTIF(语言配置表!A:A,关卡内常用!L64)","v":0}]
[{"$nulls":11},101063,{"$f":"COUNTIF(语言配置表!A:A,关卡内常用!L65)","v":0}]
[{"$nulls":11},101062,{"$f":"COUNTIF(语言配置表!A:A,关卡内常用!L66)","v":0}]
[{"$nulls":11},101061,{"$f":"COUNTIF(语言配置表!A:A,关卡内常用!L67)","v":0}]
[{"$nulls":11},101060,{"$f":"COUNTIF(语言配置表!A:A,关卡内常用!L68)","v":0}]
[{"$nulls":11},101059,{"$f":"COUNTIF(语言配置表!A:A,关卡内常用!L69)","v":0}]
[{"$nulls":11},101058,{"$f":"COUNTIF(语言配置表!A:A,关卡内常用!L70)","v":0}]
[{"$nulls":11},101057,{"$f":"COUNTIF(语言配置表!A:A,关卡内常用!L71)","v":0}]
[{"$nulls":11},101056,{"$f":"COUNTIF(语言配置表!A:A,关卡内常用!L72)","v":0}]
[{"$nulls":11},101055,{"$f":"COUNTIF(语言配置表!A:A,关卡内常用!L73)","v":0}]
[{"$nulls":11},101054,{"$f":"COUNTIF(语言配置表!A:A,关卡内常用!L74)","v":0}]
[{"$nulls":11},101053,{"$f":"COUNTIF(语言配置表!A:A,关卡内常用!L75)","v":0}]
[{"$nulls":11},101052,{"$f":"COUNTIF(语言配置表!A:A,关卡内常用!L76)","v":0}]
[{"$nulls":11},101051,{"$f":"COUNTIF(语言配置表!A:A,关卡内常用!L77)","v":0}]
[{"$nulls":11},101050,{"$f":"COUNTIF(语言配置表!A:A,关卡内常用!L78)","v":0}]
[{"$nulls":11},101049,{"$f":"COUNTIF(语言配置表!A:A,关卡内常用!L79)","v":0}]
[{"$nulls":11},101048,{"$f":"COUNTIF(语言配置表!A:A,关卡内常用!L80)","v":0}]
[{"$nulls":11},101047,{"$f":"COUNTIF(语言配置表!A:A,关卡内常用!L81)","v":0}]
[{"$nulls":11},101046,{"$f":"COUNTIF(语言配置表!A:A,关卡内常用!L82)","v":0}]
[{"$nulls":11},101045,{"$f":"COUNTIF(语言配置表!A:A,关卡内常用!L83)","v":0}]
[{"$nulls":11},101044,{"$f":"COUNTIF(语言配置表!A:A,关卡内常用!L84)","v":0}]
[{"$nulls":11},101043,{"$f":"COUNTIF(语言配置表!A:A,关卡内常用!L85)","v":0}]
[{"$nulls":11},101042,{"$f":"COUNTIF(语言配置表!A:A,关卡内常用!L86)","v":0}]
[{"$nulls":11},101041,{"$f":"COUNTIF(语言配置表!A:A,关卡内常用!L87)","v":0}]
[{"$nulls":11},101040,{"$f":"COUNTIF(语言配置表!A:A,关卡内常用!L88)","v":0}]
[{"$nulls":11},101039,{"$f":"COUNTIF(语言配置表!A:A,关卡内常用!L89)","v":0}]
[{"$nulls":11},101038,{"$f":"COUNTIF(语言配置表!A:A,关卡内常用!L90)","v":0}]
[{"$nulls":11},101037,{"$f":"COUNTIF(语言配置表!A:A,关卡内常用!L91)","v":0}]
[{"$nulls":11},101036,{"$f":"COUNTIF(语言配置表!A:A,关卡内常用!L92)","v":0}]
[{"$nulls":11},101035,{"$f":"COUNTIF(语言配置表!A:A,关卡内常用!L93)","v":0}]
[{"$nulls":11},101034,{"$f":"COUNTIF(语言配置表!A:A,关卡内常用!L94)","v":0}]
[{"$nulls":11},101033,{"$f":"COUNTIF(语言配置表!A:A,关卡内常用!L95)","v":0}]
[{"$nulls":11},101032,{"$f":"COUNTIF(语言配置表!A:A,关卡内常用!L96)","v":0}]
[{"$nulls":11},101031,{"$f":"COUNTIF(语言配置表!A:A,关卡内常用!L97)","v":0}]
[{"$nulls":11},101030,{"$f":"COUNTIF(语言配置表!A:A,关卡内常用!L98)","v":0}]
[{"$nulls":11},101029,{"$f":"COUNTIF(语言配置表!A:A,关卡内常用!L99)","v":0}]
[{"$nulls":11},101028,{"$f":"COUNTIF(语言配置表!A:A,关卡内常用!L100)","v":0}]
[{"$nulls":11},101027,{"$f":"COUNTIF(语言配置表!A:A,关卡内常用!L101)","v":0}]
[{"$nulls":11},101026,{"$f":"COUNTIF(语言配置表!A:A,关卡内常用!L102)","v":0}]
[{"$nulls":11},101025,{"$f":"COUNTIF(语言配置表!A:A,关卡内常用!L103)","v":0}]
[{"$nulls":11},101024,{"$f":"COUNTIF(语言配置表!A:A,关卡内常用!L104)","v":0}]
[{"$nulls":11},101023,{"$f":"COUNTIF(语言配置表!A:A,关卡内常用!L105)","v":0}]
[{"$nulls":11},101022,{"$f":"COUNTIF(语言配置表!A:A,关卡内常用!L106)","v":0}]
[{"$nulls":11},101021,{"$f":"COUNTIF(语言配置表!A:A,关卡内常用!L107)","v":0}]
[{"$nulls":11},101020,{"$f":"COUNTIF(语言配置表!A:A,关卡内常用!L108)","v":0}]
[{"$nulls":11},101019,{"$f":"COUNTIF(语言配置表!A:A,关卡内常用!L109)","v":0}]
[{"$nulls":11},101018,{"$f":"COUNTIF(语言配置表!A:A,关卡内常用!L110)","v":0}]
[{"$nulls":11},101017,{"$f":"COUNTIF(语言配置表!A:A,关卡内常用!L111)","v":0}]
[{"$nulls":11},101016,{"$f":"COUNTIF(语言配置表!A:A,关卡内常用!L112)","v":0}]
[{"$nulls":11},101015,{"$f":"COUNTIF(语言配置表!A:A,关卡内常用!L113)","v":0}]
[{"$nulls":11},101014,{"$f":"COUNTIF(语言配置表!A:A,关卡内常用!L114)","v":0}]
[{"$nulls":11},101013,{"$f":"COUNTIF(语言配置表!A:A,关卡内常用!L115)","v":0}]
[{"$nulls":11},101012,{"$f":"COUNTIF(语言配置表!A:A,关卡内常用!L116)","v":0}]
[{"$nulls":11},101011,{"$f":"COUNTIF(语言配置表!A:A,关卡内常用!L117)","v":0}]
[{"$nulls":11},101010,{"$f":"COUNTIF(语言配置表!A:A,关卡内常用!L118)","v":0}]
[{"$nulls":11},101009,{"$f":"COUNTIF(语言配置表!A:A,关卡内常用!L119)","v":0}]
[{"$nulls":11},101008,{"$f":"COUNTIF(语言配置表!A:A,关卡内常用!L120)","v":0}]
[{"$nulls":11},101007,{"$f":"COUNTIF(语言配置表!A:A,关卡内常用!L121)","v":0}]
[{"$nulls":11},101006,{"$f":"COUNTIF(语言配置表!A:A,关卡内常用!L122)","v":0}]
[{"$nulls":11},101005,{"$f":"COUNTIF(语言配置表!A:A,关卡内常用!L123)","v":0}]
[{"$nulls":11},101004,{"$f":"COUNTIF(语言配置表!A:A,关卡内常用!L124)","v":0}]
[{"$nulls":11},101003,{"$f":"COUNTIF(语言配置表!A:A,关卡内常用!L125)","v":0}]
[{"$nulls":11},101002,{"$f":"COUNTIF(语言配置表!A:A,关卡内常用!L126)","v":0}]
[{"$nulls":11},101001,{"$f":"COUNTIF(语言配置表!A:A,关卡内常用!L127)","v":0}]
[{"$nulls":11},101000,{"$f":"COUNTIF(语言配置表!A:A,关卡内常用!L128)","v":0}]
[{"$nulls":11},100999,{"$f":"COUNTIF(语言配置表!A:A,关卡内常用!L129)","v":0}]
[{"$nulls":11},100998,{"$f":"COUNTIF(语言配置表!A:A,关卡内常用!L130)","v":0}]
[{"$nulls":11},100997,{"$f":"COUNTIF(语言配置表!A:A,关卡内常用!L131)","v":0}]
[{"$nulls":11},100996,{"$f":"COUNTIF(语言配置表!A:A,关卡内常用!L132)","v":0}]
[{"$nulls":11},100995,{"$f":"COUNTIF(语言配置表!A:A,关卡内常用!L133)","v":0}]
[{"$nulls":11},100994,{"$f":"COUNTIF(语言配置表!A:A,关卡内常用!L134)","v":0}]
[{"$nulls":11},100993,{"$f":"COUNTIF(语言配置表!A:A,关卡内常用!L135)","v":0}]
[{"$nulls":11},100992,{"$f":"COUNTIF(语言配置表!A:A,关卡内常用!L136)","v":0}]
[{"$nulls":11},100991,{"$f":"COUNTIF(语言配置表!A:A,关卡内常用!L137)","v":0}]
[{"$nulls":11},100990,{"$f":"COUNTIF(语言配置表!A:A,关卡内常用!L138)","v":0}]
[{"$nulls":11},100989,{"$f":"COUNTIF(语言配置表!A:A,关卡内常用!L139)","v":0}]
[{"$nulls":11},100988,{"$f":"COUNTIF(语言配置表!A:A,关卡内常用!L140)","v":0}]
[{"$nulls":11},100987,{"$f":"COUNTIF(语言配置表!A:A,关卡内常用!L141)","v":0}]
[{"$nulls":11},100986,{"$f":"COUNTIF(语言配置表!A:A,关卡内常用!L142)","v":0}]
[{"$nulls":11},100985,{"$f":"COUNTIF(语言配置表!A:A,关卡内常用!L143)","v":0}]
[{"$nulls":11},100984,{"$f":"COUNTIF(语言配置表!A:A,关卡内常用!L144)","v":0}]
[{"$nulls":11},100983,{"$f":"COUNTIF(语言配置表!A:A,关卡内常用!L145)","v":0}]
[{"$nulls":11},100982,{"$f":"COUNTIF(语言配置表!A:A,关卡内常用!L146)","v":0}]
[{"$nulls":11},100981,{"$f":"COUNTIF(语言配置表!A:A,关卡内常用!L147)","v":0}]
[{"$nulls":11},100980,{"$f":"COUNTIF(语言配置表!A:A,关卡内常用!L148)","v":0}]
[{"$nulls":11},100979,{"$f":"COUNTIF(语言配置表!A:A,关卡内常用!L149)","v":0}]
[{"$nulls":11},100978,{"$f":"COUNTIF(语言配置表!A:A,关卡内常用!L150)","v":0}]
[{"$nulls":11},100977,{"$f":"COUNTIF(语言配置表!A:A,关卡内常用!L151)","v":0}]
[{"$nulls":11},100976,{"$f":"COUNTIF(语言配置表!A:A,关卡内常用!L152)","v":0}]
[{"$nulls":11},100975,{"$f":"COUNTIF(语言配置表!A:A,关卡内常用!L153)","v":0}]
[{"$nulls":11},100974,{"$f":"COUNTIF(语言配置表!A:A,关卡内常用!L154)","v":0}]
[{"$nulls":11},100973,{"$f":"COUNTIF(语言配置表!A:A,关卡内常用!L155)","v":0}]
[{"$nulls":11},100972,{"$f":"COUNTIF(语言配置表!A:A,关卡内常用!L156)","v":0}]
[{"$nulls":11},100971,{"$f":"COUNTIF(语言配置表!A:A,关卡内常用!L157)","v":0}]
[{"$nulls":11},100970,{"$f":"COUNTIF(语言配置表!A:A,关卡内常用!L158)","v":0}]
[{"$nulls":11},100969,{"$f":"COUNTIF(语言配置表!A:A,关卡内常用!L159)","v":0}]
[{"$nulls":11},100968,{"$f":"COUNTIF(语言配置表!A:A,关卡内常用!L160)","v":0}]
[{"$nulls":11},100967,{"$f":"COUNTIF(语言配置表!A:A,关卡内常用!L161)","v":0}]
[{"$nulls":11},100966,{"$f":"COUNTIF(语言配置表!A:A,关卡内常用!L162)","v":0}]
[{"$nulls":11},100965,{"$f":"COUNTIF(语言配置表!A:A,关卡内常用!L163)","v":0}]
[{"$nulls":11},100964,{"$f":"COUNTIF(语言配置表!A:A,关卡内常用!L164)","v":0}]
[{"$nulls":11},100963,{"$f":"COUNTIF(语言配置表!A:A,关卡内常用!L165)","v":0}]
[{"$nulls":11},100962,{"$f":"COUNTIF(语言配置表!A:A,关卡内常用!L166)","v":0}]
[{"$nulls":11},100961,{"$f":"COUNTIF(语言配置表!A:A,关卡内常用!L167)","v":0}]
[{"$nulls":11},100960,{"$f":"COUNTIF(语言配置表!A:A,关卡内常用!L168)","v":0}]
[{"$nulls":11},100959,{"$f":"COUNTIF(语言配置表!A:A,关卡内常用!L169)","v":0}]
[{"$nulls":11},100958,{"$f":"COUNTIF(语言配置表!A:A,关卡内常用!L170)","v":0}]
[{"$nulls":11},100957,{"$f":"COUNTIF(语言配置表!A:A,关卡内常用!L171)","v":0}]
[{"$nulls":11},100956,{"$f":"COUNTIF(语言配置表!A:A,关卡内常用!L172)","v":0}]
[{"$nulls":11},100955,{"$f":"COUNTIF(语言配置表!A:A,关卡内常用!L173)","v":0}]
[{"$nulls":11},100954,{"$f":"COUNTIF(语言配置表!A:A,关卡内常用!L174)","v":0}]
[{"$nulls":11},100953,{"$f":"COUNTIF(语言配置表!A:A,关卡内常用!L175)","v":0}]
[{"$nulls":11},100952,{"$f":"COUNTIF(语言配置表!A:A,关卡内常用!L176)","v":0}]
[{"$nulls":11},100951,{"$f":"COUNTIF(语言配置表!A:A,关卡内常用!L177)","v":0}]
[{"$nulls":11},100950,{"$f":"COUNTIF(语言配置表!A:A,关卡内常用!L178)","v":0}]
[{"$nulls":11},100949,{"$f":"COUNTIF(语言配置表!A:A,关卡内常用!L179)","v":0}]
[{"$nulls":11},100948,{"$f":"COUNTIF(语言配置表!A:A,关卡内常用!L180)","v":0}]
[{"$nulls":11},100947,{"$f":"COUNTIF(语言配置表!A:A,关卡内常用!L181)","v":0}]
[{"$nulls":11},100946,{"$f":"COUNTIF(语言配置表!A:A,关卡内常用!L182)","v":0}]
[{"$nulls":11},100945,{"$f":"COUNTIF(语言配置表!A:A,关卡内常用!L183)","v":0}]
[{"$nulls":11},100944,{"$f":"COUNTIF(语言配置表!A:A,关卡内常用!L184)","v":0}]
[{"$nulls":11},100943,{"$f":"COUNTIF(语言配置表!A:A,关卡内常用!L185)","v":0}]
[{"$nulls":11},100942,{"$f":"COUNTIF(语言配置表!A:A,关卡内常用!L186)","v":0}]
[{"$nulls":11},100941,{"$f":"COUNTIF(语言配置表!A:A,关卡内常用!L187)","v":0}]
[{"$nulls":11},100940,{"$f":"COUNTIF(语言配置表!A:A,关卡内常用!L188)","v":0}]
[{"$nulls":11},100939,{"$f":"COUNTIF(语言配置表!A:A,关卡内常用!L189)","v":0}]
[{"$nulls":11},100938,{"$f":"COUNTIF(语言配置表!A:A,关卡内常用!L190)","v":0}]
[{"$nulls":11},100937,{"$f":"COUNTIF(语言配置表!A:A,关卡内常用!L191)","v":0}]
[{"$nulls":11},100936,{"$f":"COUNTIF(语言配置表!A:A,关卡内常用!L192)","v":0}]
[{"$nulls":11},100935,{"$f":"COUNTIF(语言配置表!A:A,关卡内常用!L193)","v":0}]
[{"$nulls":11},100934,{"$f":"COUNTIF(语言配置表!A:A,关卡内常用!L194)","v":0}]
[{"$nulls":11},100933,{"$f":"COUNTIF(语言配置表!A:A,关卡内常用!L195)","v":0}]
[{"$nulls":11},100932,{"$f":"COUNTIF(语言配置表!A:A,关卡内常用!L196)","v":0}]
[{"$nulls":11},100931,{"$f":"COUNTIF(语言配置表!A:A,关卡内常用!L197)","v":0}]
[{"$nulls":11},100930,{"$f":"COUNTIF(语言配置表!A:A,关卡内常用!L198)","v":0}]
[{"$nulls":11},100929,{"$f":"COUNTIF(语言配置表!A:A,关卡内常用!L199)","v":0}]
[{"$nulls":11},100928,{"$f":"COUNTIF(语言配置表!A:A,关卡内常用!L200)","v":0}]
{"$rows_left_out":927}