{"text_format":"2","workbook":"xlsx","n_sheets":2,"sheets":["TowerConfig","TowerInfoConfig"],"not_rendered":{"charts":0,"images":0,"macros":0,"external_links":2,"defined_names":2,"comments":0,"pivot_tables":0},"unopened":[],"bounds":{"document_bytes":16777216,"sheet_cells":100000,"run_cost":"one","rows_first":2000,"rows_last":500,"rows_between":2000,"halvings":0,"cell_chars":16384,"cell_head_chars":4096},"cells_cut":0,"cells_raw":0,"read":"whole","date_system":"1900"}

{"sheet":"TowerConfig","index":0,"n_rows":5,"n_cols":5,"rows_kept":5,"cut":false,"hidden":false,"merged":[]}
["ID","name",null,"massge","towerinfoIdGroup"]
["int","int",null,"int","int"]
[]
["modelID","塔名称",null,null,"塔的详情效果Id组"]
[1,null,"命运峰",null,1]

{"sheet":"TowerInfoConfig","index":1,"n_rows":104,"n_cols":22,"rows_kept":104,"cut":false,"hidden":false,"merged":[]}
["ID","groupId","level","name",null,"massge","towerType","typeValue","reward","rewardCount","unlockValue"]
["int","int","int","int",null,"int","int","int[]","int[]","int[]","int"]
[]
["modelID","id组","层",null,null,null,"1=战斗（levelbattleId）\n2=剧情（剧情事件ID）",null,"奖励",null,"解锁值","道具1","道具2","数量1","数量2","等级",null,"组合1","组合2"]
[1,1,1,null,"第1层",null,1,2001,{"$f":"CONCATENATE(M5,\";\",L5)","v":"1401;1001"},{"$f":"CONCATENATE(O5,\";\",N5)","v":"1;13000"},null,1001,1401,{"$f":"ROUND(VLOOKUP(P5,[1]ResourceLevelConfig!$A:$C,3,FALSE)*0.01,0)*1000","v":13000},1,31,null,{"$f":"_xlfn.TEXTJOIN(\";\",1,L5:M5)","v":"1001;1401"},{"$f":"_xlfn.TEXTJOIN(\";\",1,N5:O5)","v":"13000;1"},null,{"$f":"VLOOKUP(L5,[2]ItemConfig!$A:$C,3,FALSE)&\"×\"&N5","v":"灵石×13000"},{"$f":"VLOOKUP(M5,[2]ItemConfig!$A:$C,3,FALSE)&\"×\"&O5","v":"凡品增元丹×1"}]
[2,1,2,null,"第2层",null,1,2002,{"$f":"CONCATENATE(M6,\";\",L6)","v":"1701;1001"},{"$f":"CONCATENATE(O6,\";\",N6)","v":"1;13000"},null,1001,1701,{"$f":"ROUND(VLOOKUP(P6,[1]ResourceLevelConfig!$A:$C,3,FALSE)*0.01,0)*1000","v":13000},1,33,null,{"$f":"_xlfn.TEXTJOIN(\";\",1,L6:M6)","v":"1001;1701"},{"$f":"_xlfn.TEXTJOIN(\";\",1,N6:O6)","v":"13000;1"},null,{"$f":"VLOOKUP(L6,[2]ItemConfig!$A:$C,3,FALSE)&\"×\"&N6","v":"灵石×13000"},{"$f":"VLOOKUP(M6,[2]ItemConfig!$A:$C,3,FALSE)&\"×\"&O6","v":"清识还元丹×1"}]
[3,1,3,null,"第3层",null,1,2003,"21012;1001","1;14000",null,1001,21012,{"$f":"ROUND(VLOOKUP(P7,[1]ResourceLevelConfig!$A:$C,3,FALSE)*0.01,0)*1000","v":14000},1,36,null,"1001;21012","14000;1",null,{"$f":"VLOOKUP(L7,[2]ItemConfig!$A:$C,3,FALSE)&\"×\"&N7","v":"灵石×14000"},{"$f":"VLOOKUP(M7,[2]ItemConfig!$A:$C,3,FALSE)&\"×\"&O7","v":"紫色神识符×1"}]
[4,1,4,null,"第4层",null,1,2004,"1304;1001","1;14000",null,1001,1304,{"$f":"ROUND(VLOOKUP(P8,[1]ResourceLevelConfig!$A:$C,3,FALSE)*0.01,0)*1000","v":14000},1,39,null,"1001;1304","14000;1",null,{"$f":"VLOOKUP(L8,[2]ItemConfig!$A:$C,3,FALSE)&\"×\"&N8","v":"灵石×14000"},{"$f":"VLOOKUP(M8,[2]ItemConfig!$A:$C,3,FALSE)&\"×\"&O8","v":"固元丹×1"}]
[5,1,5,null,"第5层",null,1,2005,"1401;1001","1;14000",null,1001,1401,{"$f":"ROUND(VLOOKUP(P9,[1]ResourceLevelConfig!$A:$C,3,FALSE)*0.01,0)*1000","v":14000},1,{"$f":"P5+10","v":41},null,"1001;1401","14000;1",null,{"$f":"VLOOKUP(L9,[2]ItemConfig!$A:$C,3,FALSE)&\"×\"&N9","v":"灵石×14000"},{"$f":"VLOOKUP(M9,[2]ItemConfig!$A:$C,3,FALSE)&\"×\"&O9","v":"凡品增元丹×1"}]
[6,1,6,null,"第6层",null,1,2006,"1701;1001","1;14000",null,1001,1701,{"$f":"ROUND(VLOOKUP(P10,[1]ResourceLevelConfig!$A:$C,3,FALSE)*0.01,0)*1000","v":14000},1,{"$f":"P6+10","v":43},null,"1001;1701","14000;1",null,{"$f":"VLOOKUP(L10,[2]ItemConfig!$A:$C,3,FALSE)&\"×\"&N10","v":"灵石×14000"},{"$f":"VLOOKUP(M10,[2]ItemConfig!$A:$C,3,FALSE)&\"×\"&O10","v":"清识还元丹×1"}]
[7,1,7,null,"第7层",null,1,2007,"21012;1001","1;15000",null,1001,21012,{"$f":"ROUND(VLOOKUP(P11,[1]ResourceLevelConfig!$A:$C,3,FALSE)*0.01,0)*1000","v":15000},1,46,null,"1001;21012","15000;1",null,{"$f":"VLOOKUP(L11,[2]ItemConfig!$A:$C,3,FALSE)&\"×\"&N11","v":"灵石×15000"},{"$f":"VLOOKUP(M11,[2]ItemConfig!$A:$C,3,FALSE)&\"×\"&O11","v":"紫色神识符×1"}]
[8,1,8,null,"第8层",null,1,2008,"1305;1001","1;15000",null,1001,{"$f":"M8+1","v":1305},{"$f":"ROUND(VLOOKUP(P12,[1]ResourceLevelConfig!$A:$C,3,FALSE)*0.01,0)*1000","v":15000},1,49,null,"1001;1305","15000;1",null,{"$f":"VLOOKUP(L12,[2]ItemConfig!$A:$C,3,FALSE)&\"×\"&N12","v":"灵石×15000"},{"$f":"VLOOKUP(M12,[2]ItemConfig!$A:$C,3,FALSE)&\"×\"&O12","v":"青灵果×1"}]
[9,1,9,null,"第9层",null,1,2009,"1402;1001","1;15000",null,1001,1402,{"$f":"ROUND(VLOOKUP(P13,[1]ResourceLevelConfig!$A:$C,3,FALSE)*0.01,0)*1000","v":15000},1,51,null,"1001;1402","15000;1",null,{"$f":"VLOOKUP(L13,[2]ItemConfig!$A:$C,3,FALSE)&\"×\"&N13","v":"灵石×15000"},{"$f":"VLOOKUP(M13,[2]ItemConfig!$A:$C,3,FALSE)&\"×\"&O13","v":"良品增元丹×1"}]
[10,1,10,null,"第10层",null,1,2010,"1702;1001","1;15000",null,1001,1702,{"$f":"ROUND(VLOOKUP(P14,[1]ResourceLevelConfig!$A:$C,3,FALSE)*0.01,0)*1000","v":15000},1,53,null,"1001;1702","15000;1",null,{"$f":"VLOOKUP(L14,[2]ItemConfig!$A:$C,3,FALSE)&\"×\"&N14","v":"灵石×15000"},{"$f":"VLOOKUP(M14,[2]ItemConfig!$A:$C,3,FALSE)&\"×\"&O14","v":"归识还元丹×1"}]
[11,1,11,null,"第11层",null,1,2011,"21012;1001","1;16000",null,1001,21012,{"$f":"ROUND(VLOOKUP(P15,[1]ResourceLevelConfig!$A:$C,3,FALSE)*0.01,0)*1000","v":16000},1,56,null,"1001;21012","16000;1",null,{"$f":"VLOOKUP(L15,[2]ItemConfig!$A:$C,3,FALSE)&\"×\"&N15","v":"灵石×16000"},{"$f":"VLOOKUP(M15,[2]ItemConfig!$A:$C,3,FALSE)&\"×\"&O15","v":"紫色神识符×1"}]
[12,1,12,null,"第12层",null,1,2012,"1306;1001","1;16000",null,1001,{"$f":"M12+1","v":1306},{"$f":"ROUND(VLOOKUP(P16,[1]ResourceLevelConfig!$A:$C,3,FALSE)*0.01,0)*1000","v":16000},1,59,null,"1001;1306","16000;1",null,{"$f":"VLOOKUP(L16,[2]ItemConfig!$A:$C,3,FALSE)&\"×\"&N16","v":"灵石×16000"},{"$f":"VLOOKUP(M16,[2]ItemConfig!$A:$C,3,FALSE)&\"×\"&O16","v":"金阳果×1"}]
[13,1,13,null,"第13层",null,1,2013,"1402;1001","1;16000",null,1001,1402,{"$f":"ROUND(VLOOKUP(P17,[1]ResourceLevelConfig!$A:$C,3,FALSE)*0.01,0)*1000","v":16000},1,61,null,"1001;1402","16000;1",null,{"$f":"VLOOKUP(L17,[2]ItemConfig!$A:$C,3,FALSE)&\"×\"&N17","v":"灵石×16000"},{"$f":"VLOOKUP(M17,[2]ItemConfig!$A:$C,3,FALSE)&\"×\"&O17","v":"良品增元丹×1"}]
[14,1,14,null,"第14层",null,1,2014,"1702;1001","1;16000",null,1001,1702,{"$f":"ROUND(VLOOKUP(P18,[1]ResourceLevelConfig!$A:$C,3,FALSE)*0.01,0)*1000","v":16000},1,63,null,"1001;1702","16000;1",null,{"$f":"VLOOKUP(L18,[2]ItemConfig!$A:$C,3,FALSE)&\"×\"&N18","v":"灵石×16000"},{"$f":"VLOOKUP(M18,[2]ItemConfig!$A:$C,3,FALSE)&\"×\"&O18","v":"归识还元丹×1"}]
[15,1,15,null,"第15层",null,1,2015,"21012;1001","1;17000",null,1001,21012,{"$f":"ROUND(VLOOKUP(P19,[1]ResourceLevelConfig!$A:$C,3,FALSE)*0.01,0)*1000","v":17000},1,66,null,"1001;21012","17000;1",null,{"$f":"VLOOKUP(L19,[2]ItemConfig!$A:$C,3,FALSE)&\"×\"&N19","v":"灵石×17000"},{"$f":"VLOOKUP(M19,[2]ItemConfig!$A:$C,3,FALSE)&\"×\"&O19","v":"紫色神识符×1"}]
[16,1,16,null,"第16层",null,1,2016,"1307;1001","1;17000",null,1001,{"$f":"M16+1","v":1307},{"$f":"ROUND(VLOOKUP(P20,[1]ResourceLevelConfig!$A:$C,3,FALSE)*0.01,0)*1000","v":17000},1,69,null,"1001;1307","17000;1",null,{"$f":"VLOOKUP(L20,[2]ItemConfig!$A:$C,3,FALSE)&\"×\"&N20","v":"灵石×17000"},{"$f":"VLOOKUP(M20,[2]ItemConfig!$A:$C,3,FALSE)&\"×\"&O20","v":"金灵丹×1"}]
[17,1,17,null,"第17层",null,1,2017,"1402;1001","1;17000",null,1001,1402,{"$f":"ROUND(VLOOKUP(P21,[1]ResourceLevelConfig!$A:$C,3,FALSE)*0.01,0)*1000","v":17000},1,71,null,"1001;1402","17000;1",null,{"$f":"VLOOKUP(L21,[2]ItemConfig!$A:$C,3,FALSE)&\"×\"&N21","v":"灵石×17000"},{"$f":"VLOOKUP(M21,[2]ItemConfig!$A:$C,3,FALSE)&\"×\"&O21","v":"良品增元丹×1"}]
[18,1,18,null,"第18层",null,1,2018,"1702;1001","1;17000",null,1001,1702,{"$f":"ROUND(VLOOKUP(P22,[1]ResourceLevelConfig!$A:$C,3,FALSE)*0.01,0)*1000","v":17000},1,73,null,"1001;1702","17000;1",null,{"$f":"VLOOKUP(L22,[2]ItemConfig!$A:$C,3,FALSE)&\"×\"&N22","v":"灵石×17000"},{"$f":"VLOOKUP(M22,[2]ItemConfig!$A:$C,3,FALSE)&\"×\"&O22","v":"归识还元丹×1"}]
[19,1,19,null,"第19层",null,1,2019,"21012;1001","1;18000",null,1001,21012,{"$f":"ROUND(VLOOKUP(P23,[1]ResourceLevelConfig!$A:$C,3,FALSE)*0.01,0)*1000","v":18000},1,76,null,"1001;21012","18000;1",null,{"$f":"VLOOKUP(L23,[2]ItemConfig!$A:$C,3,FALSE)&\"×\"&N23","v":"灵石×18000"},{"$f":"VLOOKUP(M23,[2]ItemConfig!$A:$C,3,FALSE)&\"×\"&O23","v":"紫色神识符×1"}]
[20,1,20,null,"第20层",null,1,2020,"1308;1001","1;18000",null,1001,{"$f":"M20+1","v":1308},{"$f":"ROUND(VLOOKUP(P24,[1]ResourceLevelConfig!$A:$C,3,FALSE)*0.01,0)*1000","v":18000},1,79,null,"1001;1308","18000;1",null,{"$f":"VLOOKUP(L24,[2]ItemConfig!$A:$C,3,FALSE)&\"×\"&N24","v":"灵石×18000"},{"$f":"VLOOKUP(M24,[2]ItemConfig!$A:$C,3,FALSE)&\"×\"&O24","v":"紫霞芝×1"}]
[21,1,21,null,"第21层",null,1,2021,"1402;1001","1;18000",null,1001,1402,{"$f":"ROUND(VLOOKUP(P25,[1]ResourceLevelConfig!$A:$C,3,FALSE)*0.01,0)*1000","v":18000},1,81,null,"1001;1402","18000;1",null,{"$f":"VLOOKUP(L25,[2]ItemConfig!$A:$C,3,FALSE)&\"×\"&N25","v":"灵石×18000"},{"$f":"VLOOKUP(M25,[2]ItemConfig!$A:$C,3,FALSE)&\"×\"&O25","v":"良品增元丹×1"}]
[22,1,22,null,"第22层",null,1,2022,"1702;1001","1;18000",null,1001,1702,{"$f":"ROUND(VLOOKUP(P26,[1]ResourceLevelConfig!$A:$C,3,FALSE)*0.01,0)*1000","v":18000},1,83,null,"1001;1702","18000;1",null,{"$f":"VLOOKUP(L26,[2]ItemConfig!$A:$C,3,FALSE)&\"×\"&N26","v":"灵石×18000"},{"$f":"VLOOKUP(M26,[2]ItemConfig!$A:$C,3,FALSE)&\"×\"&O26","v":"归识还元丹×1"}]
[23,1,23,null,"第23层",null,1,2023,"21012;1001","1;19000",null,1001,21012,{"$f":"ROUND(VLOOKUP(P27,[1]ResourceLevelConfig!$A:$C,3,FALSE)*0.01,0)*1000","v":19000},1,86,null,"1001;21012","19000;1",null,{"$f":"VLOOKUP(L27,[2]ItemConfig!$A:$C,3,FALSE)&\"×\"&N27","v":"灵石×19000"},{"$f":"VLOOKUP(M27,[2]ItemConfig!$A:$C,3,FALSE)&\"×\"&O27","v":"紫色神识符×1"}]
[24,1,24,null,"第24层",null,1,2024,"1309;1001","1;19000",null,1001,{"$f":"M24+1","v":1309},{"$f":"ROUND(VLOOKUP(P28,[1]ResourceLevelConfig!$A:$C,3,FALSE)*0.01,0)*1000","v":19000},1,89,null,"1001;1309","19000;1",null,{"$f":"VLOOKUP(L28,[2]ItemConfig!$A:$C,3,FALSE)&\"×\"&N28","v":"灵石×19000"},{"$f":"VLOOKUP(M28,[2]ItemConfig!$A:$C,3,FALSE)&\"×\"&O28","v":"九窍芝×1"}]
[25,1,25,null,"第25层",null,1,2025,"1402;1001","1;19000",null,1001,1402,{"$f":"ROUND(VLOOKUP(P29,[1]ResourceLevelConfig!$A:$C,3,FALSE)*0.01,0)*1000","v":19000},1,91,null,"1001;1402","19000;1",null,{"$f":"VLOOKUP(L29,[2]ItemConfig!$A:$C,3,FALSE)&\"×\"&N29","v":"灵石×19000"},{"$f":"VLOOKUP(M29,[2]ItemConfig!$A:$C,3,FALSE)&\"×\"&O29","v":"良品增元丹×1"}]
[26,1,26,null,"第26层",null,1,2026,"1702;1001","1;19000",null,1001,1702,{"$f":"ROUND(VLOOKUP(P30,[1]ResourceLevelConfig!$A:$C,3,FALSE)*0.01,0)*1000","v":19000},1,93,null,"1001;1702","19000;1",null,{"$f":"VLOOKUP(L30,[2]ItemConfig!$A:$C,3,FALSE)&\"×\"&N30","v":"灵石×19000"},{"$f":"VLOOKUP(M30,[2]ItemConfig!$A:$C,3,FALSE)&\"×\"&O30","v":"归识还元丹×1"}]
[27,1,27,null,"第27层",null,1,2027,"21012;1001","1;20000",null,1001,21012,{"$f":"ROUND(VLOOKUP(P31,[1]ResourceLevelConfig!$A:$C,3,FALSE)*0.01,0)*1000","v":20000},1,96,null,"1001;21012","20000;1",null,{"$f":"VLOOKUP(L31,[2]ItemConfig!$A:$C,3,FALSE)&\"×\"&N31","v":"灵石×20000"},{"$f":"VLOOKUP(M31,[2]ItemConfig!$A:$C,3,FALSE)&\"×\"&O31","v":"紫色神识符×1"}]
[28,1,28,null,"第28层",null,1,2028,"1310;1001","1;20000",null,1001,{"$f":"M28+1","v":1310},{"$f":"ROUND(VLOOKUP(P32,[1]ResourceLevelConfig!$A:$C,3,FALSE)*0.01,0)*1000","v":20000},1,99,null,"1001;1310","20000;1",null,{"$f":"VLOOKUP(L32,[2]ItemConfig!$A:$C,3,FALSE)&\"×\"&N32","v":"灵石×20000"},{"$f":"VLOOKUP(M32,[2]ItemConfig!$A:$C,3,FALSE)&\"×\"&O32","v":"婴化丹×1"}]
[29,1,29,null,"第29层",null,1,2029,"1402;1001","1;20000",null,1001,1402,{"$f":"ROUND(VLOOKUP(P33,[1]ResourceLevelConfig!$A:$C,3,FALSE)*0.01,0)*1000","v":20000},1,101,null,"1001;1402","20000;1",null,{"$f":"VLOOKUP(L33,[2]ItemConfig!$A:$C,3,FALSE)&\"×\"&N33","v":"灵石×20000"},{"$f":"VLOOKUP(M33,[2]ItemConfig!$A:$C,3,FALSE)&\"×\"&O33","v":"良品增元丹×1"}]
[30,1,30,null,"第30层",null,1,2030,"1702;1001","1;20000",null,1001,1702,{"$f":"ROUND(VLOOKUP(P34,[1]ResourceLevelConfig!$A:$C,3,FALSE)*0.01,0)*1000","v":20000},1,103,null,"1001;1702","20000;1",null,{"$f":"VLOOKUP(L34,[2]ItemConfig!$A:$C,3,FALSE)&\"×\"&N34","v":"灵石×20000"},{"$f":"VLOOKUP(M34,[2]ItemConfig!$A:$C,3,FALSE)&\"×\"&O34","v":"归识还元丹×1"}]
[31,1,31,null,"第31层",null,1,2031,"21012;1001","1;21000",null,1001,21012,{"$f":"ROUND(VLOOKUP(P35,[1]ResourceLevelConfig!$A:$C,3,FALSE)*0.01,0)*1000","v":21000},1,106,null,"1001;21012","21000;1",null,{"$f":"VLOOKUP(L35,[2]ItemConfig!$A:$C,3,FALSE)&\"×\"&N35","v":"灵石×21000"},{"$f":"VLOOKUP(M35,[2]ItemConfig!$A:$C,3,FALSE)&\"×\"&O35","v":"紫色神识符×1"}]
[32,1,32,null,"第32层",null,1,2032,"1311;1001","1;21000",null,1001,{"$f":"M32+1","v":1311},{"$f":"ROUND(VLOOKUP(P36,[1]ResourceLevelConfig!$A:$C,3,FALSE)*0.01,0)*1000","v":21000},1,109,null,"1001;1311","21000;1",null,{"$f":"VLOOKUP(L36,[2]ItemConfig!$A:$C,3,FALSE)&\"×\"&N36","v":"灵石×21000"},{"$f":"VLOOKUP(M36,[2]ItemConfig!$A:$C,3,FALSE)&\"×\"&O36","v":"玄婴花×1"}]
[33,1,33,null,"第33层",null,1,2033,"1403;1001","1;21000",null,1001,1403,{"$f":"ROUND(VLOOKUP(P37,[1]ResourceLevelConfig!$A:$C,3,FALSE)*0.01,0)*1000","v":21000},1,111,null,"1001;1403","21000;1",null,{"$f":"VLOOKUP(L37,[2]ItemConfig!$A:$C,3,FALSE)&\"×\"&N37","v":"灵石×21000"},{"$f":"VLOOKUP(M37,[2]ItemConfig!$A:$C,3,FALSE)&\"×\"&O37","v":"上品增元丹×1"}]
[34,1,34,null,"第34层",null,1,2034,"1702;1001","1;21000",null,1001,1702,{"$f":"ROUND(VLOOKUP(P38,[1]ResourceLevelConfig!$A:$C,3,FALSE)*0.01,0)*1000","v":21000},1,113,null,"1001;1702","21000;1",null,{"$f":"VLOOKUP(L38,[2]ItemConfig!$A:$C,3,FALSE)&\"×\"&N38","v":"灵石×21000"},{"$f":"VLOOKUP(M38,[2]ItemConfig!$A:$C,3,FALSE)&\"×\"&O38","v":"归识还元丹×1"}]
[35,1,35,null,"第35层",null,1,2035,"21012;1001","1;22000",null,1001,21012,{"$f":"ROUND(VLOOKUP(P39,[1]ResourceLevelConfig!$A:$C,3,FALSE)*0.01,0)*1000","v":22000},1,116,null,"1001;21012","22000;1",null,{"$f":"VLOOKUP(L39,[2]ItemConfig!$A:$C,3,FALSE)&\"×\"&N39","v":"灵石×22000"},{"$f":"VLOOKUP(M39,[2]ItemConfig!$A:$C,3,FALSE)&\"×\"&O39","v":"紫色神识符×1"}]
[36,1,36,null,"第36层",null,1,2036,"1312;1001","1;22000",null,1001,{"$f":"M36+1","v":1312},{"$f":"ROUND(VLOOKUP(P40,[1]ResourceLevelConfig!$A:$C,3,FALSE)*0.01,0)*1000","v":22000},1,119,null,"1001;1312","22000;1",null,{"$f":"VLOOKUP(L40,[2]ItemConfig!$A:$C,3,FALSE)&\"×\"&N40","v":"灵石×22000"},{"$f":"VLOOKUP(M40,[2]ItemConfig!$A:$C,3,FALSE)&\"×\"&O40","v":"玄冥髓×1"}]
[37,1,37,null,"第37层",null,1,2037,"1403;1001","1;22000",null,1001,1403,{"$f":"ROUND(VLOOKUP(P41,[1]ResourceLevelConfig!$A:$C,3,FALSE)*0.01,0)*1000","v":22000},1,121,null,"1001;1403","22000;1",null,{"$f":"VLOOKUP(L41,[2]ItemConfig!$A:$C,3,FALSE)&\"×\"&N41","v":"灵石×22000"},{"$f":"VLOOKUP(M41,[2]ItemConfig!$A:$C,3,FALSE)&\"×\"&O41","v":"上品增元丹×1"}]
[38,1,38,null,"第38层",null,1,2038,"1702;1001","1;22000",null,1001,1702,{"$f":"ROUND(VLOOKUP(P42,[1]ResourceLevelConfig!$A:$C,3,FALSE)*0.01,0)*1000","v":22000},1,123,null,"1001;1702","22000;1",null,{"$f":"VLOOKUP(L42,[2]ItemConfig!$A:$C,3,FALSE)&\"×\"&N42","v":"灵石×22000"},{"$f":"VLOOKUP(M42,[2]ItemConfig!$A:$C,3,FALSE)&\"×\"&O42","v":"归识还元丹×1"}]
[39,1,39,null,"第39层",null,1,2039,"21012;1001","1;23000",null,1001,21012,{"$f":"ROUND(VLOOKUP(P43,[1]ResourceLevelConfig!$A:$C,3,FALSE)*0.01,0)*1000","v":23000},1,126,null,"1001;21012","23000;1",null,{"$f":"VLOOKUP(L43,[2]ItemConfig!$A:$C,3,FALSE)&\"×\"&N43","v":"灵石×23000"},{"$f":"VLOOKUP(M43,[2]ItemConfig!$A:$C,3,FALSE)&\"×\"&O43","v":"紫色神识符×1"}]
[40,1,40,null,"第40层",null,1,2040,"1313;1001","1;23000",null,1001,{"$f":"M40+1","v":1313},{"$f":"ROUND(VLOOKUP(P44,[1]ResourceLevelConfig!$A:$C,3,FALSE)*0.01,0)*1000","v":23000},1,129,null,"1001;1313","23000;1",null,{"$f":"VLOOKUP(L44,[2]ItemConfig!$A:$C,3,FALSE)&\"×\"&N44","v":"灵石×23000"},{"$f":"VLOOKUP(M44,[2]ItemConfig!$A:$C,3,FALSE)&\"×\"&O44","v":"聚神丹×1"}]
[41,1,41,null,"第41层",null,1,2041,"1403;1001","1;23000",null,1001,1403,{"$f":"ROUND(VLOOKUP(P45,[1]ResourceLevelConfig!$A:$C,3,FALSE)*0.01,0)*1000","v":23000},1,131,null,"1001;1403","23000;1",null,{"$f":"VLOOKUP(L45,[2]ItemConfig!$A:$C,3,FALSE)&\"×\"&N45","v":"灵石×23000"},{"$f":"VLOOKUP(M45,[2]ItemConfig!$A:$C,3,FALSE)&\"×\"&O45","v":"上品增元丹×1"}]
[42,1,42,null,"第42层",null,1,2042,"1702;1001","1;23000",null,1001,1702,{"$f":"ROUND(VLOOKUP(P46,[1]ResourceLevelConfig!$A:$C,3,FALSE)*0.01,0)*1000","v":23000},1,133,null,"1001;1702","23000;1",null,{"$f":"VLOOKUP(L46,[2]ItemConfig!$A:$C,3,FALSE)&\"×\"&N46","v":"灵石×23000"},{"$f":"VLOOKUP(M46,[2]ItemConfig!$A:$C,3,FALSE)&\"×\"&O46","v":"归识还元丹×1"}]
[43,1,43,null,"第43层",null,1,2043,"21012;1001","1;24000",null,1001,21012,{"$f":"ROUND(VLOOKUP(P47,[1]ResourceLevelConfig!$A:$C,3,FALSE)*0.01,0)*1000","v":24000},1,136,null,"1001;21012","24000;1",null,{"$f":"VLOOKUP(L47,[2]ItemConfig!$A:$C,3,FALSE)&\"×\"&N47","v":"灵石×24000"},{"$f":"VLOOKUP(M47,[2]ItemConfig!$A:$C,3,FALSE)&\"×\"&O47","v":"紫色神识符×1"}]
[44,1,44,null,"第44层",null,1,2044,"1314;1001","1;24000",null,1001,{"$f":"M44+1","v":1314},{"$f":"ROUND(VLOOKUP(P48,[1]ResourceLevelConfig!$A:$C,3,FALSE)*0.01,0)*1000","v":24000},1,139,null,"1001;1314","24000;1",null,{"$f":"VLOOKUP(L48,[2]ItemConfig!$A:$C,3,FALSE)&\"×\"&N48","v":"灵石×24000"},{"$f":"VLOOKUP(M48,[2]ItemConfig!$A:$C,3,FALSE)&\"×\"&O48","v":"太虚花×1"}]
[45,1,45,null,"第45层",null,1,2045,"1403;1001","1;24000",null,1001,1403,{"$f":"ROUND(VLOOKUP(P49,[1]ResourceLevelConfig!$A:$C,3,FALSE)*0.01,0)*1000","v":24000},1,141,null,"1001;1403","24000;1",null,{"$f":"VLOOKUP(L49,[2]ItemConfig!$A:$C,3,FALSE)&\"×\"&N49","v":"灵石×24000"},{"$f":"VLOOKUP(M49,[2]ItemConfig!$A:$C,3,FALSE)&\"×\"&O49","v":"上品增元丹×1"}]
[46,1,46,null,"第46层",null,1,2046,"1702;1001","1;25000",null,1001,1702,{"$f":"ROUND(VLOOKUP(P50,[1]ResourceLevelConfig!$A:$C,3,FALSE)*0.01,0)*1000","v":25000},1,143,null,"1001;1702","25000;1",null,{"$f":"VLOOKUP(L50,[2]ItemConfig!$A:$C,3,FALSE)&\"×\"&N50","v":"灵石×25000"},{"$f":"VLOOKUP(M50,[2]ItemConfig!$A:$C,3,FALSE)&\"×\"&O50","v":"归识还元丹×1"}]
[47,1,47,null,"第47层",null,1,2047,"21012;1001","1;25000",null,1001,21012,{"$f":"ROUND(VLOOKUP(P51,[1]ResourceLevelConfig!$A:$C,3,FALSE)*0.01,0)*1000","v":25000},1,146,null,"1001;21012","25000;1",null,{"$f":"VLOOKUP(L51,[2]ItemConfig!$A:$C,3,FALSE)&\"×\"&N51","v":"灵石×25000"},{"$f":"VLOOKUP(M51,[2]ItemConfig!$A:$C,3,FALSE)&\"×\"&O51","v":"紫色神识符×1"}]
[48,1,48,null,"第48层",null,1,2048,"1315;1001","1;25000",null,1001,{"$f":"M48+1","v":1315},{"$f":"ROUND(VLOOKUP(P52,[1]ResourceLevelConfig!$A:$C,3,FALSE)*0.01,0)*1000","v":25000},1,149,null,"1001;1315","25000;1",null,{"$f":"VLOOKUP(L52,[2]ItemConfig!$A:$C,3,FALSE)&\"×\"&N52","v":"灵石×25000"},{"$f":"VLOOKUP(M52,[2]ItemConfig!$A:$C,3,FALSE)&\"×\"&O52","v":"九焰莲×1"}]
[49,1,49,null,"第49层",null,1,2049,"1403;1001","1;26000",null,1001,1403,{"$f":"ROUND(VLOOKUP(P53,[1]ResourceLevelConfig!$A:$C,3,FALSE)*0.01,0)*1000","v":26000},1,151,null,"1001;1403","26000;1",null,{"$f":"VLOOKUP(L53,[2]ItemConfig!$A:$C,3,FALSE)&\"×\"&N53","v":"灵石×26000"},{"$f":"VLOOKUP(M53,[2]ItemConfig!$A:$C,3,FALSE)&\"×\"&O53","v":"上品增元丹×1"}]
[50,1,50,null,"第50层",null,1,2050,"1702;1001","1;26000",null,1001,1702,{"$f":"ROUND(VLOOKUP(P54,[1]ResourceLevelConfig!$A:$C,3,FALSE)*0.01,0)*1000","v":26000},1,153,null,"1001;1702","26000;1",null,{"$f":"VLOOKUP(L54,[2]ItemConfig!$A:$C,3,FALSE)&\"×\"&N54","v":"灵石×26000"},{"$f":"VLOOKUP(M54,[2]ItemConfig!$A:$C,3,FALSE)&\"×\"&O54","v":"归识还元丹×1"}]
[51,1,51,null,"第51层",null,1,2051,"21012;1001","1;26000",null,1001,21012,{"$f":"ROUND(VLOOKUP(P55,[1]ResourceLevelConfig!$A:$C,3,FALSE)*0.01,0)*1000","v":26000},1,156,null,"1001;21012","26000;1",null,{"$f":"VLOOKUP(L55,[2]ItemConfig!$A:$C,3,FALSE)&\"×\"&N55","v":"灵石×26000"},{"$f":"VLOOKUP(M55,[2]ItemConfig!$A:$C,3,FALSE)&\"×\"&O55","v":"紫色神识符×1"}]
[52,1,52,null,"第52层",null,1,2052,"1316;1001","1;27000",null,1001,{"$f":"M52+1","v":1316},{"$f":"ROUND(VLOOKUP(P56,[1]ResourceLevelConfig!$A:$C,3,FALSE)*0.01,0)*1000","v":27000},1,159,null,"1001;1316","27000;1",null,{"$f":"VLOOKUP(L56,[2]ItemConfig!$A:$C,3,FALSE)&\"×\"&N56","v":"灵石×27000"},{"$f":"VLOOKUP(M56,[2]ItemConfig!$A:$C,3,FALSE)&\"×\"&O56","v":"虚灵丹×1"}]
[53,1,53,null,"第53层",null,1,2053,"1403;1001","1;27000",null,1001,1403,{"$f":"ROUND(VLOOKUP(P57,[1]ResourceLevelConfig!$A:$C,3,FALSE)*0.01,0)*1000","v":27000},1,161,null,"1001;1403","27000;1",null,{"$f":"VLOOKUP(L57,[2]ItemConfig!$A:$C,3,FALSE)&\"×\"&N57","v":"灵石×27000"},{"$f":"VLOOKUP(M57,[2]ItemConfig!$A:$C,3,FALSE)&\"×\"&O57","v":"上品增元丹×1"}]
[54,1,54,null,"第54层",null,1,2054,"1702;1001","1;27000",null,1001,1702,{"$f":"ROUND(VLOOKUP(P58,[1]ResourceLevelConfig!$A:$C,3,FALSE)*0.01,0)*1000","v":27000},1,163,null,"1001;1702","27000;1",null,{"$f":"VLOOKUP(L58,[2]ItemConfig!$A:$C,3,FALSE)&\"×\"&N58","v":"灵石×27000"},{"$f":"VLOOKUP(M58,[2]ItemConfig!$A:$C,3,FALSE)&\"×\"&O58","v":"归识还元丹×1"}]
[55,1,55,null,"第55层",null,1,2055,"21012;1001","1;28000",null,1001,21012,{"$f":"ROUND(VLOOKUP(P59,[1]ResourceLevelConfig!$A:$C,3,FALSE)*0.01,0)*1000","v":28000},1,166,null,"1001;21012","28000;1",null,{"$f":"VLOOKUP(L59,[2]ItemConfig!$A:$C,3,FALSE)&\"×\"&N59","v":"灵石×28000"},{"$f":"VLOOKUP(M59,[2]ItemConfig!$A:$C,3,FALSE)&\"×\"&O59","v":"紫色神识符×1"}]
[56,1,56,null,"第56层",null,1,2056,"1317;1001","1;28000",null,1001,{"$f":"M56+1","v":1317},{"$f":"ROUND(VLOOKUP(P60,[1]ResourceLevelConfig!$A:$C,3,FALSE)*0.01,0)*1000","v":28000},1,169,null,"1001;1317","28000;1",null,{"$f":"VLOOKUP(L60,[2]ItemConfig!$A:$C,3,FALSE)&\"×\"&N60","v":"灵石×28000"},{"$f":"VLOOKUP(M60,[2]ItemConfig!$A:$C,3,FALSE)&\"×\"&O60","v":"梦魇藤×1"}]
{"$rows_left_out":44}