{"text_format":"2","workbook":"xlsx","n_sheets":3,"sheets":["ShopGroupConfig","ShopConfig","ShopItemConfig"],"not_rendered":{"charts":0,"images":0,"macros":0,"external_links":2,"defined_names":3,"comments":0,"pivot_tables":0},"unopened":[],"bounds":{"document_bytes":16777216,"sheet_cells":100000,"run_cost":"one","rows_first":2000,"rows_last":500,"rows_between":2000,"halvings":0,"cell_chars":16384,"cell_head_chars":4096},"cells_cut":0,"cells_raw":0,"read":"whole","date_system":"1900"}

{"sheet":"ShopGroupConfig","index":0,"n_rows":11,"n_cols":6,"rows_kept":11,"cut":false,"hidden":false,"merged":[]}
["ID",null,"shopName","pageSortNum","isShow","titleShowItemIds"]
["int",null,"int","int","bool","int[]"]
[]
["ID","商店名（策划用）","商店名\n（顶部名字）","页签排序\n（小的在前面）","是否显示","导航栏显示的道具"]
[1,"GM资源",1900,99,1,1001]
[2,"GM法宝",1904,97,1,1001]
[3,"GM功法",1905,98,1,1001]
[5,"神识恢复",-1,96,0,1004]
[]
[4,"白嫖氪金",10352,1,1,"1004;1002"]
[6,"兑换商店",10330,2,1,"1004;1002"]

{"sheet":"ShopConfig","index":1,"n_rows":14,"n_cols":11,"rows_kept":14,"cut":false,"hidden":false,"merged":[]}
["ID",null,"shopName","shopGroup","shopItemGroup","pageSortNum","RefreshType","refreshCostItemId","refreshCost","refreshLimit"]
["int",null,"int","int","int","int","int","int","int[]","int"]
[]
["ID","商店名\n（策划用）","商店名字","页签所属商店","每个页面的商品shopitemID组","页签排序\n（小的在前面）","刷新类型\n0=不刷新\n1=每日自动刷新\n2=每周自动刷新\n3=每月自动刷新\n4=按开启时间固定间隔自动刷新\n","刷新消耗道具ID\n（此列不为-1时，可以手动刷新）","刷新消耗道具数量\n（刷新次数增加消耗会改变，0表示免费)","周期内刷新次数上限（如果有手动刷新，必须要填次数）"]
[1,null,1900,1,1,1,1,-1,-1,-1,{"$f":"VLOOKUP(D5,ShopGroupConfig!A:B,2,FALSE)&\"-\"&VLOOKUP(C5,[1]语言配置表!$A:$B,2,FALSE)","v":"GM资源-GM资源"}]
[2,null,1904,2,2,1,1,-1,-1,-1,{"$f":"VLOOKUP(D6,ShopGroupConfig!A:B,2,FALSE)&\"-\"&VLOOKUP(C6,[1]语言配置表!$A:$B,2,FALSE)","v":"GM法宝-GM法宝"}]
[3,null,1905,3,3,1,1,-1,-1,-1,{"$f":"VLOOKUP(D7,ShopGroupConfig!A:B,2,FALSE)&\"-\"&VLOOKUP(C7,[1]语言配置表!$A:$B,2,FALSE)","v":"GM功法-GM功法"}]
[6,null,10106,5,6,2,1,-1,-1,-1,"神识恢复（不可见）"]
[]
[4,null,-1,4,4,1,0,-1,-1,-1,"抽代金券"]
[5,null,10106,4,5,2,0,-1,-1,-1,{"$f":"VLOOKUP(D11,ShopGroupConfig!A:B,2,FALSE)&\"-\"&VLOOKUP(C11,[1]语言配置表!$A:$B,2,FALSE)","v":"白嫖氪金-新手礼包"}]
[]
[7,null,10353,6,7,1,0,-1,-1,-1,{"$f":"VLOOKUP(D13,ShopGroupConfig!A:B,2,FALSE)&\"-\"&VLOOKUP(C13,[1]语言配置表!$A:$B,2,FALSE)","v":"兑换商店-妖丹兑换"}]
[8,null,10351,6,8,2,1,-1,-1,-1,{"$f":"VLOOKUP(D14,ShopGroupConfig!A:B,2,FALSE)&\"-\"&VLOOKUP(C14,[1]语言配置表!$A:$B,2,FALSE)","v":"兑换商店-每日特惠"}]

{"sheet":"ShopItemConfig","index":2,"n_rows":102,"n_cols":18,"rows_kept":102,"cut":false,"hidden":false,"merged":[]}
["ID","giftID","itemId","itemCount","costItemId","price","oldPrice","buyCount","maxBuyCount",null,"shopItemGroup","continueTime","shopName","shopDesc","shopShowTemplate","shopShowTemplateParm"]
["int","string","int[]","int[]","int","int","int","int","int",null,"int","int","int","int","int","string[]"]
[]
["ID","分发ID\n（appstore等分发礼包时使用）","包含道具ID","道具数量","消耗道具ID\n\n0 = 免费\n1032 = 广告\n9999 = 真实充值","现价\n（玩家购买价）","原价","可买次数\n(当期)\n-1=不限制","最大购买次数\n(全局)\n-1=不限制",null,"商品所属分页\n（shopConfig中ID）","持续时间（分钟）\n(-1永久)","品名","商品介绍","商品表现的模板","商品表现的模板de参数",null,"所属页签"]
[1,null,1001,999999,1001,0,1,-1,-1,{"$f":"CONCATENATE(IF(E5=0,\"免费\",VLOOKUP(E5,[2]ItemConfig!$A:$C,3,FALSE)&\"×\"&F5),\" → \",VLOOKUP(C5,[2]ItemConfig!$A:$C,3,FALSE),\" × \",D5)","v":"灵石×0 → 灵石 × 999999"},1,-1,null,null,3,"icon_Coin",null,{"$f":"VLOOKUP(K5,ShopConfig!A:K,11,FALSE)","v":"GM资源-GM资源"}]
[2,null,1002,9999,1001,1,1,-1,-1,{"$f":"CONCATENATE(IF(E6=0,\"免费\",VLOOKUP(E6,[2]ItemConfig!$A:$C,3,FALSE)&\"×\"&F6),\" → \",VLOOKUP(C6,[2]ItemConfig!$A:$C,3,FALSE),\" × \",D6)","v":"灵石×1 → 妖丹 × 9999"},1,-1,null,null,3,"icon_Coin",null,{"$f":"VLOOKUP(K6,ShopConfig!A:K,11,FALSE)","v":"GM资源-GM资源"}]
[3,null,1003,9999,1001,1,1,-1,-1,{"$f":"CONCATENATE(IF(E7=0,\"免费\",VLOOKUP(E7,[2]ItemConfig!$A:$C,3,FALSE)&\"×\"&F7),\" → \",VLOOKUP(C7,[2]ItemConfig!$A:$C,3,FALSE),\" × \",D7)","v":"灵石×1 → 修为 × 9999"},1,-1,null,null,3,"icon_Coin",null,{"$f":"VLOOKUP(K7,ShopConfig!A:K,11,FALSE)","v":"GM资源-GM资源"}]
[4,null,1004,9999,1001,1,1,-1,-1,{"$f":"CONCATENATE(IF(E8=0,\"免费\",VLOOKUP(E8,[2]ItemConfig!$A:$C,3,FALSE)&\"×\"&F8),\" → \",VLOOKUP(C8,[2]ItemConfig!$A:$C,3,FALSE),\" × \",D8)","v":"灵石×1 → 仙缘宝券 × 9999"},1,-1,null,null,3,"icon_Coin",null,{"$f":"VLOOKUP(K8,ShopConfig!A:K,11,FALSE)","v":"GM资源-GM资源"}]
[5,null,1005,99999,1001,1,1,-1,-1,{"$f":"CONCATENATE(IF(E9=0,\"免费\",VLOOKUP(E9,[2]ItemConfig!$A:$C,3,FALSE)&\"×\"&F9),\" → \",VLOOKUP(C9,[2]ItemConfig!$A:$C,3,FALSE),\" × \",D9)","v":"灵石×1 → 灵气 × 99999"},1,-1,null,null,3,"icon_Coin",null,{"$f":"VLOOKUP(K9,ShopConfig!A:K,11,FALSE)","v":"GM资源-GM资源"}]
[6,null,1006,99999,1001,1,1,-1,-1,{"$f":"CONCATENATE(IF(E10=0,\"免费\",VLOOKUP(E10,[2]ItemConfig!$A:$C,3,FALSE)&\"×\"&F10),\" → \",VLOOKUP(C10,[2]ItemConfig!$A:$C,3,FALSE),\" × \",D10)","v":"灵石×1 → 玄晶 × 99999"},1,-1,null,null,3,"icon_Coin",null,{"$f":"VLOOKUP(K10,ShopConfig!A:K,11,FALSE)","v":"GM资源-GM资源"}]
[7,null,1301,1,1001,1,1,-1,-1,{"$f":"CONCATENATE(IF(E11=0,\"免费\",VLOOKUP(E11,[2]ItemConfig!$A:$C,3,FALSE)&\"×\"&F11),\" → \",VLOOKUP(C11,[2]ItemConfig!$A:$C,3,FALSE),\" × \",D11)","v":"灵石×1 → 筑基丹 × 1"},1,-1,null,null,3,"icon_Coin",null,{"$f":"VLOOKUP(K11,ShopConfig!A:K,11,FALSE)","v":"GM资源-GM资源"}]
[8,null,1701,99,1001,1,1,-1,-1,{"$f":"CONCATENATE(IF(E12=0,\"免费\",VLOOKUP(E12,[2]ItemConfig!$A:$C,3,FALSE)&\"×\"&F12),\" → \",VLOOKUP(C12,[2]ItemConfig!$A:$C,3,FALSE),\" × \",D12)","v":"灵石×1 → 清识还元丹 × 99"},1,-1,null,null,3,"icon_Coin",null,{"$f":"VLOOKUP(K12,ShopConfig!A:K,11,FALSE)","v":"GM资源-GM资源"}]
[9,null,1702,99,1001,1,1,-1,-1,{"$f":"CONCATENATE(IF(E13=0,\"免费\",VLOOKUP(E13,[2]ItemConfig!$A:$C,3,FALSE)&\"×\"&F13),\" → \",VLOOKUP(C13,[2]ItemConfig!$A:$C,3,FALSE),\" × \",D13)","v":"灵石×1 → 归识还元丹 × 99"},1,-1,null,null,3,"icon_Coin",null,{"$f":"VLOOKUP(K13,ShopConfig!A:K,11,FALSE)","v":"GM资源-GM资源"}]
[10,null,1703,99,1001,1,1,-1,-1,{"$f":"CONCATENATE(IF(E14=0,\"免费\",VLOOKUP(E14,[2]ItemConfig!$A:$C,3,FALSE)&\"×\"&F14),\" → \",VLOOKUP(C14,[2]ItemConfig!$A:$C,3,FALSE),\" × \",D14)","v":"灵石×1 → 净识还元丹 × 99"},1,-1,null,null,3,"icon_Coin",null,{"$f":"VLOOKUP(K14,ShopConfig!A:K,11,FALSE)","v":"GM资源-GM资源"}]
[11,null,1201,99,1001,1,1,-1,-1,{"$f":"CONCATENATE(IF(E15=0,\"免费\",VLOOKUP(E15,[2]ItemConfig!$A:$C,3,FALSE)&\"×\"&F15),\" → \",VLOOKUP(C15,[2]ItemConfig!$A:$C,3,FALSE),\" × \",D15)","v":"灵石×1 → 渡劫丹 × 99"},1,-1,null,null,3,"icon_Coin",null,{"$f":"VLOOKUP(K15,ShopConfig!A:K,11,FALSE)","v":"GM资源-GM资源"}]
[12,null,1202,99,1001,1,1,-1,-1,{"$f":"CONCATENATE(IF(E16=0,\"免费\",VLOOKUP(E16,[2]ItemConfig!$A:$C,3,FALSE)&\"×\"&F16),\" → \",VLOOKUP(C16,[2]ItemConfig!$A:$C,3,FALSE),\" × \",D16)","v":"灵石×1 → 良品渡劫丹 × 99"},1,-1,null,null,3,"icon_Coin",null,{"$f":"VLOOKUP(K16,ShopConfig!A:K,11,FALSE)","v":"GM资源-GM资源"}]
[13,null,1203,99,1001,1,1,-1,-1,{"$f":"CONCATENATE(IF(E17=0,\"免费\",VLOOKUP(E17,[2]ItemConfig!$A:$C,3,FALSE)&\"×\"&F17),\" → \",VLOOKUP(C17,[2]ItemConfig!$A:$C,3,FALSE),\" × \",D17)","v":"灵石×1 → 上品渡劫丹 × 99"},1,-1,null,null,3,"icon_Coin",null,{"$f":"VLOOKUP(K17,ShopConfig!A:K,11,FALSE)","v":"GM资源-GM资源"}]
[14,null,1204,99,1001,1,1,-1,-1,{"$f":"CONCATENATE(IF(E18=0,\"免费\",VLOOKUP(E18,[2]ItemConfig!$A:$C,3,FALSE)&\"×\"&F18),\" → \",VLOOKUP(C18,[2]ItemConfig!$A:$C,3,FALSE),\" × \",D18)","v":"灵石×1 → 极品渡劫丹 × 99"},1,-1,null,null,3,"icon_Coin",null,{"$f":"VLOOKUP(K18,ShopConfig!A:K,11,FALSE)","v":"GM资源-GM资源"}]
[15,null,21001,99,1001,1,1,-1,-1,{"$f":"CONCATENATE(IF(E19=0,\"免费\",VLOOKUP(E19,[2]ItemConfig!$A:$C,3,FALSE)&\"×\"&F19),\" → \",VLOOKUP(C19,[2]ItemConfig!$A:$C,3,FALSE),\" × \",D19)","v":"灵石×1 → 灵石神识符 × 99"},1,-1,null,null,3,"icon_Coin",null,{"$f":"VLOOKUP(K19,ShopConfig!A:K,11,FALSE)","v":"GM资源-GM资源"}]
[16,null,1501,99,1001,1,1,-1,-1,{"$f":"CONCATENATE(IF(E20=0,\"免费\",VLOOKUP(E20,[2]ItemConfig!$A:$C,3,FALSE)&\"×\"&F20),\" → \",VLOOKUP(C20,[2]ItemConfig!$A:$C,3,FALSE),\" × \",D20)","v":"灵石×1 → 清茶 × 99"},1,-1,null,null,3,"icon_Coin",null,{"$f":"VLOOKUP(K20,ShopConfig!A:K,11,FALSE)","v":"GM资源-GM资源"}]
[17,null,21003,99,1001,1,1,-1,-1,{"$f":"CONCATENATE(IF(E21=0,\"免费\",VLOOKUP(E21,[2]ItemConfig!$A:$C,3,FALSE)&\"×\"&F21),\" → \",VLOOKUP(C21,[2]ItemConfig!$A:$C,3,FALSE),\" × \",D21)","v":"灵石×1 → 灵气神识符 × 99"},1,-1,null,null,3,"icon_Coin",null,{"$f":"VLOOKUP(K21,ShopConfig!A:K,11,FALSE)","v":"GM资源-GM资源"}]
[18,null,21004,99,1001,1,1,-1,-1,{"$f":"CONCATENATE(IF(E22=0,\"免费\",VLOOKUP(E22,[2]ItemConfig!$A:$C,3,FALSE)&\"×\"&F22),\" → \",VLOOKUP(C22,[2]ItemConfig!$A:$C,3,FALSE),\" × \",D22)","v":"灵石×1 → 玄晶神识符 × 99"},1,-1,null,null,3,"icon_Coin",null,{"$f":"VLOOKUP(K22,ShopConfig!A:K,11,FALSE)","v":"GM资源-GM资源"}]
[19,null,21005,99,1001,1,1,-1,-1,{"$f":"CONCATENATE(IF(E23=0,\"免费\",VLOOKUP(E23,[2]ItemConfig!$A:$C,3,FALSE)&\"×\"&F23),\" → \",VLOOKUP(C23,[2]ItemConfig!$A:$C,3,FALSE),\" × \",D23)","v":"灵石×1 → 功法神识符 × 99"},1,-1,null,null,3,"icon_Coin",null,{"$f":"VLOOKUP(K23,ShopConfig!A:K,11,FALSE)","v":"GM资源-GM资源"}]
[20,null,21006,99,1001,1,1,-1,-1,{"$f":"CONCATENATE(IF(E24=0,\"免费\",VLOOKUP(E24,[2]ItemConfig!$A:$C,3,FALSE)&\"×\"&F24),\" → \",VLOOKUP(C24,[2]ItemConfig!$A:$C,3,FALSE),\" × \",D24)","v":"灵石×1 → 法宝神识符 × 99"},1,-1,null,null,3,"icon_Coin",null,{"$f":"VLOOKUP(K24,ShopConfig!A:K,11,FALSE)","v":"GM资源-GM资源"}]
[21,null,1401,99,1001,1,1,-1,-1,{"$f":"CONCATENATE(IF(E25=0,\"免费\",VLOOKUP(E25,[2]ItemConfig!$A:$C,3,FALSE)&\"×\"&F25),\" → \",VLOOKUP(C25,[2]ItemConfig!$A:$C,3,FALSE),\" × \",D25)","v":"灵石×1 → 增元丹 × 99"},1,-1,null,null,3,"icon_Coin",null,{"$f":"VLOOKUP(K25,ShopConfig!A:K,11,FALSE)","v":"GM资源-GM资源"}]
[22,null,1402,99,1001,1,1,-1,-1,{"$f":"CONCATENATE(IF(E26=0,\"免费\",VLOOKUP(E26,[2]ItemConfig!$A:$C,3,FALSE)&\"×\"&F26),\" → \",VLOOKUP(C26,[2]ItemConfig!$A:$C,3,FALSE),\" × \",D26)","v":"灵石×1 → 良品增元丹 × 99"},1,-1,null,null,3,"icon_Coin",null,{"$f":"VLOOKUP(K26,ShopConfig!A:K,11,FALSE)","v":"GM资源-GM资源"}]
[23,null,1403,99,1001,1,1,-1,-1,{"$f":"CONCATENATE(IF(E27=0,\"免费\",VLOOKUP(E27,[2]ItemConfig!$A:$C,3,FALSE)&\"×\"&F27),\" → \",VLOOKUP(C27,[2]ItemConfig!$A:$C,3,FALSE),\" × \",D27)","v":"灵石×1 → 上品增元丹 × 99"},1,-1,null,null,3,"icon_Coin",null,{"$f":"VLOOKUP(K27,ShopConfig!A:K,11,FALSE)","v":"GM资源-GM资源"}]
[24,null,1404,99,1001,1,1,-1,-1,{"$f":"CONCATENATE(IF(E28=0,\"免费\",VLOOKUP(E28,[2]ItemConfig!$A:$C,3,FALSE)&\"×\"&F28),\" → \",VLOOKUP(C28,[2]ItemConfig!$A:$C,3,FALSE),\" × \",D28)","v":"灵石×1 → 极品增元丹 × 99"},1,-1,null,null,3,"icon_Coin",null,{"$f":"VLOOKUP(K28,ShopConfig!A:K,11,FALSE)","v":"GM资源-GM资源"}]
[25,null,1601,99,1001,1,1,-1,-1,{"$f":"CONCATENATE(IF(E29=0,\"免费\",VLOOKUP(E29,[2]ItemConfig!$A:$C,3,FALSE)&\"×\"&F29),\" → \",VLOOKUP(C29,[2]ItemConfig!$A:$C,3,FALSE),\" × \",D29)","v":"灵石×1 → 妃子笑 × 99"},1,-1,null,null,3,"icon_Coin",null,{"$f":"VLOOKUP(K29,ShopConfig!A:K,11,FALSE)","v":"GM资源-GM资源"}]
[26,null,21012,99,1001,1,1,-1,-1,{"$f":"CONCATENATE(IF(E30=0,\"免费\",VLOOKUP(E30,[2]ItemConfig!$A:$C,3,FALSE)&\"×\"&F30),\" → \",VLOOKUP(C30,[2]ItemConfig!$A:$C,3,FALSE),\" × \",D30)","v":"灵石×1 → 紫色神识符 × 99"},1,-1,null,null,3,"icon_Coin",null,{"$f":"VLOOKUP(K30,ShopConfig!A:K,11,FALSE)","v":"GM资源-GM资源"}]
[27,null,21013,99,1001,1,1,-1,-1,{"$f":"CONCATENATE(IF(E31=0,\"免费\",VLOOKUP(E31,[2]ItemConfig!$A:$C,3,FALSE)&\"×\"&F31),\" → \",VLOOKUP(C31,[2]ItemConfig!$A:$C,3,FALSE),\" × \",D31)","v":"灵石×1 → 橙色神识符 × 99"},1,-1,null,null,3,"icon_Coin",null,{"$f":"VLOOKUP(K31,ShopConfig!A:K,11,FALSE)","v":"GM资源-GM资源"}]
[]
[101,null,11001,100,1001,1,1,-1,-1,{"$f":"CONCATENATE(IF(E33=0,\"免费\",VLOOKUP(E33,[2]ItemConfig!$A:$C,3,FALSE)&\"×\"&F33),\" → \",VLOOKUP(C33,[2]ItemConfig!$A:$C,3,FALSE),\" × \",D33)","v":"灵石×1 → 神龙鼎碎片 × 100"},2,-1,null,null,3,"icon_Coins_s",null,{"$f":"VLOOKUP(K33,ShopConfig!A:K,11,FALSE)","v":"GM法宝-GM法宝"}]
[102,null,11002,100,1001,1,1,-1,-1,{"$f":"CONCATENATE(IF(E34=0,\"免费\",VLOOKUP(E34,[2]ItemConfig!$A:$C,3,FALSE)&\"×\"&F34),\" → \",VLOOKUP(C34,[2]ItemConfig!$A:$C,3,FALSE),\" × \",D34)","v":"灵石×1 → 破天斧碎片 × 100"},2,-1,null,null,3,"icon_Coins_s",null,{"$f":"VLOOKUP(K34,ShopConfig!A:K,11,FALSE)","v":"GM法宝-GM法宝"}]
[103,null,11003,100,1001,1,1,-1,-1,{"$f":"CONCATENATE(IF(E35=0,\"免费\",VLOOKUP(E35,[2]ItemConfig!$A:$C,3,FALSE)&\"×\"&F35),\" → \",VLOOKUP(C35,[2]ItemConfig!$A:$C,3,FALSE),\" × \",D35)","v":"灵石×1 → 翡翠葫芦碎片 × 100"},2,-1,null,null,3,"icon_Coins_s",null,{"$f":"VLOOKUP(K35,ShopConfig!A:K,11,FALSE)","v":"GM法宝-GM法宝"}]
[104,null,11004,100,1001,1,1,-1,-1,{"$f":"CONCATENATE(IF(E36=0,\"免费\",VLOOKUP(E36,[2]ItemConfig!$A:$C,3,FALSE)&\"×\"&F36),\" → \",VLOOKUP(C36,[2]ItemConfig!$A:$C,3,FALSE),\" × \",D36)","v":"灵石×1 → 混沌珠碎片 × 100"},2,-1,null,null,3,"icon_Coins_s",null,{"$f":"VLOOKUP(K36,ShopConfig!A:K,11,FALSE)","v":"GM法宝-GM法宝"}]
[105,null,11005,100,1001,1,1,-1,-1,{"$f":"CONCATENATE(IF(E37=0,\"免费\",VLOOKUP(E37,[2]ItemConfig!$A:$C,3,FALSE)&\"×\"&F37),\" → \",VLOOKUP(C37,[2]ItemConfig!$A:$C,3,FALSE),\" × \",D37)","v":"灵石×1 → 琉璃宝塔碎片 × 100"},2,-1,null,null,3,"icon_Coins_s",null,{"$f":"VLOOKUP(K37,ShopConfig!A:K,11,FALSE)","v":"GM法宝-GM法宝"}]
[106,null,11006,100,1001,1,1,-1,-1,{"$f":"CONCATENATE(IF(E38=0,\"免费\",VLOOKUP(E38,[2]ItemConfig!$A:$C,3,FALSE)&\"×\"&F38),\" → \",VLOOKUP(C38,[2]ItemConfig!$A:$C,3,FALSE),\" × \",D38)","v":"灵石×1 → 九幽镇魂瓶碎片 × 100"},2,-1,null,null,3,"icon_Coins_s",null,{"$f":"VLOOKUP(K38,ShopConfig!A:K,11,FALSE)","v":"GM法宝-GM法宝"}]
[107,null,11007,100,1001,1,1,-1,-1,{"$f":"CONCATENATE(IF(E39=0,\"免费\",VLOOKUP(E39,[2]ItemConfig!$A:$C,3,FALSE)&\"×\"&F39),\" → \",VLOOKUP(C39,[2]ItemConfig!$A:$C,3,FALSE),\" × \",D39)","v":"灵石×1 → 玉莲守心灯碎片 × 100"},2,-1,null,null,3,"icon_Coins_s",null,{"$f":"VLOOKUP(K39,ShopConfig!A:K,11,FALSE)","v":"GM法宝-GM法宝"}]
[108,null,11008,100,1001,1,1,-1,-1,{"$f":"CONCATENATE(IF(E40=0,\"免费\",VLOOKUP(E40,[2]ItemConfig!$A:$C,3,FALSE)&\"×\"&F40),\" → \",VLOOKUP(C40,[2]ItemConfig!$A:$C,3,FALSE),\" × \",D40)","v":"灵石×1 → 融灵塔碎片 × 100"},2,-1,null,null,3,"icon_Coins_s",null,{"$f":"VLOOKUP(K40,ShopConfig!A:K,11,FALSE)","v":"GM法宝-GM法宝"}]
[109,null,11009,100,1001,1,1,-1,-1,{"$f":"CONCATENATE(IF(E41=0,\"免费\",VLOOKUP(E41,[2]ItemConfig!$A:$C,3,FALSE)&\"×\"&F41),\" → \",VLOOKUP(C41,[2]ItemConfig!$A:$C,3,FALSE),\" × \",D41)","v":"灵石×1 → 禁元珠碎片 × 100"},2,-1,null,null,3,"icon_Coins_s",null,{"$f":"VLOOKUP(K41,ShopConfig!A:K,11,FALSE)","v":"GM法宝-GM法宝"}]
[110,null,11010,100,1001,1,1,-1,-1,{"$f":"CONCATENATE(IF(E42=0,\"免费\",VLOOKUP(E42,[2]ItemConfig!$A:$C,3,FALSE)&\"×\"&F42),\" → \",VLOOKUP(C42,[2]ItemConfig!$A:$C,3,FALSE),\" × \",D42)","v":"灵石×1 → 玄龟盾碎片 × 100"},2,-1,null,null,3,"icon_Coins_s",null,{"$f":"VLOOKUP(K42,ShopConfig!A:K,11,FALSE)","v":"GM法宝-GM法宝"}]
[111,null,11011,100,1001,1,1,-1,-1,{"$f":"CONCATENATE(IF(E43=0,\"免费\",VLOOKUP(E43,[2]ItemConfig!$A:$C,3,FALSE)&\"×\"&F43),\" → \",VLOOKUP(C43,[2]ItemConfig!$A:$C,3,FALSE),\" × \",D43)","v":"灵石×1 → 天殇血刃剑碎片 × 100"},2,-1,null,null,3,"icon_Coins_s",null,{"$f":"VLOOKUP(K43,ShopConfig!A:K,11,FALSE)","v":"GM法宝-GM法宝"}]
[]
[201,null,13001,100,1001,1,1,-1,-1,{"$f":"CONCATENATE(IF(E45=0,\"免费\",VLOOKUP(E45,[2]ItemConfig!$A:$C,3,FALSE)&\"×\"&F45),\" → \",VLOOKUP(C45,[2]ItemConfig!$A:$C,3,FALSE),\" × \",D45)","v":"灵石×1 → 太虚幻剑经碎片 × 100"},3,-1,null,null,3,"icon_Gem_Star_Blue",null,{"$f":"VLOOKUP(K45,ShopConfig!A:K,11,FALSE)","v":"GM功法-GM功法"}]
[202,null,13002,100,1001,1,1,-1,-1,{"$f":"CONCATENATE(IF(E46=0,\"免费\",VLOOKUP(E46,[2]ItemConfig!$A:$C,3,FALSE)&\"×\"&F46),\" → \",VLOOKUP(C46,[2]ItemConfig!$A:$C,3,FALSE),\" × \",D46)","v":"灵石×1 → 天罡剑气诀碎片 × 100"},3,-1,null,null,3,"icon_Gem_Star_Blue",null,{"$f":"VLOOKUP(K46,ShopConfig!A:K,11,FALSE)","v":"GM功法-GM功法"}]
[203,null,13003,100,1001,1,1,-1,-1,{"$f":"CONCATENATE(IF(E47=0,\"免费\",VLOOKUP(E47,[2]ItemConfig!$A:$C,3,FALSE)&\"×\"&F47),\" → \",VLOOKUP(C47,[2]ItemConfig!$A:$C,3,FALSE),\" × \",D47)","v":"灵石×1 → 血刃金煌功碎片 × 100"},3,-1,null,null,3,"icon_Gem_Star_Blue",null,{"$f":"VLOOKUP(K47,ShopConfig!A:K,11,FALSE)","v":"GM功法-GM功法"}]
[204,null,13004,100,1001,1,1,-1,-1,{"$f":"CONCATENATE(IF(E48=0,\"免费\",VLOOKUP(E48,[2]ItemConfig!$A:$C,3,FALSE)&\"×\"&F48),\" → \",VLOOKUP(C48,[2]ItemConfig!$A:$C,3,FALSE),\" × \",D48)","v":"灵石×1 → 飞刃碎片 × 100"},3,-1,null,null,3,"icon_Gem_Star_Blue",null,{"$f":"VLOOKUP(K48,ShopConfig!A:K,11,FALSE)","v":"GM功法-GM功法"}]
[205,null,13005,100,1001,1,1,-1,-1,{"$f":"CONCATENATE(IF(E49=0,\"免费\",VLOOKUP(E49,[2]ItemConfig!$A:$C,3,FALSE)&\"×\"&F49),\" → \",VLOOKUP(C49,[2]ItemConfig!$A:$C,3,FALSE),\" × \",D49)","v":"灵石×1 → 金针碎片 × 100"},3,-1,null,null,3,"icon_Gem_Star_Blue",null,{"$f":"VLOOKUP(K49,ShopConfig!A:K,11,FALSE)","v":"GM功法-GM功法"}]
[206,null,13006,100,1001,1,1,-1,-1,{"$f":"CONCATENATE(IF(E50=0,\"免费\",VLOOKUP(E50,[2]ItemConfig!$A:$C,3,FALSE)&\"×\"&F50),\" → \",VLOOKUP(C50,[2]ItemConfig!$A:$C,3,FALSE),\" × \",D50)","v":"灵石×1 → 碧落幽冥劲碎片 × 100"},3,-1,null,null,3,"icon_Gem_Star_Blue",null,{"$f":"VLOOKUP(K50,ShopConfig!A:K,11,FALSE)","v":"GM功法-GM功法"}]
[207,null,13007,100,1001,1,1,-1,-1,{"$f":"CONCATENATE(IF(E51=0,\"免费\",VLOOKUP(E51,[2]ItemConfig!$A:$C,3,FALSE)&\"×\"&F51),\" → \",VLOOKUP(C51,[2]ItemConfig!$A:$C,3,FALSE),\" × \",D51)","v":"灵石×1 → 雾隐千流法碎片 × 100"},3,-1,null,null,3,"icon_Gem_Star_Blue",null,{"$f":"VLOOKUP(K51,ShopConfig!A:K,11,FALSE)","v":"GM功法-GM功法"}]
[208,null,13008,100,1001,1,1,-1,-1,{"$f":"CONCATENATE(IF(E52=0,\"免费\",VLOOKUP(E52,[2]ItemConfig!$A:$C,3,FALSE)&\"×\"&F52),\" → \",VLOOKUP(C52,[2]ItemConfig!$A:$C,3,FALSE),\" × \",D52)","v":"灵石×1 → 功法-水3碎片 × 100"},3,-1,null,null,3,"icon_Gem_Star_Blue",null,{"$f":"VLOOKUP(K52,ShopConfig!A:K,11,FALSE)","v":"GM功法-GM功法"}]
[209,null,13009,100,1001,1,1,-1,-1,{"$f":"CONCATENATE(IF(E53=0,\"免费\",VLOOKUP(E53,[2]ItemConfig!$A:$C,3,FALSE)&\"×\"&F53),\" → \",VLOOKUP(C53,[2]ItemConfig!$A:$C,3,FALSE),\" × \",D53)","v":"灵石×1 → 水球碎片 × 100"},3,-1,null,null,3,"icon_Gem_Star_Blue",null,{"$f":"VLOOKUP(K53,ShopConfig!A:K,11,FALSE)","v":"GM功法-GM功法"}]
[210,null,13010,100,1001,1,1,-1,-1,{"$f":"CONCATENATE(IF(E54=0,\"免费\",VLOOKUP(E54,[2]ItemConfig!$A:$C,3,FALSE)&\"×\"&F54),\" → \",VLOOKUP(C54,[2]ItemConfig!$A:$C,3,FALSE),\" × \",D54)","v":"灵石×1 → 冰刀碎片 × 100"},3,-1,null,null,3,"icon_Gem_Star_Blue",null,{"$f":"VLOOKUP(K54,ShopConfig!A:K,11,FALSE)","v":"GM功法-GM功法"}]
[211,null,13011,100,1001,1,1,-1,-1,{"$f":"CONCATENATE(IF(E55=0,\"免费\",VLOOKUP(E55,[2]ItemConfig!$A:$C,3,FALSE)&\"×\"&F55),\" → \",VLOOKUP(C55,[2]ItemConfig!$A:$C,3,FALSE),\" × \",D55)","v":"灵石×1 → 瘴影千丝术碎片 × 100"},3,-1,null,null,3,"icon_Gem_Star_Blue",null,{"$f":"VLOOKUP(K55,ShopConfig!A:K,11,FALSE)","v":"GM功法-GM功法"}]
[212,null,13012,100,1001,1,1,-1,-1,{"$f":"CONCATENATE(IF(E56=0,\"免费\",VLOOKUP(E56,[2]ItemConfig!$A:$C,3,FALSE)&\"×\"&F56),\" → \",VLOOKUP(C56,[2]ItemConfig!$A:$C,3,FALSE),\" × \",D56)","v":"灵石×1 → 蚀骨腐血掌碎片 × 100"},3,-1,null,null,3,"icon_Gem_Star_Blue",null,{"$f":"VLOOKUP(K56,ShopConfig!A:K,11,FALSE)","v":"GM功法-GM功法"}]
[213,null,13013,100,1001,1,1,-1,-1,{"$f":"CONCATENATE(IF(E57=0,\"免费\",VLOOKUP(E57,[2]ItemConfig!$A:$C,3,FALSE)&\"×\"&F57),\" → \",VLOOKUP(C57,[2]ItemConfig!$A:$C,3,FALSE),\" × \",D57)","v":"灵石×1 → 功法-木3碎片 × 100"},3,-1,null,null,3,"icon_Gem_Star_Blue",null,{"$f":"VLOOKUP(K57,ShopConfig!A:K,11,FALSE)","v":"GM功法-GM功法"}]
[214,null,13014,100,1001,1,1,-1,-1,{"$f":"CONCATENATE(IF(E58=0,\"免费\",VLOOKUP(E58,[2]ItemConfig!$A:$C,3,FALSE)&\"×\"&F58),\" → \",VLOOKUP(C58,[2]ItemConfig!$A:$C,3,FALSE),\" × \",D58)","v":"灵石×1 → 竹刺碎片 × 100"},3,-1,null,null,3,"icon_Gem_Star_Blue",null,{"$f":"VLOOKUP(K58,ShopConfig!A:K,11,FALSE)","v":"GM功法-GM功法"}]
[215,null,13015,100,1001,1,1,-1,-1,{"$f":"CONCATENATE(IF(E59=0,\"免费\",VLOOKUP(E59,[2]ItemConfig!$A:$C,3,FALSE)&\"×\"&F59),\" → \",VLOOKUP(C59,[2]ItemConfig!$A:$C,3,FALSE),\" × \",D59)","v":"灵石×1 → 飞叶碎片 × 100"},3,-1,null,null,3,"icon_Gem_Star_Blue",null,{"$f":"VLOOKUP(K59,ShopConfig!A:K,11,FALSE)","v":"GM功法-GM功法"}]
[216,null,13016,100,1001,1,1,-1,-1,{"$f":"CONCATENATE(IF(E60=0,\"免费\",VLOOKUP(E60,[2]ItemConfig!$A:$C,3,FALSE)&\"×\"&F60),\" → \",VLOOKUP(C60,[2]ItemConfig!$A:$C,3,FALSE),\" × \",D60)","v":"灵石×1 → 烈焰剑碎片 × 100"},3,-1,null,null,3,"icon_Gem_Star_Blue",null,{"$f":"VLOOKUP(K60,ShopConfig!A:K,11,FALSE)","v":"GM功法-GM功法"}]
[217,null,13017,100,1001,1,1,-1,-1,{"$f":"CONCATENATE(IF(E61=0,\"免费\",VLOOKUP(E61,[2]ItemConfig!$A:$C,3,FALSE)&\"×\"&F61),\" → \",VLOOKUP(C61,[2]ItemConfig!$A:$C,3,FALSE),\" × \",D61)","v":"灵石×1 → 赤焰龙吟功碎片 × 100"},3,-1,null,null,3,"icon_Gem_Star_Blue",null,{"$f":"VLOOKUP(K61,ShopConfig!A:K,11,FALSE)","v":"GM功法-GM功法"}]
[218,null,13018,100,1001,1,1,-1,-1,{"$f":"CONCATENATE(IF(E62=0,\"免费\",VLOOKUP(E62,[2]ItemConfig!$A:$C,3,FALSE)&\"×\"&F62),\" → \",VLOOKUP(C62,[2]ItemConfig!$A:$C,3,FALSE),\" × \",D62)","v":"灵石×1 → 朱雀燎原指碎片 × 100"},3,-1,null,null,3,"icon_Gem_Star_Blue",null,{"$f":"VLOOKUP(K62,ShopConfig!A:K,11,FALSE)","v":"GM功法-GM功法"}]
[219,null,13019,100,1001,1,1,-1,-1,{"$f":"CONCATENATE(IF(E63=0,\"免费\",VLOOKUP(E63,[2]ItemConfig!$A:$C,3,FALSE)&\"×\"&F63),\" → \",VLOOKUP(C63,[2]ItemConfig!$A:$C,3,FALSE),\" × \",D63)","v":"灵石×1 → 火球碎片 × 100"},3,-1,null,null,3,"icon_Gem_Star_Blue",null,{"$f":"VLOOKUP(K63,ShopConfig!A:K,11,FALSE)","v":"GM功法-GM功法"}]
[220,null,13020,100,1001,1,1,-1,-1,{"$f":"CONCATENATE(IF(E64=0,\"免费\",VLOOKUP(E64,[2]ItemConfig!$A:$C,3,FALSE)&\"×\"&F64),\" → \",VLOOKUP(C64,[2]ItemConfig!$A:$C,3,FALSE),\" × \",D64)","v":"灵石×1 → 火刀碎片 × 100"},3,-1,null,null,3,"icon_Gem_Star_Blue",null,{"$f":"VLOOKUP(K64,ShopConfig!A:K,11,FALSE)","v":"GM功法-GM功法"}]
[221,null,13021,100,1001,1,1,-1,-1,{"$f":"CONCATENATE(IF(E65=0,\"免费\",VLOOKUP(E65,[2]ItemConfig!$A:$C,3,FALSE)&\"×\"&F65),\" → \",VLOOKUP(C65,[2]ItemConfig!$A:$C,3,FALSE),\" × \",D65)","v":"灵石×1 → 黄尘灭魂刺碎片 × 100"},3,-1,null,null,3,"icon_Gem_Star_Blue",null,{"$f":"VLOOKUP(K65,ShopConfig!A:K,11,FALSE)","v":"GM功法-GM功法"}]
[222,null,13022,100,1001,1,1,-1,-1,{"$f":"CONCATENATE(IF(E66=0,\"免费\",VLOOKUP(E66,[2]ItemConfig!$A:$C,3,FALSE)&\"×\"&F66),\" → \",VLOOKUP(C66,[2]ItemConfig!$A:$C,3,FALSE),\" × \",D66)","v":"灵石×1 → 地裂屠龙斩碎片 × 100"},3,-1,null,null,3,"icon_Gem_Star_Blue",null,{"$f":"VLOOKUP(K66,ShopConfig!A:K,11,FALSE)","v":"GM功法-GM功法"}]
[223,null,13023,100,1001,1,1,-1,-1,{"$f":"CONCATENATE(IF(E67=0,\"免费\",VLOOKUP(E67,[2]ItemConfig!$A:$C,3,FALSE)&\"×\"&F67),\" → \",VLOOKUP(C67,[2]ItemConfig!$A:$C,3,FALSE),\" × \",D67)","v":"灵石×1 → 功法-土3碎片 × 100"},3,-1,null,null,3,"icon_Gem_Star_Blue",null,{"$f":"VLOOKUP(K67,ShopConfig!A:K,11,FALSE)","v":"GM功法-GM功法"}]
[224,null,13024,100,1001,1,1,-1,-1,{"$f":"CONCATENATE(IF(E68=0,\"免费\",VLOOKUP(E68,[2]ItemConfig!$A:$C,3,FALSE)&\"×\"&F68),\" → \",VLOOKUP(C68,[2]ItemConfig!$A:$C,3,FALSE),\" × \",D68)","v":"灵石×1 → 落石碎片 × 100"},3,-1,null,null,3,"icon_Gem_Star_Blue",null,{"$f":"VLOOKUP(K68,ShopConfig!A:K,11,FALSE)","v":"GM功法-GM功法"}]
[225,null,13025,100,1001,1,1,-1,-1,{"$f":"CONCATENATE(IF(E69=0,\"免费\",VLOOKUP(E69,[2]ItemConfig!$A:$C,3,FALSE)&\"×\"&F69),\" → \",VLOOKUP(C69,[2]ItemConfig!$A:$C,3,FALSE),\" × \",D69)","v":"灵石×1 → 小石头碎片 × 100"},3,-1,null,null,3,"icon_Gem_Star_Blue",null,{"$f":"VLOOKUP(K69,ShopConfig!A:K,11,FALSE)","v":"GM功法-GM功法"}]
[226,null,13501,100,1001,1,1,-1,-1,{"$f":"CONCATENATE(IF(E70=0,\"免费\",VLOOKUP(E70,[2]ItemConfig!$A:$C,3,FALSE)&\"×\"&F70),\" → \",VLOOKUP(C70,[2]ItemConfig!$A:$C,3,FALSE),\" × \",D70)","v":"灵石×1 → 天衍星辰诀碎片 × 100"},3,-1,null,null,3,"icon_Gem_Star_Blue",null,{"$f":"VLOOKUP(K70,ShopConfig!A:K,11,FALSE)","v":"GM功法-GM功法"}]
[227,null,13502,100,1001,1,1,-1,-1,{"$f":"CONCATENATE(IF(E71=0,\"免费\",VLOOKUP(E71,[2]ItemConfig!$A:$C,3,FALSE)&\"×\"&F71),\" → \",VLOOKUP(C71,[2]ItemConfig!$A:$C,3,FALSE),\" × \",D71)","v":"灵石×1 → 法宝秘籍碎片 × 100"},3,-1,null,null,3,"icon_Gem_Star_Blue",null,{"$f":"VLOOKUP(K71,ShopConfig!A:K,11,FALSE)","v":"GM功法-GM功法"}]
[228,null,13503,100,1001,1,1,-1,-1,{"$f":"CONCATENATE(IF(E72=0,\"免费\",VLOOKUP(E72,[2]ItemConfig!$A:$C,3,FALSE)&\"×\"&F72),\" → \",VLOOKUP(C72,[2]ItemConfig!$A:$C,3,FALSE),\" × \",D72)","v":"灵石×1 → 崩脉决碎片 × 100"},3,-1,null,null,3,"icon_Gem_Star_Blue",null,{"$f":"VLOOKUP(K72,ShopConfig!A:K,11,FALSE)","v":"GM功法-GM功法"}]
[229,null,13504,100,1001,1,1,-1,-1,{"$f":"CONCATENATE(IF(E73=0,\"免费\",VLOOKUP(E73,[2]ItemConfig!$A:$C,3,FALSE)&\"×\"&F73),\" → \",VLOOKUP(C73,[2]ItemConfig!$A:$C,3,FALSE),\" × \",D73)","v":"灵石×1 → 两仪决碎片 × 100"},3,-1,null,null,3,"icon_Gem_Star_Blue",null,{"$f":"VLOOKUP(K73,ShopConfig!A:K,11,FALSE)","v":"GM功法-GM功法"}]
[230,null,13505,100,1001,1,1,-1,-1,{"$f":"CONCATENATE(IF(E74=0,\"免费\",VLOOKUP(E74,[2]ItemConfig!$A:$C,3,FALSE)&\"×\"&F74),\" → \",VLOOKUP(C74,[2]ItemConfig!$A:$C,3,FALSE),\" × \",D74)","v":"灵石×1 → 火焰决碎片 × 100"},3,-1,null,null,3,"icon_Gem_Star_Blue",null,{"$f":"VLOOKUP(K74,ShopConfig!A:K,11,FALSE)","v":"GM功法-GM功法"}]
[231,null,13506,100,1001,1,1,-1,-1,{"$f":"CONCATENATE(IF(E75=0,\"免费\",VLOOKUP(E75,[2]ItemConfig!$A:$C,3,FALSE)&\"×\"&F75),\" → \",VLOOKUP(C75,[2]ItemConfig!$A:$C,3,FALSE),\" × \",D75)","v":"灵石×1 → 乾坤巨灵诀碎片 × 100"},3,-1,null,null,3,"icon_Gem_Star_Blue",null,{"$f":"VLOOKUP(K75,ShopConfig!A:K,11,FALSE)","v":"GM功法-GM功法"}]
[232,null,13507,100,1001,1,1,-1,-1,{"$f":"CONCATENATE(IF(E76=0,\"免费\",VLOOKUP(E76,[2]ItemConfig!$A:$C,3,FALSE)&\"×\"&F76),\" → \",VLOOKUP(C76,[2]ItemConfig!$A:$C,3,FALSE),\" × \",D76)","v":"灵石×1 → 极速齿轮碎片 × 100"},3,-1,null,null,3,"icon_Gem_Star_Blue",null,{"$f":"VLOOKUP(K76,ShopConfig!A:K,11,FALSE)","v":"GM功法-GM功法"}]
[233,null,13508,100,1001,1,1,-1,-1,{"$f":"CONCATENATE(IF(E77=0,\"免费\",VLOOKUP(E77,[2]ItemConfig!$A:$C,3,FALSE)&\"×\"&F77),\" → \",VLOOKUP(C77,[2]ItemConfig!$A:$C,3,FALSE),\" × \",D77)","v":"灵石×1 → 太虚剑意碎片 × 100"},3,-1,null,null,3,"icon_Gem_Star_Blue",null,{"$f":"VLOOKUP(K77,ShopConfig!A:K,11,FALSE)","v":"GM功法-GM功法"}]
[]
[301,null,10002,1,9999,6,1,1,1,{"$f":"CONCATENATE(IF(E79=0,\"免费\",IF(Q79=\"\",VLOOKUP(E79,[2]ItemConfig!$A:$C,3,FALSE),Q79)&\"×\"&F79),\" → \",VLOOKUP(C79,[2]ItemConfig!$A:$C,3,FALSE),\" × \",D79)","v":"人民币×6 → 破天斧 × 1"},5,-1,null,null,3,"icon_Gem_Star_Blue","人民币",{"$f":"VLOOKUP(K79,ShopConfig!A:K,11,FALSE)","v":"白嫖氪金-新手礼包"}]
[302,null,12016,1,9999,6,1,1,1,{"$f":"CONCATENATE(IF(E80=0,\"免费\",IF(Q80=\"\",VLOOKUP(E80,[2]ItemConfig!$A:$C,3,FALSE),Q80)&\"×\"&F80),\" → \",VLOOKUP(C80,[2]ItemConfig!$A:$C,3,FALSE),\" × \",D80)","v":"人民币×6 → 烈焰剑 × 1"},5,-1,null,null,3,"icon_Gem_Star_Blue","人民币",{"$f":"VLOOKUP(K80,ShopConfig!A:K,11,FALSE)","v":"白嫖氪金-新手礼包"}]
{"$rows_left_out":22}