{"text_format":"2","workbook":"xlsx","n_sheets":8,"sheets":["DaoyouModelConfig","emotionConfig","daolvbuff","guajibuff","道友加成辅助","DaoyouLevelupConfig","DaoyouGiftConfig","DaoyouguajiResourcLevel"],"not_rendered":{"charts":0,"images":0,"macros":0,"external_links":1,"defined_names":1,"comments":0,"pivot_tables":0},"unopened":[],"bounds":{"document_bytes":16777216,"sheet_cells":100000,"run_cost":"one","rows_first":2000,"rows_last":500,"rows_between":2000,"halvings":0,"cell_chars":16384,"cell_head_chars":4096},"cells_cut":0,"cells_raw":0,"read":"whole","date_system":"1900"}

{"sheet":"DaoyouModelConfig","index":0,"n_rows":14,"n_cols":30,"rows_kept":14,"cut":false,"hidden":false,"merged":[]}
["ID","name",null,"quality","growupRate","des","desUnlockLv",{"$nulls":4},"PreferGiftID","shownPreferGiftID",{"$nulls":4},"guajiBuffID","guajiBuffValue",null,"daolvBuffType","daolvBuffValue","daolvBuffQuality",null,"EmotionLvforQuest","QuestID",null,"EmotionLvforspecialGift","specialGiftID","specialGiftNum"]
["int","int",null,"int","int","int[]","int[]",{"$nulls":4},"int[]","int[]",{"$nulls":4},"int[]","int[]",null,"int[]","int[]","int[]",null,"int","int",null,"int[]","int[]","int[]"]
[]
["ID","名称","名称","道友品质","潜力\n80=80%\n等级差","介绍","介绍解锁相熟等级",{"$nulls":4},"喜好的礼物ID","默认显示的礼物ID","喜好礼物1","喜好礼物2","喜好礼物3",null,"挂机增益类型","挂机增益比例",null,"成为道侣后提供的加成类型","成为道侣后提供的加成值","词缀品质",null,"触发道侣任务的好感度等级","道侣任务ID",null,"特殊奖励好感度等级","特殊奖励ID","特殊奖励数量"]
[1,1953,"道友1",2,60,{"$f":"_xlfn.TEXTJOIN(\";\",1,H5:J5)","v":"1963;1964;1965"},"1;3;6",1963,1964,1965,null,{"$f":"_xlfn.TEXTJOIN(\";\",1,N5:P5)","v":"1201;1202;1203"},{"$f":"N5","v":1201},1201,1202,1203,{"$nulls":4},112,10,3,{"$nulls":4},5,1002,1]
[2,1954,"道友2",2,60,{"$f":"_xlfn.TEXTJOIN(\";\",1,H6:J6)","v":"1966;1967;1968"},"1;3;6",1966,1967,1968,null,{"$f":"_xlfn.TEXTJOIN(\";\",1,N6:P6)","v":"1204;1205;1206"},{"$f":"N6","v":1204},1204,1205,1206]
[3,1955,"道友3",2,60,"1969;1970;1971","1;3;6",1969,1970,1971,null,"1207;1208;1209",1207,1207,1208,1209]
[4,1956,"道友4",3,80,"1972;1973;1974","1;3;6",1972,1973,1974,null,"1301;1302;1303",1301,1301,1302,1303]
[5,1957,"道友5",3,80,"1975;1976;1977","1;3;6",1975,1976,1977,null,"1401;1402;1403",1401,1401,1402,1403]
[6,1958,"道友6",3,80,"1978;1979;1980","1;3;6",1978,1979,1980,null,"1201;1202;1203",1201,1201,1202,1203]
[7,1959,"道友7",4,100,"1981;1982;1983","1;3;6",1981,1982,1983,null,"1204;1205;1206",1204,1204,1205,1206]
[8,1960,"道友8",4,100,"1984;1985;1986","1;3;6",1984,1985,1986,null,"1207;1208;1209",1207,1207,1208,1209]
[9,1961,"道友9",5,110,"1987;1988;1989","1;3;6",1987,1988,1989,null,"1301;1302;1303",1301,1301,1302,1303]
[10,1962,"道友10",6,120,"1990;1991;1992","1;3;6",1990,1991,1992,null,"1401;1402;1403",1401,1401,1402,1403]

{"sheet":"emotionConfig","index":1,"n_rows":4,"n_cols":6,"rows_kept":4,"cut":false,"hidden":false,"merged":[]}
[]
[]
[]
["ID","类型\n1=好心情\n2=平衡心情\n3=坏心情","icon","描述ID","描述（策划）","增加好感度的加成比例\n100=10%"]

{"sheet":"daolvbuff","index":2,"n_rows":3,"n_cols":8,"rows_kept":3,"cut":false,"hidden":false,"merged":[]}
[]
[]
["ID","Idgroup","等级","名称","描述","类型\n1=唯一\n2=叠加","成长所需礼物ID","每单位增加的值"]

{"sheet":"guajibuff","index":3,"n_rows":6,"n_cols":7,"rows_kept":6,"cut":false,"hidden":false,"merged":[]}
["ID","name",null,"Quality","paraValue","des"]
["int","int",null,"int","int","int"]
[]
["ID","名称","名称","品质","对应的para值","描述","说明"]
[1,null,"双修之旅Lv.1",null,null,null,"这位道友离开时会给与玩家修为奖励"]
[2,null,"双修之旅Lv.2"]

{"sheet":"道友加成辅助","index":4,"n_rows":14,"n_cols":3,"rows_kept":14,"cut":false,"hidden":false,"merged":[]}
["BuffType",null,"BuffValue"]
[1,"属性加成","属性ID；加成数值"]
[2]
[3]
[4]
[5]
[6]
[7]
[8]
[9]
[10]
[11]
[12]
[13]

{"sheet":"DaoyouLevelupConfig","index":5,"n_rows":14,"n_cols":7,"rows_kept":14,"cut":false,"hidden":false,"merged":[]}
["ID","name",null,"exp","prizeID","prizeNum","guajiGrowup"]
["int","int",null,"int","int[]","int[]","int"]
[]
["LV","名称",null,"升级所需经验","道具奖励ID","道具奖励数量","挂机增益成长率\n100=100%"]
[1,null,"好感度1",10,-1,-1,0]
[2,null,"好感度2",20,1002,1,100]
[3,null,"好感度3",30,1002,1,120]
[4,null,"好感度4",40,1002,1,140]
[5,null,"好感度5",50,1002,1,160]
[6,null,"好感度6",60,1002,1,180]
[7,null,"好感度7",70,1002,1,200]
[8,null,"好感度8",80,1002,1,220]
[9,null,"好感度9",90,1002,1,240]
[10,null,"好感度10",-1,1002,1,260]

{"sheet":"DaoyouGiftConfig","index":6,"n_rows":67,"n_cols":4,"rows_kept":67,"cut":false,"hidden":false,"merged":[]}
["ID","ItemID",null,"emotionValue"]
["int","int",null,"int"]
[]
["ID","道具ID","道具名称","默认增加的好感度值"]
[1,1201,{"$f":"VLOOKUP(B5,[1]ItemConfig!$A:$C,3,FALSE)","v":"渡劫丹-A1"},10]
[2,1202,{"$f":"VLOOKUP(B6,[1]ItemConfig!$A:$C,3,FALSE)","v":"渡劫丹-A2"},20]
[3,1203,{"$f":"VLOOKUP(B7,[1]ItemConfig!$A:$C,3,FALSE)","v":"渡劫丹-A3"},30]
[4,1204,{"$f":"VLOOKUP(B8,[1]ItemConfig!$A:$C,3,FALSE)","v":"渡劫丹-B1"},10]
[5,1205,{"$f":"VLOOKUP(B9,[1]ItemConfig!$A:$C,3,FALSE)","v":"渡劫丹-B2"},20]
[6,1206,{"$f":"VLOOKUP(B10,[1]ItemConfig!$A:$C,3,FALSE)","v":"渡劫丹-B3"},30]
[7,1207,{"$f":"VLOOKUP(B11,[1]ItemConfig!$A:$C,3,FALSE)","v":"渡劫丹-C1"},10]
[8,1208,{"$f":"VLOOKUP(B12,[1]ItemConfig!$A:$C,3,FALSE)","v":"渡劫丹-C2"},20]
[9,1209,{"$f":"VLOOKUP(B13,[1]ItemConfig!$A:$C,3,FALSE)","v":"渡劫丹-C3"},30]
[10,1301,{"$f":"VLOOKUP(B14,[1]ItemConfig!$A:$C,3,FALSE)","v":"天材地宝1"},10]
[11,1302,{"$f":"VLOOKUP(B15,[1]ItemConfig!$A:$C,3,FALSE)","v":"天材地宝2"},15]
[12,1303,{"$f":"VLOOKUP(B16,[1]ItemConfig!$A:$C,3,FALSE)","v":"天材地宝3"},20]
[13,1304,{"$f":"VLOOKUP(B17,[1]ItemConfig!$A:$C,3,FALSE)","v":"天材地宝4"},25]
[14,1401,{"$f":"VLOOKUP(B18,[1]ItemConfig!$A:$C,3,FALSE)","v":"修为丹·下"},10]
[15,1402,{"$f":"VLOOKUP(B19,[1]ItemConfig!$A:$C,3,FALSE)","v":"修为丹·中"},15]
[16,1403,{"$f":"VLOOKUP(B20,[1]ItemConfig!$A:$C,3,FALSE)","v":"修为丹·上"},20]
[17,1404,{"$f":"VLOOKUP(B21,[1]ItemConfig!$A:$C,3,FALSE)","v":"修为丹·极"},30]
[18,1501,{"$f":"VLOOKUP(B22,[1]ItemConfig!$A:$C,3,FALSE)","v":"好感度礼物1"},50]
[19,1502,{"$f":"VLOOKUP(B23,[1]ItemConfig!$A:$C,3,FALSE)","v":"好感度礼物2"},100]
[20,11001,{"$f":"VLOOKUP(B24,[1]ItemConfig!$A:$C,3,FALSE)","v":"神龙鼎碎片"},20]
[21,11002,{"$f":"VLOOKUP(B25,[1]ItemConfig!$A:$C,3,FALSE)","v":"破天斧碎片"},20]
[22,11003,{"$f":"VLOOKUP(B26,[1]ItemConfig!$A:$C,3,FALSE)","v":"翡翠葫芦碎片"},20]
[23,11004,{"$f":"VLOOKUP(B27,[1]ItemConfig!$A:$C,3,FALSE)","v":"混沌珠碎片"},20]
[24,11005,{"$f":"VLOOKUP(B28,[1]ItemConfig!$A:$C,3,FALSE)","v":"琉璃宝塔碎片"},20]
[25,11006,{"$f":"VLOOKUP(B29,[1]ItemConfig!$A:$C,3,FALSE)","v":"九幽镇魂瓶碎片"},20]
[26,11007,{"$f":"VLOOKUP(B30,[1]ItemConfig!$A:$C,3,FALSE)","v":"玉莲守心灯碎片"},20]
[27,11008,{"$f":"VLOOKUP(B31,[1]ItemConfig!$A:$C,3,FALSE)","v":"融灵塔碎片"},20]
[28,11009,{"$f":"VLOOKUP(B32,[1]ItemConfig!$A:$C,3,FALSE)","v":"禁元珠碎片"},20]
[29,11010,{"$f":"VLOOKUP(B33,[1]ItemConfig!$A:$C,3,FALSE)","v":"玄龟盾碎片"},20]
[30,11011,{"$f":"VLOOKUP(B34,[1]ItemConfig!$A:$C,3,FALSE)","v":"天殇血刃剑碎片"},20]
[31,13001,{"$f":"VLOOKUP(B35,[1]ItemConfig!$A:$C,3,FALSE)","v":"太虚幻剑经碎片"},20]
[32,13002,{"$f":"VLOOKUP(B36,[1]ItemConfig!$A:$C,3,FALSE)","v":"天罡剑气诀碎片"},20]
[33,13003,{"$f":"VLOOKUP(B37,[1]ItemConfig!$A:$C,3,FALSE)","v":"血刃金煌功碎片"},20]
[34,13004,{"$f":"VLOOKUP(B38,[1]ItemConfig!$A:$C,3,FALSE)","v":"飞刃碎片"},20]
[35,13005,{"$f":"VLOOKUP(B39,[1]ItemConfig!$A:$C,3,FALSE)","v":"金针碎片"},20]
[36,13006,{"$f":"VLOOKUP(B40,[1]ItemConfig!$A:$C,3,FALSE)","v":"碧落幽冥劲碎片"},20]
[37,13007,{"$f":"VLOOKUP(B41,[1]ItemConfig!$A:$C,3,FALSE)","v":"雾隐千流法碎片"},20]
[38,13008,{"$f":"VLOOKUP(B42,[1]ItemConfig!$A:$C,3,FALSE)","v":"功法-水3碎片"},20]
[39,13009,{"$f":"VLOOKUP(B43,[1]ItemConfig!$A:$C,3,FALSE)","v":"水球碎片"},20]
[40,13010,{"$f":"VLOOKUP(B44,[1]ItemConfig!$A:$C,3,FALSE)","v":"冰刀碎片"},20]
[41,13011,{"$f":"VLOOKUP(B45,[1]ItemConfig!$A:$C,3,FALSE)","v":"瘴影千丝术碎片"},20]
[42,13012,{"$f":"VLOOKUP(B46,[1]ItemConfig!$A:$C,3,FALSE)","v":"蚀骨腐血掌碎片"},20]
[43,13013,{"$f":"VLOOKUP(B47,[1]ItemConfig!$A:$C,3,FALSE)","v":"功法-木3碎片"},20]
[44,13014,{"$f":"VLOOKUP(B48,[1]ItemConfig!$A:$C,3,FALSE)","v":"竹刺碎片"},20]
[45,13015,{"$f":"VLOOKUP(B49,[1]ItemConfig!$A:$C,3,FALSE)","v":"飞叶碎片"},20]
[46,13016,{"$f":"VLOOKUP(B50,[1]ItemConfig!$A:$C,3,FALSE)","v":"烈焰剑碎片"},20]
[47,13017,{"$f":"VLOOKUP(B51,[1]ItemConfig!$A:$C,3,FALSE)","v":"赤焰龙吟功碎片"},20]
[48,13018,{"$f":"VLOOKUP(B52,[1]ItemConfig!$A:$C,3,FALSE)","v":"朱雀燎原指碎片"},20]
[49,13019,{"$f":"VLOOKUP(B53,[1]ItemConfig!$A:$C,3,FALSE)","v":"火球碎片"},20]
[50,13020,{"$f":"VLOOKUP(B54,[1]ItemConfig!$A:$C,3,FALSE)","v":"火刀碎片"},20]
[51,13021,{"$f":"VLOOKUP(B55,[1]ItemConfig!$A:$C,3,FALSE)","v":"黄尘灭魂刺碎片"},20]
[52,13022,{"$f":"VLOOKUP(B56,[1]ItemConfig!$A:$C,3,FALSE)","v":"地裂屠龙斩碎片"},20]
[53,13023,{"$f":"VLOOKUP(B57,[1]ItemConfig!$A:$C,3,FALSE)","v":"功法-土3碎片"},20]
[54,13024,{"$f":"VLOOKUP(B58,[1]ItemConfig!$A:$C,3,FALSE)","v":"落石碎片"},20]
[55,13025,{"$f":"VLOOKUP(B59,[1]ItemConfig!$A:$C,3,FALSE)","v":"小石头碎片"},20]
[56,13501,{"$f":"VLOOKUP(B60,[1]ItemConfig!$A:$C,3,FALSE)","v":"天衍星辰诀碎片"},20]
[57,13502,{"$f":"VLOOKUP(B61,[1]ItemConfig!$A:$C,3,FALSE)","v":"法宝秘籍碎片"},20]
[58,13503,{"$f":"VLOOKUP(B62,[1]ItemConfig!$A:$C,3,FALSE)","v":"崩脉决碎片"},20]
[59,13504,{"$f":"VLOOKUP(B63,[1]ItemConfig!$A:$C,3,FALSE)","v":"两仪决碎片"},20]
[60,13505,{"$f":"VLOOKUP(B64,[1]ItemConfig!$A:$C,3,FALSE)","v":"火焰决碎片"},20]
[61,13506,{"$f":"VLOOKUP(B65,[1]ItemConfig!$A:$C,3,FALSE)","v":"乾坤巨灵诀碎片"},20]
[62,13507,{"$f":"VLOOKUP(B66,[1]ItemConfig!$A:$C,3,FALSE)","v":"极速齿轮碎片"},20]
[63,13508,{"$f":"VLOOKUP(B67,[1]ItemConfig!$A:$C,3,FALSE)","v":"太虚剑意碎片"},20]

{"sheet":"DaoyouguajiResourcLevel","index":7,"n_rows":35,"n_cols":13,"rows_kept":35,"cut":false,"hidden":false,"merged":[]}
["ID","para1","para2","para3","para4","para5","para6","para7","para8","para9","para10","para11","para12"]
["int","int","int","int","int","int","int","int","int","int","int","int","int"]
[]
["ID","玩家修为产出","铜钱产出","银锭产出","玩家修为产出","玩家修为产出","玩家修为产出","玩家修为产出","玩家修为产出","玩家修为产出","玩家修为产出","玩家修为产出","玩家修为产出"]
[1]
[2]
[3]
[4]
[5]
[6]
[7]
[8]
[9]
[10,100]
[11]
[12]
[13]
[14]
[15]
[16]
[17]
[18]
[19]
[20]
[21]
[22]
[23]
[24]
[25]
[26]
[27]
[28]
[29]
[30]
[31]