{"text_format":"2","workbook":"xlsx","n_sheets":6,"sheets":["DropConfig","DropGroupConfig","DropItemConfig","DropCountConfig","说明页","道具表"],"not_rendered":{"charts":0,"images":0,"macros":0,"external_links":3,"defined_names":4,"comments":0,"pivot_tables":0},"unopened":[],"bounds":{"document_bytes":16777216,"sheet_cells":100000,"run_cost":"one","rows_first":2000,"rows_last":500,"rows_between":2000,"halvings":0,"cell_chars":16384,"cell_head_chars":4096},"cells_cut":0,"cells_raw":0,"read":"whole","date_system":"1900"}

{"sheet":"DropConfig","index":0,"n_rows":172,"n_cols":18,"rows_kept":172,"cut":false,"hidden":false,"merged":[]}
["ID","dropGroupID",null,"dropType","showItemId"]
["int","int[]",null,"int","int[]"]
[{"$nulls":4},"c"]
["掉落ID","掉落组ID","掉落组说明","掉落方式\n1.每个掉落组根据掉落概率掉落\n2.所有掉落组根据掉落权重掉落\n3.直接掉落道具","显示ID\n通过工厂表决定显示",null,"完整值"]
[1001,{"$f":"IF(A5=\"\",\"\",A5)","v":1001},{"$f":"IF(A5=\"\",\"\",IF(D5=3,CONCATENATE(\"直接掉落道具：\",VLOOKUP(A5,[1]ItemConfig!$A:$C,3,FALSE)),\"\"))","v":"直接掉落道具：灵石"},3,{"$f":"A5","v":1001},{"$f":"IF(A5=\"\",\"\",IF(D5=3,VLOOKUP(A5,[1]ItemConfig!$A:$C,3,FALSE),\"\"))","v":"灵石"}]
[1002,{"$f":"IF(A6=\"\",\"\",A6)","v":1002},{"$f":"IF(A6=\"\",\"\",IF(D6=3,CONCATENATE(\"直接掉落道具：\",VLOOKUP(A6,[1]ItemConfig!$A:$C,3,FALSE)),\"\"))","v":"直接掉落道具：妖丹"},3,{"$f":"A6","v":1002},{"$f":"IF(A6=\"\",\"\",IF(D6=3,VLOOKUP(A6,[1]ItemConfig!$A:$C,3,FALSE),\"\"))","v":"妖丹"}]
[1003,1003,{"$f":"IF(A7=\"\",\"\",IF(D7=3,CONCATENATE(\"直接掉落道具：\",VLOOKUP(A7,[1]ItemConfig!$A:$C,3,FALSE)),\"\"))","v":"直接掉落道具：修为"},3,1003,{"$f":"IF(A7=\"\",\"\",IF(D7=3,VLOOKUP(A7,[1]ItemConfig!$A:$C,3,FALSE),\"\"))","v":"修为"}]
[1004,1004,{"$f":"IF(A8=\"\",\"\",IF(D8=3,CONCATENATE(\"直接掉落道具：\",VLOOKUP(A8,[1]ItemConfig!$A:$C,3,FALSE)),\"\"))","v":"直接掉落道具：妖王丹"},3,1004,{"$f":"IF(A8=\"\",\"\",IF(D8=3,VLOOKUP(A8,[1]ItemConfig!$A:$C,3,FALSE),\"\"))","v":"妖王丹"}]
[1005,1005,{"$f":"IF(A9=\"\",\"\",IF(D9=3,CONCATENATE(\"直接掉落道具：\",VLOOKUP(A9,[1]ItemConfig!$A:$C,3,FALSE)),\"\"))","v":"直接掉落道具：灵气"},3,1005,{"$f":"IF(A9=\"\",\"\",IF(D9=3,VLOOKUP(A9,[1]ItemConfig!$A:$C,3,FALSE),\"\"))","v":"灵气"}]
[1006,1006,{"$f":"IF(A10=\"\",\"\",IF(D10=3,CONCATENATE(\"直接掉落道具：\",VLOOKUP(A10,[1]ItemConfig!$A:$C,3,FALSE)),\"\"))","v":"直接掉落道具：玄晶"},3,1006,{"$f":"IF(A10=\"\",\"\",IF(D10=3,VLOOKUP(A10,[1]ItemConfig!$A:$C,3,FALSE),\"\"))","v":"玄晶"}]
[null,"",{"$f":"IF(A11=\"\",\"\",IF(D11=3,CONCATENATE(\"直接掉落道具：\",VLOOKUP(A11,[1]ItemConfig!$A:$C,3,FALSE)),\"\"))","v":""},3,0,{"$f":"IF(A11=\"\",\"\",IF(D11=3,VLOOKUP(A11,[1]ItemConfig!$A:$C,3,FALSE),\"\"))","v":""}]
[1201,1201,{"$f":"IF(A12=\"\",\"\",IF(D12=3,CONCATENATE(\"直接掉落道具：\",VLOOKUP(A12,[1]ItemConfig!$A:$C,3,FALSE)),\"\"))","v":"直接掉落道具：渡劫丹-A1"},3,1201,{"$f":"IF(A12=\"\",\"\",IF(D12=3,VLOOKUP(A12,[1]ItemConfig!$A:$C,3,FALSE),\"\"))","v":"渡劫丹-A1"}]
[1202,1202,{"$f":"IF(A13=\"\",\"\",IF(D13=3,CONCATENATE(\"直接掉落道具：\",VLOOKUP(A13,[1]ItemConfig!$A:$C,3,FALSE)),\"\"))","v":"直接掉落道具：渡劫丹-A2"},3,1202,{"$f":"IF(A13=\"\",\"\",IF(D13=3,VLOOKUP(A13,[1]ItemConfig!$A:$C,3,FALSE),\"\"))","v":"渡劫丹-A2"}]
[1203,1203,{"$f":"IF(A14=\"\",\"\",IF(D14=3,CONCATENATE(\"直接掉落道具：\",VLOOKUP(A14,[1]ItemConfig!$A:$C,3,FALSE)),\"\"))","v":"直接掉落道具：渡劫丹-A3"},3,1203,{"$f":"IF(A14=\"\",\"\",IF(D14=3,VLOOKUP(A14,[1]ItemConfig!$A:$C,3,FALSE),\"\"))","v":"渡劫丹-A3"}]
[1204,1204,{"$f":"IF(A15=\"\",\"\",IF(D15=3,CONCATENATE(\"直接掉落道具：\",VLOOKUP(A15,[1]ItemConfig!$A:$C,3,FALSE)),\"\"))","v":"直接掉落道具：渡劫丹-B1"},3,1204,{"$f":"IF(A15=\"\",\"\",IF(D15=3,VLOOKUP(A15,[1]ItemConfig!$A:$C,3,FALSE),\"\"))","v":"渡劫丹-B1"}]
[1205,1205,{"$f":"IF(A16=\"\",\"\",IF(D16=3,CONCATENATE(\"直接掉落道具：\",VLOOKUP(A16,[1]ItemConfig!$A:$C,3,FALSE)),\"\"))","v":"直接掉落道具：渡劫丹-B2"},3,1205,{"$f":"IF(A16=\"\",\"\",IF(D16=3,VLOOKUP(A16,[1]ItemConfig!$A:$C,3,FALSE),\"\"))","v":"渡劫丹-B2"}]
[1206,1206,{"$f":"IF(A17=\"\",\"\",IF(D17=3,CONCATENATE(\"直接掉落道具：\",VLOOKUP(A17,[1]ItemConfig!$A:$C,3,FALSE)),\"\"))","v":"直接掉落道具：渡劫丹-B3"},3,1206,{"$f":"IF(A17=\"\",\"\",IF(D17=3,VLOOKUP(A17,[1]ItemConfig!$A:$C,3,FALSE),\"\"))","v":"渡劫丹-B3"}]
[1207,1207,{"$f":"IF(A18=\"\",\"\",IF(D18=3,CONCATENATE(\"直接掉落道具：\",VLOOKUP(A18,[1]ItemConfig!$A:$C,3,FALSE)),\"\"))","v":"直接掉落道具：渡劫丹-C1"},3,1207,{"$f":"IF(A18=\"\",\"\",IF(D18=3,VLOOKUP(A18,[1]ItemConfig!$A:$C,3,FALSE),\"\"))","v":"渡劫丹-C1"}]
[1208,1208,{"$f":"IF(A19=\"\",\"\",IF(D19=3,CONCATENATE(\"直接掉落道具：\",VLOOKUP(A19,[1]ItemConfig!$A:$C,3,FALSE)),\"\"))","v":"直接掉落道具：渡劫丹-C2"},3,1208,{"$f":"IF(A19=\"\",\"\",IF(D19=3,VLOOKUP(A19,[1]ItemConfig!$A:$C,3,FALSE),\"\"))","v":"渡劫丹-C2"}]
[1209,1209,{"$f":"IF(A20=\"\",\"\",IF(D20=3,CONCATENATE(\"直接掉落道具：\",VLOOKUP(A20,[1]ItemConfig!$A:$C,3,FALSE)),\"\"))","v":"直接掉落道具：渡劫丹-C3"},3,1209,{"$f":"IF(A20=\"\",\"\",IF(D20=3,VLOOKUP(A20,[1]ItemConfig!$A:$C,3,FALSE),\"\"))","v":"渡劫丹-C3"}]
{"$rows_left_out":153}
{"sheet":"DropGroupConfig","index":1,"n_rows":60,"n_cols":7,"rows_kept":60,"cut":false,"hidden":false,"merged":[]}
["ID","dropRate","dropItemID"]
["int","int","int[]"]
[]
["掉落组ID","掉落概率\\权重\n1000为100%",null,"备注1","备注2","备注3\n（完整版数据）"]
[1,650,1,"法宝-蓝色"]
[2,250,2,"法宝-紫色"]
[3,100,3,"法宝-橙色"]
[4,400,4,"功法-蓝色"]
[5,300,5,"功法-紫色"]
[6,300,6,"功法-橙色"]
[]
[7,1000,7,"乾坤袋-每分钟随机掉落3种资源",null,"100抽","十连"]
[{"$nulls":4},{"$f":"SUM(E14:E19)","v":9.120000000000001},{"$f":"E25+E20*9+E13*90","v":2403.4499999999998},{"$f":"F13/10","v":240.34499999999997}]
[8,{"$f":"1000-SUM(B15:B19)","v":946},8,6,{"$f":"D14*B14/SUM(B$14:B$19)","v":5.6760000000000002}]
[9,{"$f":"B16*3","v":36},9,30,{"$f":"D15*B15/SUM(B$14:B$19)","v":1.08}]
[10,{"$f":"B17*2","v":12},10,98,1.1759999999999999]
[11,6,11,198,1.1879999999999999]
[12,{"$f":"B19*2","v":0},12,328,0]
[13,0,13,648,0]
[{"$nulls":4},{"$f":"SUM(E21:E24)","v":135.85}]
{"$rows_left_out":41}
{"sheet":"DropItemConfig","index":2,"n_rows":31,"n_cols":40,"rows_kept":31,"cut":false,"hidden":false,"merged":[]}
["ID","dropItemType","itemID",null,"dropMinV","dropMaxV","dropCountGoupID"]
["int","int","int[]",null,"int","int","int"]
[]
["ID号","道具类型\n1=道具\n2=装备稀有度\n3=装备等级\n4=完整装备(品质和等级随机)\n5=完整装备，品质固定(等级随机)","道具ID",null,"掉落最小数量","掉落最大数量","掉落数量使用哪种分布方式\n对应DropCountConfig的GroupID\n默认-1，平均分布","实际掉落情况","标准数量",null,"组成1","组成2","组成3","组成4","组成5","组成6","组成7","组成8","组成9","组成10","组成11","组成12","组成13","组成14","组成15","组成16","组成17","组成18","组成19","组成20","组成21","组成22","组成23","组成24","组成25","组成26","组成27","组成28","组成29","组成30"]
[1,1,{"$f":"_xlfn.TEXTJOIN(\";\",1,K5:AN5)","v":"10001;10003;10006;10008;10010"},null,1,1,-1,{"$f":"CONCATENATE(\"【\",VLOOKUP(K5,[1]ItemConfig!$A:$H,8,FALSE),\"】\",VLOOKUP(K5,[1]ItemConfig!$A:$C,3,FALSE),\" × \",E5,\" - \",F5,IF(COUNT(K5:AD5)=1,\"\",\" (等共\"&COUNT(K5:AD5)&\"种道具)\"))","v":"【法宝-本体】神龙鼎 × 1 - 1 (等共5种道具)"},null,null,10001,10003,10006,10008,10010]
[2,1,{"$f":"_xlfn.TEXTJOIN(\";\",1,K6:AN6)","v":"10002;10004;10007;10009;10011"},null,1,1,-1,{"$f":"CONCATENATE(\"【\",VLOOKUP(K6,[1]ItemConfig!$A:$H,8,FALSE),\"】\",VLOOKUP(K6,[1]ItemConfig!$A:$C,3,FALSE),\" × \",E6,\" - \",F6,IF(COUNT(K6:AD6)=1,\"\",\" (等共\"&COUNT(K6:AD6)&\"种道具)\"))","v":"【法宝-本体】破天斧 × 1 - 1 (等共5种道具)"},null,null,10002,10004,10007,10009,10011]
[3,1,"10005",null,1,1,-1,{"$f":"CONCATENATE(\"【\",VLOOKUP(K7,[1]ItemConfig!$A:$H,8,FALSE),\"】\",VLOOKUP(K7,[1]ItemConfig!$A:$C,3,FALSE),\" × \",E7,\" - \",F7,IF(COUNT(K7:AD7)=1,\"\",\" (等共\"&COUNT(K7:AD7)&\"种道具)\"))","v":"【法宝-本体】琉璃宝塔 × 1 - 1"},null,null,10005]
[4,1,"12005;12010;12015;12020;12025",null,1,1,-1,{"$f":"CONCATENATE(\"【\",VLOOKUP(K8,[1]ItemConfig!$A:$H,8,FALSE),\"】\",VLOOKUP(K8,[1]ItemConfig!$A:$C,3,FALSE),\" × \",E8,\" - \",F8,IF(COUNT(K8:AD8)=1,\"\",\" (等共\"&COUNT(K8:AD8)&\"种道具)\"))","v":"【功法-本体】金针 × 1 - 1 (等共5种道具)"},null,null,12005,12010,12015,12020,12025]
[5,1,"12004;12009;12014;12019;12024",null,1,1,-1,{"$f":"CONCATENATE(\"【\",VLOOKUP(K9,[1]ItemConfig!$A:$H,8,FALSE),\"】\",VLOOKUP(K9,[1]ItemConfig!$A:$C,3,FALSE),\" × \",E9,\" - \",F9,IF(COUNT(K9:AD9)=1,\"\",\" (等共\"&COUNT(K9:AD9)&\"种道具)\"))","v":"【功法-本体】飞刃 × 1 - 1 (等共5种道具)"},null,null,12004,12009,12014,12019,12024]
[6,1,"12001;12002;12003;12006;12007;12008;12011;12012;12013;12016;12017;12018;12021;12022;12023",null,1,1,-1,{"$f":"CONCATENATE(\"【\",VLOOKUP(K10,[1]ItemConfig!$A:$H,8,FALSE),\"】\",VLOOKUP(K10,[1]ItemConfig!$A:$C,3,FALSE),\" × \",E10,\" - \",F10,IF(COUNT(K10:AD10)=1,\"\",\" (等共\"&COUNT(K10:AD10)&\"种道具)\"))","v":"【功法-本体】太虚幻剑经 × 1 - 1 (等共15种道具)"},null,null,12001,12002,12003,12006,12007,12008,12011,12012,12013,12016,12017,12018,12021,12022,12023]
[]
[7,1,"1001;1005;1006",null,-200,-200,-1,{"$f":"CONCATENATE(\"【\",VLOOKUP(K12,[1]ItemConfig!$A:$H,8,FALSE),\"】\",VLOOKUP(K12,[1]ItemConfig!$A:$C,3,FALSE),\" × \",E12,\" - \",F12,IF(COUNT(K12:AD12)=1,\"\",\" (等共\"&COUNT(K12:AD12)&\"种道具)\"))","v":"【资源-货币】灵石 × -200 - -200 (等共3种道具)"},{"$f":"300/(24*60)*1000","v":208.33333333333334},null,1001,1005,1006]
[]
[8,1,"1101",null,1,{"$f":"E14","v":1},-1,{"$f":"CONCATENATE(\"【\",VLOOKUP(K14,[1]ItemConfig!$A:$H,8,FALSE),\"】\",VLOOKUP(K14,[1]ItemConfig!$A:$C,3,FALSE),\" × \",E14,\" - \",F14,IF(COUNT(K14:AD14)=1,\"\",\" (等共\"&COUNT(K14:AD14)&\"种道具)\"))","v":"【资源-自动转代币】自转道具-妖丹×6 × 1 - 1"},null,null,1101]
[9,1,"1102",null,1,{"$f":"E15","v":1},-1,{"$f":"CONCATENATE(\"【\",VLOOKUP(K15,[1]ItemConfig!$A:$H,8,FALSE),\"】\",VLOOKUP(K15,[1]ItemConfig!$A:$C,3,FALSE),\" × \",E15,\" - \",F15,IF(COUNT(K15:AD15)=1,\"\",\" (等共\"&COUNT(K15:AD15)&\"种道具)\"))","v":"【资源-自动转代币】自转道具-妖丹×30 × 1 - 1"},null,null,1102]
[10,1,"1103",null,1,1,-1,{"$f":"CONCATENATE(\"【\",VLOOKUP(K16,[1]ItemConfig!$A:$H,8,FALSE),\"】\",VLOOKUP(K16,[1]ItemConfig!$A:$C,3,FALSE),\" × \",E16,\" - \",F16,IF(COUNT(K16:AD16)=1,\"\",\" (等共\"&COUNT(K16:AD16)&\"种道具)\"))","v":"【资源-自动转代币】自转道具-妖丹×98 × 1 - 1"},null,null,1103]
[11,1,"1104",null,1,1,-1,{"$f":"CONCATENATE(\"【\",VLOOKUP(K17,[1]ItemConfig!$A:$H,8,FALSE),\"】\",VLOOKUP(K17,[1]ItemConfig!$A:$C,3,FALSE),\" × \",E17,\" - \",F17,IF(COUNT(K17:AD17)=1,\"\",\" (等共\"&COUNT(K17:AD17)&\"种道具)\"))","v":"【资源-自动转代币】自转道具-妖丹×198 × 1 - 1"},null,null,1104]
[12,1,"1105",null,1,1,-1,{"$f":"CONCATENATE(\"【\",VLOOKUP(K18,[1]ItemConfig!$A:$H,8,FALSE),\"】\",VLOOKUP(K18,[1]ItemConfig!$A:$C,3,FALSE),\" × \",E18,\" - \",F18,IF(COUNT(K18:AD18)=1,\"\",\" (等共\"&COUNT(K18:AD18)&\"种道具)\"))","v":"【资源-自动转代币】自转道具-妖丹×328 × 1 - 1"},null,null,1105]
[13,1,"1106",null,1,1,-1,{"$f":"CONCATENATE(\"【\",VLOOKUP(K19,[1]ItemConfig!$A:$H,8,FALSE),\"】\",VLOOKUP(K19,[1]ItemConfig!$A:$C,3,FALSE),\" × \",E19,\" - \",F19,IF(COUNT(K19:AD19)=1,\"\",\" (等共\"&COUNT(K19:AD19)&\"种道具)\"))","v":"【资源-自动转代币】自转道具-妖丹×648 × 1 - 1"},null,null,1106]
[]
{"$rows_left_out":12}
{"sheet":"DropCountConfig","index":3,"n_rows":36,"n_cols":6,"rows_kept":36,"cut":false,"hidden":false,"merged":[]}
["ID","groupID","proportion","weight"]
["int","int","int","int"]
[]
[null,null,"最高比例","权重","掉率","实际值"]
[1,1,10,2,{"$f":"IF(D5=\"\",\"\",D5/SUMIF(B:B,B5,D:D))","v":2.1505376344085999E-2},{"$f":"SUMPRODUCT(C5:C14,E5:E14)","v":50.537634408602202}]
[2,1,20,4,4.3010752688171998E-2]
[3,1,30,8,8.6021505376344107E-2]
[4,1,40,16,0.17204301075268799]
[5,1,50,32,0.34408602150537598]
[6,1,60,16,{"$f":"IF(D10=\"\",\"\",D10/SUMIF(B:B,B10,D:D))","v":0.17204301075268799}]
[7,1,70,8,8.6021505376344107E-2]
[8,1,80,4,4.3010752688171998E-2]
[9,1,90,2,2.1505376344085999E-2]
[10,1,100,1,1.0752688172042999E-2]
[]
[11,2,10,1,1.0416666666666701E-2,{"$f":"SUMPRODUCT(C16:C25,E16:E25)","v":74.7916666666667}]
[12,2,20,2,2.0833333333333301E-2]
[13,2,30,3,3.125E-2]
[14,2,40,5,5.2083333333333301E-2]
[15,2,50,7,7.2916666666666699E-2]
{"$rows_left_out":17}
{"sheet":"说明页","index":4,"n_rows":26,"n_cols":3,"rows_kept":26,"cut":false,"hidden":false,"merged":[]}
["表名称","DropItemConfig"]
["字段","dropItemType"]
["说明","道具类型\n1=道具\n2=装备稀有度\n3=装备等级"]
[]
[]
[]
[null,"字段关联表缩写字母","关联表"]
[null,"l","LanguageChinese"]
[null,"w","Item"]
[null,"c","chouka"]
{"$rows_empty":11}
[null,"DropItemConfigID：暂定为5位数字，按照合成类型决定首位。 如果有需求，再用第二位进一步区分。"]
[]
[null,"抽卡合成类型对应表（暂定）"]
[]
[null,"道具类型 1=道具 2=声望任务 3=装备星级 4=装备品质 5=假五星 6=装备工厂 7=装备效果 8=装备私物效果"]

{"sheet":"道具表","index":5,"n_rows":872,"n_cols":6,"rows_kept":872,"cut":false,"hidden":false,"merged":[]}
["道具ID","道具名称\n语言表ID","道具描述\n语言表ID","道具名称（Item表）","道具名称（语言表）","道具描述（语言表）"]
[{"$f":"IF([1]ItemConfig!$A5=\"\",\"\",[1]ItemConfig!$A5)","v":1001},{"$f":"IF(A2=\"\",\"\",VLOOKUP(A2,[1]ItemConfig!$A:$B,2,FALSE))","v":169},{"$f":"IF(A2=\"\",\"\",VLOOKUP(A2,[1]ItemConfig!$A:$D,4,FALSE))","v":162},{"$f":"IF(A2=\"\",\"\",VLOOKUP(A2,[1]ItemConfig!$A:$C,3,FALSE))","v":"灵石"},{"$f":"IF(A2=\"\",\"\",VLOOKUP(B2,[2]語言配置表!$A:$B,2,FALSE))","v":"金幣"},{"$f":"IF(A2=\"\",\"\",VLOOKUP(C2,[2]語言配置表!$A:$B,2,FALSE))","v":"金幣，可用於開寶箱"}]
[{"$f":"IF([1]ItemConfig!$A6=\"\",\"\",[1]ItemConfig!$A6)","v":1002},{"$f":"IF(A3=\"\",\"\",VLOOKUP(A3,[1]ItemConfig!$A:$B,2,FALSE))","v":170},{"$f":"IF(A3=\"\",\"\",VLOOKUP(A3,[1]ItemConfig!$A:$D,4,FALSE))","v":163},{"$f":"IF(A3=\"\",\"\",VLOOKUP(A3,[1]ItemConfig!$A:$C,3,FALSE))","v":"妖丹"},{"$f":"IF(A3=\"\",\"\",VLOOKUP(B3,[2]語言配置表!$A:$B,2,FALSE))","v":"鑽石"},{"$f":"IF(A3=\"\",\"\",VLOOKUP(C3,[2]語言配置表!$A:$B,2,FALSE))","v":"鑽石，後續開放（敬請期待）"}]
[{"$f":"IF([1]ItemConfig!$A7=\"\",\"\",[1]ItemConfig!$A7)","v":1003},{"$f":"IF(A4=\"\",\"\",VLOOKUP(A4,[1]ItemConfig!$A:$B,2,FALSE))","v":171},{"$f":"IF(A4=\"\",\"\",VLOOKUP(A4,[1]ItemConfig!$A:$D,4,FALSE))","v":164},{"$f":"IF(A4=\"\",\"\",VLOOKUP(A4,[1]ItemConfig!$A:$C,3,FALSE))","v":"修为"},{"$f":"IF(A4=\"\",\"\",VLOOKUP(B4,[2]語言配置表!$A:$B,2,FALSE))","v":"英雄經驗"},{"$f":"IF(A4=\"\",\"\",VLOOKUP(C4,[2]語言配置表!$A:$B,2,FALSE))","v":"經驗，用於英雄升級"}]
[{"$f":"IF([1]ItemConfig!$A8=\"\",\"\",[1]ItemConfig!$A8)","v":1004},{"$f":"IF(A5=\"\",\"\",VLOOKUP(A5,[1]ItemConfig!$A:$B,2,FALSE))","v":248},{"$f":"IF(A5=\"\",\"\",VLOOKUP(A5,[1]ItemConfig!$A:$D,4,FALSE))","v":249},{"$f":"IF(A5=\"\",\"\",VLOOKUP(A5,[1]ItemConfig!$A:$C,3,FALSE))","v":"妖王丹"},{"$f":"IF(A5=\"\",\"\",VLOOKUP(B5,[2]語言配置表!$A:$B,2,FALSE))","v":"金锭"},{"$f":"IF(A5=\"\",\"\",VLOOKUP(C5,[2]語言配置表!$A:$B,2,FALSE))","v":"最稀有的货币"}]
[{"$f":"IF([1]ItemConfig!$A9=\"\",\"\",[1]ItemConfig!$A9)","v":1005},{"$f":"IF(A6=\"\",\"\",VLOOKUP(A6,[1]ItemConfig!$A:$B,2,FALSE))","v":725},{"$f":"IF(A6=\"\",\"\",VLOOKUP(A6,[1]ItemConfig!$A:$D,4,FALSE))","v":726},{"$f":"IF(A6=\"\",\"\",VLOOKUP(A6,[1]ItemConfig!$A:$C,3,FALSE))","v":"灵气"},{"$f":"IF(A6=\"\",\"\",VLOOKUP(B6,[2]語言配置表!$A:$B,2,FALSE))","v":"功法灵气"},{"$f":"IF(A6=\"\",\"\",VLOOKUP(C6,[2]語言配置表!$A:$B,2,FALSE))","v":"[临]灵气的描述"}]
[{"$f":"IF([1]ItemConfig!$A10=\"\",\"\",[1]ItemConfig!$A10)","v":1006},{"$f":"IF(A7=\"\",\"\",VLOOKUP(A7,[1]ItemConfig!$A:$B,2,FALSE))","v":1400},{"$f":"IF(A7=\"\",\"\",VLOOKUP(A7,[1]ItemConfig!$A:$D,4,FALSE))","v":1401},{"$f":"IF(A7=\"\",\"\",VLOOKUP(A7,[1]ItemConfig!$A:$C,3,FALSE))","v":"玄晶"},{"$f":"IF(A7=\"\",\"\",VLOOKUP(B7,[2]語言配置表!$A:$B,2,FALSE))","v":"法宝灵韵"},{"$f":"IF(A7=\"\",\"\",VLOOKUP(C7,[2]語言配置表!$A:$B,2,FALSE))","v":"用于提升法宝的等级"}]
[{"$f":"IF([1]ItemConfig!$A11=\"\",\"\",[1]ItemConfig!$A11)","v":1007},{"$f":"IF(A8=\"\",\"\",VLOOKUP(A8,[1]ItemConfig!$A:$B,2,FALSE))","v":-1},{"$f":"IF(A8=\"\",\"\",VLOOKUP(A8,[1]ItemConfig!$A:$D,4,FALSE))","v":-1},{"$f":"IF(A8=\"\",\"\",VLOOKUP(A8,[1]ItemConfig!$A:$C,3,FALSE))","v":"广告币"},{"$f":"IF(A8=\"\",\"\",VLOOKUP(B8,[2]語言配置表!$A:$B,2,FALSE))","v":{"$error":"#N/A"}},{"$f":"IF(A8=\"\",\"\",VLOOKUP(C8,[2]語言配置表!$A:$B,2,FALSE))","v":{"$error":"#N/A"}}]
[{"$f":"IF([1]ItemConfig!$A12=\"\",\"\",[1]ItemConfig!$A12)","v":""},{"$f":"IF(A9=\"\",\"\",VLOOKUP(A9,[1]ItemConfig!$A:$B,2,FALSE))","v":""},{"$f":"IF(A9=\"\",\"\",VLOOKUP(A9,[1]ItemConfig!$A:$D,4,FALSE))","v":""},{"$f":"IF(A9=\"\",\"\",VLOOKUP(A9,[1]ItemConfig!$A:$C,3,FALSE))","v":""},{"$f":"IF(A9=\"\",\"\",VLOOKUP(B9,[2]語言配置表!$A:$B,2,FALSE))","v":""},{"$f":"IF(A9=\"\",\"\",VLOOKUP(C9,[2]語言配置表!$A:$B,2,FALSE))","v":""}]
[{"$f":"IF([1]ItemConfig!$A13=\"\",\"\",[1]ItemConfig!$A13)","v":1101},{"$f":"IF(A10=\"\",\"\",VLOOKUP(A10,[1]ItemConfig!$A:$B,2,FALSE))","v":-1},{"$f":"IF(A10=\"\",\"\",VLOOKUP(A10,[1]ItemConfig!$A:$D,4,FALSE))","v":-1},{"$f":"IF(A10=\"\",\"\",VLOOKUP(A10,[1]ItemConfig!$A:$C,3,FALSE))","v":"自转道具-妖丹×6"},{"$f":"IF(A10=\"\",\"\",VLOOKUP(B10,[2]語言配置表!$A:$B,2,FALSE))","v":{"$error":"#N/A"}},{"$f":"IF(A10=\"\",\"\",VLOOKUP(C10,[2]語言配置表!$A:$B,2,FALSE))","v":{"$error":"#N/A"}}]
[{"$f":"IF([1]ItemConfig!$A14=\"\",\"\",[1]ItemConfig!$A14)","v":1102},{"$f":"IF(A11=\"\",\"\",VLOOKUP(A11,[1]ItemConfig!$A:$B,2,FALSE))","v":-1},{"$f":"IF(A11=\"\",\"\",VLOOKUP(A11,[1]ItemConfig!$A:$D,4,FALSE))","v":-1},{"$f":"IF(A11=\"\",\"\",VLOOKUP(A11,[1]ItemConfig!$A:$C,3,FALSE))","v":"自转道具-妖丹×30"},{"$f":"IF(A11=\"\",\"\",VLOOKUP(B11,[2]語言配置表!$A:$B,2,FALSE))","v":{"$error":"#N/A"}},{"$f":"IF(A11=\"\",\"\",VLOOKUP(C11,[2]語言配置表!$A:$B,2,FALSE))","v":{"$error":"#N/A"}}]
[{"$f":"IF([1]ItemConfig!$A15=\"\",\"\",[1]ItemConfig!$A15)","v":1103},{"$f":"IF(A12=\"\",\"\",VLOOKUP(A12,[1]ItemConfig!$A:$B,2,FALSE))","v":-1},{"$f":"IF(A12=\"\",\"\",VLOOKUP(A12,[1]ItemConfig!$A:$D,4,FALSE))","v":-1},{"$f":"IF(A12=\"\",\"\",VLOOKUP(A12,[1]ItemConfig!$A:$C,3,FALSE))","v":"自转道具-妖丹×98"},{"$f":"IF(A12=\"\",\"\",VLOOKUP(B12,[2]語言配置表!$A:$B,2,FALSE))","v":{"$error":"#N/A"}},{"$f":"IF(A12=\"\",\"\",VLOOKUP(C12,[2]語言配置表!$A:$B,2,FALSE))","v":{"$error":"#N/A"}}]
[{"$f":"IF([1]ItemConfig!$A16=\"\",\"\",[1]ItemConfig!$A16)","v":1104},{"$f":"IF(A13=\"\",\"\",VLOOKUP(A13,[1]ItemConfig!$A:$B,2,FALSE))","v":-1},{"$f":"IF(A13=\"\",\"\",VLOOKUP(A13,[1]ItemConfig!$A:$D,4,FALSE))","v":-1},{"$f":"IF(A13=\"\",\"\",VLOOKUP(A13,[1]ItemConfig!$A:$C,3,FALSE))","v":"自转道具-妖丹×198"},{"$f":"IF(A13=\"\",\"\",VLOOKUP(B13,[2]語言配置表!$A:$B,2,FALSE))","v":{"$error":"#N/A"}},{"$f":"IF(A13=\"\",\"\",VLOOKUP(C13,[2]語言配置表!$A:$B,2,FALSE))","v":{"$error":"#N/A"}}]
[{"$f":"IF([1]ItemConfig!$A17=\"\",\"\",[1]ItemConfig!$A17)","v":1105},{"$f":"IF(A14=\"\",\"\",VLOOKUP(A14,[1]ItemConfig!$A:$B,2,FALSE))","v":-1},{"$f":"IF(A14=\"\",\"\",VLOOKUP(A14,[1]ItemConfig!$A:$D,4,FALSE))","v":-1},{"$f":"IF(A14=\"\",\"\",VLOOKUP(A14,[1]ItemConfig!$A:$C,3,FALSE))","v":"自转道具-妖丹×328"},{"$f":"IF(A14=\"\",\"\",VLOOKUP(B14,[2]語言配置表!$A:$B,2,FALSE))","v":{"$error":"#N/A"}},{"$f":"IF(A14=\"\",\"\",VLOOKUP(C14,[2]語言配置表!$A:$B,2,FALSE))","v":{"$error":"#N/A"}}]
[{"$f":"IF([1]ItemConfig!$A18=\"\",\"\",[1]ItemConfig!$A18)","v":1106},{"$f":"IF(A15=\"\",\"\",VLOOKUP(A15,[1]ItemConfig!$A:$B,2,FALSE))","v":-1},{"$f":"IF(A15=\"\",\"\",VLOOKUP(A15,[1]ItemConfig!$A:$D,4,FALSE))","v":-1},{"$f":"IF(A15=\"\",\"\",VLOOKUP(A15,[1]ItemConfig!$A:$C,3,FALSE))","v":"自转道具-妖丹×648"},{"$f":"IF(A15=\"\",\"\",VLOOKUP(B15,[2]語言配置表!$A:$B,2,FALSE))","v":{"$error":"#N/A"}},{"$f":"IF(A15=\"\",\"\",VLOOKUP(C15,[2]語言配置表!$A:$B,2,FALSE))","v":{"$error":"#N/A"}}]
[{"$f":"IF([1]ItemConfig!$A19=\"\",\"\",[1]ItemConfig!$A19)","v":""},{"$f":"IF(A16=\"\",\"\",VLOOKUP(A16,[1]ItemConfig!$A:$B,2,FALSE))","v":""},{"$f":"IF(A16=\"\",\"\",VLOOKUP(A16,[1]ItemConfig!$A:$D,4,FALSE))","v":""},{"$f":"IF(A16=\"\",\"\",VLOOKUP(A16,[1]ItemConfig!$A:$C,3,FALSE))","v":""},{"$f":"IF(A16=\"\",\"\",VLOOKUP(B16,[2]語言配置表!$A:$B,2,FALSE))","v":""},{"$f":"IF(A16=\"\",\"\",VLOOKUP(C16,[2]語言配置表!$A:$B,2,FALSE))","v":""}]
[{"$f":"IF([1]ItemConfig!$A20=\"\",\"\",[1]ItemConfig!$A20)","v":1201},{"$f":"IF(A17=\"\",\"\",VLOOKUP(A17,[1]ItemConfig!$A:$B,2,FALSE))","v":250},{"$f":"IF(A17=\"\",\"\",VLOOKUP(A17,[1]ItemConfig!$A:$D,4,FALSE))","v":259},{"$f":"IF(A17=\"\",\"\",VLOOKUP(A17,[1]ItemConfig!$A:$C,3,FALSE))","v":"渡劫丹-A1"},{"$f":"IF(A17=\"\",\"\",VLOOKUP(B17,[2]語言配置表!$A:$B,2,FALSE))","v":"渡劫丹-A1"},{"$f":"IF(A17=\"\",\"\",VLOOKUP(C17,[2]語言配置表!$A:$B,2,FALSE))","v":"渡劫丹-A1描述"}]
[{"$f":"IF([1]ItemConfig!$A21=\"\",\"\",[1]ItemConfig!$A21)","v":1202},{"$f":"IF(A18=\"\",\"\",VLOOKUP(A18,[1]ItemConfig!$A:$B,2,FALSE))","v":251},{"$f":"IF(A18=\"\",\"\",VLOOKUP(A18,[1]ItemConfig!$A:$D,4,FALSE))","v":260},{"$f":"IF(A18=\"\",\"\",VLOOKUP(A18,[1]ItemConfig!$A:$C,3,FALSE))","v":"渡劫丹-A2"},{"$f":"IF(A18=\"\",\"\",VLOOKUP(B18,[2]語言配置表!$A:$B,2,FALSE))","v":"渡劫丹-A2"},{"$f":"IF(A18=\"\",\"\",VLOOKUP(C18,[2]語言配置表!$A:$B,2,FALSE))","v":"渡劫丹-A2描述"}]
[{"$f":"IF([1]ItemConfig!$A22=\"\",\"\",[1]ItemConfig!$A22)","v":1203},{"$f":"IF(A19=\"\",\"\",VLOOKUP(A19,[1]ItemConfig!$A:$B,2,FALSE))","v":252},{"$f":"IF(A19=\"\",\"\",VLOOKUP(A19,[1]ItemConfig!$A:$D,4,FALSE))","v":261},{"$f":"IF(A19=\"\",\"\",VLOOKUP(A19,[1]ItemConfig!$A:$C,3,FALSE))","v":"渡劫丹-A3"},{"$f":"IF(A19=\"\",\"\",VLOOKUP(B19,[2]語言配置表!$A:$B,2,FALSE))","v":"渡劫丹-A3"},{"$f":"IF(A19=\"\",\"\",VLOOKUP(C19,[2]語言配置表!$A:$B,2,FALSE))","v":"渡劫丹-A3描述"}]
[{"$f":"IF([1]ItemConfig!$A23=\"\",\"\",[1]ItemConfig!$A23)","v":1204},{"$f":"IF(A20=\"\",\"\",VLOOKUP(A20,[1]ItemConfig!$A:$B,2,FALSE))","v":253},{"$f":"IF(A20=\"\",\"\",VLOOKUP(A20,[1]ItemConfig!$A:$D,4,FALSE))","v":262},{"$f":"IF(A20=\"\",\"\",VLOOKUP(A20,[1]ItemConfig!$A:$C,3,FALSE))","v":"渡劫丹-B1"},{"$f":"IF(A20=\"\",\"\",VLOOKUP(B20,[2]語言配置表!$A:$B,2,FALSE))","v":"渡劫丹-B1"},{"$f":"IF(A20=\"\",\"\",VLOOKUP(C20,[2]語言配置表!$A:$B,2,FALSE))","v":"渡劫丹-B1描述"}]
{"$rows_left_out":852}