{"text_format":"2","workbook":"xlsx","n_sheets":3,"sheets":["LevelbattleConfig","GroupConfig","强度验算"],"not_rendered":{"charts":0,"images":0,"macros":0,"external_links":3,"defined_names":2,"comments":0,"pivot_tables":0},"unopened":[],"bounds":{"document_bytes":16777216,"sheet_cells":100000,"run_cost":"one","rows_first":2000,"rows_last":500,"rows_between":2000,"halvings":0,"cell_chars":16384,"cell_head_chars":4096},"cells_cut":0,"cells_raw":0,"read":"whole","date_system":"1900"}

{"sheet":"LevelbattleConfig","index":0,"n_rows":220,"n_cols":18,"rows_kept":220,"cut":false,"hidden":false,"merged":[]}
["ID",null,"Group","awardDrop","awardNum","combatTime","combatType","MonsterGroupTruePower","MonsterGroupPower"]
["int",null,"int[]","int[]","int[]","float","int","int","int"]
[]
["战斗组ID","使用位置","包含的组ID\n（就是第二页的ID)","奖励随机掉落组","奖励道具数量","用时(秒）","玩法类型\n1.正常\n2.追逐\n3.站桩\n4.保卫水晶\n5.至少完成x波 （406260）\n6.至少坚持x秒 （406261）","怪物战斗组修为（实际）","怪物战斗组修为（表现）","评分修正\n例如3人参战填75%",null,"怪物等级上浮",{"$nulls":4},"事件ID","怪物等级"]
[100001,"主线1-1",{"$f":"A5","v":100001},-1,-1,120,1,100,100,null,"1-1"]
[100002,"主线1-1",{"$f":"A6","v":100002},-1,-1,120,1,100,100,null,"1-1"]
[100003,"主线1-1",{"$f":"A7","v":100003},-1,-1,120,1,100,100,null,"1-1",1]
[100004,"心魔1",{"$f":"A8","v":100004},-1,-1,120,1,100,100,null,"1-1",1]
[100005,"心魔2",{"$f":"A9","v":100005},-1,-1,120,1,100,100,null,"1-1",1]
[100006,"心魔3",100006,-1,-1,120,1,100,100,null,"1-1",1]
[1002,{"$f":"_xlfn.TEXTJOIN(\"-\",1,M11:N11)","v":"主线-击败结界兽"},1002,-1,-1,120,1,100,100,null,null,null,"主线","击败结界兽",10004,5,{"$f":"VLOOKUP(A11,[1]EventLinkConfig!$Y:$AM,15,FALSE)","v":10004},{"$f":"VLOOKUP(Q11,[1]EventConfig!$A:$P,16,FALSE)","v":6}]
[{"$f":"A11+1","v":1003},"主线-击败痴道人",1003,-1,-1,120,1,100,100,null,null,null,"主线","击败痴道人",10007,15,{"$f":"VLOOKUP(A12,[1]EventLinkConfig!$Y:$AM,15,FALSE)","v":10007},{"$f":"VLOOKUP(Q12,[1]EventConfig!$A:$P,16,FALSE)","v":16}]
[1004,"主线-妖兽横行",1004,-1,-1,120,1,100,100,null,null,null,"主线","妖兽横行",10010,25,10010,{"$f":"VLOOKUP(Q13,[1]EventConfig!$A:$P,16,FALSE)","v":25}]
[1005,"主线-击败后山小妖",1005,-1,-1,120,1,100,100,null,null,null,"主线","击败后山小妖",10015,45,10015,{"$f":"VLOOKUP(Q14,[1]EventConfig!$A:$P,16,FALSE)","v":46}]
[1006,"主线-击败夜袭的妖兽",1006,-1,-1,120,1,100,100,null,null,null,"主线","击败夜袭的妖兽",10016,50,10016,{"$f":"VLOOKUP(Q15,[1]EventConfig!$A:$P,16,FALSE)","v":51}]
[1007,"主线-击败峰顶的妖王",1007,-1,-1,120,1,100,100,null,null,null,"主线","击败峰顶的妖王",10017,55,10017,{"$f":"VLOOKUP(Q16,[1]EventConfig!$A:$P,16,FALSE)","v":56}]
[1008,"主线-击败仙山的阵眼妖兽",1008,-1,-1,120,1,100,100,null,null,null,"主线","击败仙山的阵眼妖兽",10023,85,10023,{"$f":"VLOOKUP(Q17,[1]EventConfig!$A:$P,16,FALSE)","v":86}]
[1009,"主线-击杀灵兽获得天肥",1009,-1,-1,120,1,100,100,null,null,null,"主线","击杀灵兽获得天肥",10025,95,10025,{"$f":"VLOOKUP(Q18,[1]EventConfig!$A:$P,16,FALSE)","v":101}]
[1010,{"$f":"_xlfn.TEXTJOIN(\"-\",1,M19:N19)","v":"主线-击败小麻雀的幻影"},{"$f":"A19","v":1010},-1,-1,120,1,100,100,null,null,null,"主线","击败小麻雀的幻影",10027,100,{"$f":"VLOOKUP(A19,[1]EventLinkConfig!$Y:$AM,15,FALSE)","v":10027},{"$f":"VLOOKUP(Q19,[1]EventConfig!$A:$P,16,FALSE)","v":121}]
[1011,{"$f":"_xlfn.TEXTJOIN(\"-\",1,M20:N20)","v":"主线-击败痴道人的幻影"},{"$f":"A20","v":1011},-1,-1,120,1,100,100,null,null,null,"主线","击败痴道人的幻影",10027,110,{"$f":"VLOOKUP(A20,[1]EventLinkConfig!$Y:$AM,15,FALSE)","v":10027},{"$f":"VLOOKUP(Q20,[1]EventConfig!$A:$P,16,FALSE)","v":121}]
[1012,{"$f":"_xlfn.TEXTJOIN(\"-\",1,M21:N21)","v":"主线-樗木之灵的幻影"},{"$f":"A21","v":1012},-1,-1,120,1,100,100,null,null,null,"主线","樗木之灵的幻影",10027,120,{"$f":"VLOOKUP(A21,[1]EventLinkConfig!$Y:$AM,15,FALSE)","v":10027},{"$f":"VLOOKUP(Q21,[1]EventConfig!$A:$P,16,FALSE)","v":121}]
[1013,{"$f":"_xlfn.TEXTJOIN(\"-\",1,M22:N22)","v":"主线-击败心魔"},{"$f":"A22","v":1013},-1,-1,120,1,100,100,null,null,null,"主线","击败心魔",10030,140,{"$f":"VLOOKUP(A22,[1]EventLinkConfig!$Y:$AM,15,FALSE)","v":10030},{"$f":"VLOOKUP(Q22,[1]EventConfig!$A:$P,16,FALSE)","v":141}]
[1014,"主线-击败北海妖兽2",1014,-1,-1,120,1,100,100,null,null,null,"主线","击败北海妖兽2",10031,150,{"$f":"VLOOKUP(A23,[1]EventLinkConfig!$Y:$AM,15,FALSE)","v":10031},{"$f":"VLOOKUP(Q23,[1]EventConfig!$A:$P,16,FALSE)","v":151}]
[1015,{"$f":"_xlfn.TEXTJOIN(\"-\",1,M24:N24)","v":"主线-击败北海妖兽1"},{"$f":"A24","v":1015},-1,-1,120,1,100,100,null,null,null,"主线","击败北海妖兽1",10010,25,10010,{"$f":"VLOOKUP(Q24,[1]EventConfig!$A:$P,16,FALSE)","v":25}]
[1016,{"$f":"_xlfn.TEXTJOIN(\"-\",1,M25:N25)","v":"主线-与樗木之灵切磋"},{"$f":"A25","v":1016},-1,-1,120,1,100,100,null,null,null,"主线","与樗木之灵切磋",10020,65,{"$f":"VLOOKUP(A25,[1]EventLinkConfig!$Y:$AM,15,FALSE)","v":10020},{"$f":"VLOOKUP(Q25,[1]EventConfig!$A:$P,16,FALSE)","v":69}]
{"$rows_empty":22}
[3001,{"$f":"_xlfn.TEXTJOIN(\"-\",1,M48:N48)","v":"道侣雀灵儿-击败风妖"},{"$f":"A48","v":3001},-1,-1,120,1,100,100,null,null,null,"道侣雀灵儿","击败风妖",6003,{"$f":"VLOOKUP(O48,[1]EventConfig!$A:$P,16,FALSE)","v":11},{"$f":"VLOOKUP(A48,[1]EventLinkConfig!$Y:$AM,15,FALSE)","v":6003},{"$f":"VLOOKUP(Q48,[1]EventConfig!$A:$P,16,FALSE)","v":11}]
[3002,{"$f":"_xlfn.TEXTJOIN(\"-\",1,M49:N49)","v":"道侣雀灵儿-击败大风妖兽"},{"$f":"A49","v":3002},-1,-1,120,1,100,100,null,null,null,"道侣雀灵儿","击败大风妖兽",6003,{"$f":"VLOOKUP(O49,[1]EventConfig!$A:$P,16,FALSE)","v":11},{"$f":"VLOOKUP(A49,[1]EventLinkConfig!$Y:$AM,15,FALSE)","v":6005},{"$f":"VLOOKUP(Q49,[1]EventConfig!$A:$P,16,FALSE)","v":21}]
[{"$f":"A49+1","v":3003},{"$f":"_xlfn.TEXTJOIN(\"-\",1,M50:N50)","v":"道侣云枝-击败风妖"},{"$f":"A50","v":3003},-1,-1,120,1,100,100,null,null,null,"道侣云枝","击败风妖",6011,{"$f":"VLOOKUP(O50,[1]EventConfig!$A:$P,16,FALSE)","v":11},6011,{"$f":"VLOOKUP(Q50,[1]EventConfig!$A:$P,16,FALSE)","v":11}]
[3004,{"$f":"_xlfn.TEXTJOIN(\"-\",1,M51:N51)","v":"道侣云枝-击败风妖2"},{"$f":"A51","v":3004},-1,-1,120,1,100,100,null,null,null,"道侣云枝","击败风妖2",6012,{"$f":"VLOOKUP(O51,[1]EventConfig!$A:$P,16,FALSE)","v":16},{"$f":"VLOOKUP(A51,[1]EventLinkConfig!$Y:$AM,15,FALSE)","v":6012},{"$f":"VLOOKUP(Q51,[1]EventConfig!$A:$P,16,FALSE)","v":16}]
[3005,{"$f":"_xlfn.TEXTJOIN(\"-\",1,M52:N52)","v":"道侣云枝-击败风妖3"},{"$f":"A52","v":3005},-1,-1,120,1,100,100,null,null,null,"道侣云枝","击败风妖3",6013,{"$f":"VLOOKUP(O52,[1]EventConfig!$A:$P,16,FALSE)","v":21},{"$f":"VLOOKUP(A52,[1]EventLinkConfig!$Y:$AM,15,FALSE)","v":6012},{"$f":"VLOOKUP(Q52,[1]EventConfig!$A:$P,16,FALSE)","v":16}]
[3006,{"$f":"_xlfn.TEXTJOIN(\"-\",1,M53:N53)","v":"道侣云枝-击败风妖4"},{"$f":"A53","v":3006},-1,-1,120,1,100,100,null,null,null,"道侣云枝","击败风妖4",6013,{"$f":"VLOOKUP(O53,[1]EventConfig!$A:$P,16,FALSE)","v":21},{"$f":"VLOOKUP(A53,[1]EventLinkConfig!$Y:$AM,15,FALSE)","v":6013},{"$f":"VLOOKUP(Q53,[1]EventConfig!$A:$P,16,FALSE)","v":21}]
[3007,{"$f":"_xlfn.TEXTJOIN(\"-\",1,M54:N54)","v":"道侣云枝-击败风妖4"},{"$f":"A54","v":3007},-1,-1,120,1,100,100,null,null,null,"道侣云枝","击败风妖4",6015,{"$f":"VLOOKUP(O54,[1]EventConfig!$A:$P,16,FALSE)","v":31},{"$f":"VLOOKUP(A54,[1]EventLinkConfig!$Y:$AM,15,FALSE)","v":6015},{"$f":"VLOOKUP(Q54,[1]EventConfig!$A:$P,16,FALSE)","v":31}]
[3008,{"$f":"_xlfn.TEXTJOIN(\"-\",1,M55:N55)","v":"道侣云枝-击败风妖5"},{"$f":"A55","v":3008},-1,-1,120,1,100,100,null,null,null,"道侣云枝","击败风妖5",6015,{"$f":"VLOOKUP(O55,[1]EventConfig!$A:$P,16,FALSE)","v":31},{"$f":"VLOOKUP(A55,[1]EventLinkConfig!$Y:$AM,15,FALSE)","v":6015},{"$f":"VLOOKUP(Q55,[1]EventConfig!$A:$P,16,FALSE)","v":31}]
[3009,{"$f":"_xlfn.TEXTJOIN(\"-\",1,M56:N56)","v":"道侣婉溪-击败抢走玉佩的小妖"},{"$f":"A56","v":3009},-1,-1,120,1,100,100,null,null,null,"道侣婉溪","击败抢走玉佩的小妖",6034,{"$f":"VLOOKUP(O56,[1]EventConfig!$A:$P,16,FALSE)","v":144},6034,{"$f":"VLOOKUP(Q56,[1]EventConfig!$A:$P,16,FALSE)","v":144}]
[3010,{"$f":"_xlfn.TEXTJOIN(\"-\",1,M57:N57)","v":"道侣婉溪-击败溪边水灵"},{"$f":"A57","v":3010},-1,-1,120,1,100,100,null,null,null,"道侣婉溪","击败溪边水灵",null,{"$f":"VLOOKUP(O57,[1]EventConfig!$A:$P,16,FALSE)","v":{"$error":"#N/A"}},{"$f":"VLOOKUP(A57,[1]EventLinkConfig!$Y:$AM,15,FALSE)","v":6035},{"$f":"VLOOKUP(Q57,[1]EventConfig!$A:$P,16,FALSE)","v":145}]
[3011,{"$f":"_xlfn.TEXTJOIN(\"-\",1,M58:N58)","v":"道侣许由-击败守护灵草的小妖"},{"$f":"A58","v":3011},-1,-1,120,1,100,100,null,null,null,"道侣许由","击败守护灵草的小妖",null,{"$f":"VLOOKUP(O58,[1]EventConfig!$A:$P,16,FALSE)","v":{"$error":"#N/A"}},6042,{"$f":"VLOOKUP(Q58,[1]EventConfig!$A:$P,16,FALSE)","v":66}]
[3012,{"$f":"_xlfn.TEXTJOIN(\"-\",1,M59:N59)","v":"道侣许由-击败秘境灵草守卫"},{"$f":"A59","v":3012},-1,-1,120,1,100,100,null,null,null,"道侣许由","击败秘境灵草守卫",null,{"$f":"VLOOKUP(O59,[1]EventConfig!$A:$P,16,FALSE)","v":{"$error":"#N/A"}},6044,{"$f":"VLOOKUP(Q59,[1]EventConfig!$A:$P,16,FALSE)","v":86}]
[3013,{"$f":"_xlfn.TEXTJOIN(\"-\",1,M60:N60)","v":"道侣疯道人-击败果园守卫"},{"$f":"A60","v":3013},-1,-1,120,1,100,100,null,null,null,"道侣疯道人","击败果园守卫",null,{"$f":"VLOOKUP(O60,[1]EventConfig!$A:$P,16,FALSE)","v":{"$error":"#N/A"}},6052,{"$f":"VLOOKUP(Q60,[1]EventConfig!$A:$P,16,FALSE)","v":96}]
[3014,{"$f":"_xlfn.TEXTJOIN(\"-\",1,M61:N61)","v":"道侣疯道人-帮助疯道人驱妖"},{"$f":"A61","v":3014},-1,-1,120,1,100,100,null,null,null,"道侣疯道人","帮助疯道人驱妖",null,{"$f":"VLOOKUP(O61,[1]EventConfig!$A:$P,16,FALSE)","v":{"$error":"#N/A"}},{"$f":"VLOOKUP(A61,[1]EventLinkConfig!$Y:$AM,15,FALSE)","v":6053},{"$f":"VLOOKUP(Q61,[1]EventConfig!$A:$P,16,FALSE)","v":106}]
[3015,{"$f":"_xlfn.TEXTJOIN(\"-\",1,M62:N62)","v":"道侣疯道人-击败疯道人"},{"$f":"A62","v":3015},-1,-1,120,1,100,100,null,null,null,"道侣疯道人","击败疯道人",null,{"$f":"VLOOKUP(O62,[1]EventConfig!$A:$P,16,FALSE)","v":{"$error":"#N/A"}},{"$f":"VLOOKUP(A62,[1]EventLinkConfig!$Y:$AM,15,FALSE)","v":6055},{"$f":"VLOOKUP(Q62,[1]EventConfig!$A:$P,16,FALSE)","v":126}]
[3016,"道侣风瑶-击败误食灵石的妖兽",3016,-1,-1,120,1,100,100,null,null,null,"道侣风瑶","击败误食灵石的妖兽",null,{"$f":"VLOOKUP(O63,[1]EventConfig!$A:$P,16,FALSE)","v":{"$error":"#N/A"}},{"$f":"VLOOKUP(A63,[1]EventLinkConfig!$Y:$AM,15,FALSE)","v":30017},{"$f":"VLOOKUP(Q63,[1]EventConfig!$A:$P,16,FALSE)","v":46}]
[]
[10001,{"$f":"_xlfn.TEXTJOIN(\"-\",1,M65:N65)","v":"引导 -开局第一场战斗"},10001,-1,-1,120,1,100,100,null,null,null,"引导 ","开局第一场战斗",10004,5]
[]
[4001,{"$f":"_xlfn.TEXTJOIN(\"-\",1,M67:N67)","v":"支线-海岸异象-妖物调查"},{"$f":"A67","v":4001},-1,-1,120,1,100,100,null,null,null,"支线-海岸异象","妖物调查",null,30,{"$f":"VLOOKUP(A67,[1]EventLinkConfig!$Y:$AM,15,FALSE)","v":9112},{"$f":"VLOOKUP(Q67,[1]EventConfig!$A:$P,16,FALSE)","v":8}]
[4002,"支线-幽魂-幽魂石守护兽",4002,-1,-1,120,1,100,100,null,null,null,"支线-幽魂","幽魂石守护兽",null,60,{"$f":"VLOOKUP(A68,[1]EventLinkConfig!$Y:$AM,15,FALSE)","v":9115},{"$f":"VLOOKUP(Q68,[1]EventConfig!$A:$P,16,FALSE)","v":23}]
[4003,"支线-馨儿-迷雾妖怪",4003,-1,-1,120,1,100,100,null,null,null,"支线-馨儿","迷雾妖怪",null,90,{"$f":"VLOOKUP(A69,[1]EventLinkConfig!$Y:$AM,15,FALSE)","v":9118},{"$f":"VLOOKUP(Q69,[1]EventConfig!$A:$P,16,FALSE)","v":20}]
[4004,"支线-馨儿-发现信使",4004,-1,-1,120,1,100,100,null,null,null,"支线-馨儿","发现信使",null,110,{"$f":"VLOOKUP(A70,[1]EventLinkConfig!$Y:$AM,15,FALSE)","v":9119},{"$f":"VLOOKUP(Q70,[1]EventConfig!$A:$P,16,FALSE)","v":25}]
[4005,"支线-馨儿-发现信使",4005,-1,-1,120,1,100,100,null,null,null,"支线-馨儿","发现信使",null,120,{"$f":"VLOOKUP(A71,[1]EventLinkConfig!$Y:$AM,15,FALSE)","v":9119},{"$f":"VLOOKUP(Q71,[1]EventConfig!$A:$P,16,FALSE)","v":25}]
[4006,"支线-馨儿-风灵鸟的宝藏",4006,-1,-1,120,1,100,100,null,null,null,"支线-馨儿","风灵鸟的宝藏",null,130,{"$f":"VLOOKUP(A72,[1]EventLinkConfig!$Y:$AM,15,FALSE)","v":9120},{"$f":"VLOOKUP(Q72,[1]EventConfig!$A:$P,16,FALSE)","v":30}]
[4007,"支线-馨儿-浮岛灵泉的净化",4007,-1,-1,120,1,100,100,null,null,null,"支线-馨儿","浮岛灵泉的净化",null,140,{"$f":"VLOOKUP(A73,[1]EventLinkConfig!$Y:$AM,15,FALSE)","v":9121},{"$f":"VLOOKUP(Q73,[1]EventConfig!$A:$P,16,FALSE)","v":35}]
[4008,"支线-馨儿-浮岛盗修的阴谋",4008,-1,-1,120,1,100,100,null,null,null,"支线-馨儿","浮岛盗修的阴谋",null,150,{"$f":"VLOOKUP(A74,[1]EventLinkConfig!$Y:$AM,15,FALSE)","v":9122},{"$f":"VLOOKUP(Q74,[1]EventConfig!$A:$P,16,FALSE)","v":40}]
[4009,"支线-柳轻烟-找到血海宗的人",4009,-1,-1,120,1,100,100,null,null,null,"支线-柳轻烟","找到血海宗的人",null,160,{"$f":"VLOOKUP(A75,[1]EventLinkConfig!$Y:$AM,15,FALSE)","v":9124},{"$f":"VLOOKUP(Q75,[1]EventConfig!$A:$P,16,FALSE)","v":26}]
[4010,{"$f":"_xlfn.TEXTJOIN(\"-\",1,M76:N76)","v":"支线-柳轻烟-找到血海宗的人2"},{"$f":"A76","v":4010},-1,-1,120,1,100,100,null,null,null,"支线-柳轻烟","找到血海宗的人2",null,170,{"$f":"VLOOKUP(A76,[1]EventLinkConfig!$Y:$AM,15,FALSE)","v":9125},{"$f":"VLOOKUP(Q76,[1]EventConfig!$A:$P,16,FALSE)","v":31}]
[4011,"支线-馨儿-灵花",4011,-1,-1,120,1,100,100,null,null,null,"支线-馨儿","灵花",null,180,{"$f":"VLOOKUP(A77,[1]EventLinkConfig!$Y:$AM,15,FALSE)","v":9127},{"$f":"VLOOKUP(Q77,[1]EventConfig!$A:$P,16,FALSE)","v":31}]
[4012,"支线-馨儿-散修劫掠",4012,-1,-1,120,1,100,100,null,null,null,"支线-馨儿","散修劫掠",null,190,{"$f":"VLOOKUP(A78,[1]EventLinkConfig!$Y:$AM,15,FALSE)","v":9128},{"$f":"VLOOKUP(Q78,[1]EventConfig!$A:$P,16,FALSE)","v":41}]
[4013,"支线-馨儿-散修劫掠2",4013,-1,-1,120,1,100,100,null,null,null,"支线-馨儿","散修劫掠2",null,200,{"$f":"VLOOKUP(A79,[1]EventLinkConfig!$Y:$AM,15,FALSE)","v":9129},{"$f":"VLOOKUP(Q79,[1]EventConfig!$A:$P,16,FALSE)","v":51}]
[4014,"支线-楚云缪-青狼散人",4014,-1,-1,120,1,100,100,null,null,null,"支线-楚云缪","青狼散人",null,210,{"$f":"VLOOKUP(A80,[1]EventLinkConfig!$Y:$AM,15,FALSE)","v":9132},{"$f":"VLOOKUP(Q80,[1]EventConfig!$A:$P,16,FALSE)","v":66}]
[4015,"支线-血海宗的掠夺-血海宗的掠夺",4015,-1,-1,120,1,100,100,null,null,null,"支线-血海宗的掠夺","血海宗的掠夺",null,220,{"$f":"VLOOKUP(A81,[1]EventLinkConfig!$Y:$AM,15,FALSE)","v":9133},{"$f":"VLOOKUP(Q81,[1]EventConfig!$A:$P,16,FALSE)","v":61}]
[4016,"支线-林风-逃离追杀",4016,-1,-1,120,1,100,100,null,null,null,"支线-林风","逃离追杀",null,230,{"$f":"VLOOKUP(A82,[1]EventLinkConfig!$Y:$AM,15,FALSE)","v":9134},{"$f":"VLOOKUP(Q82,[1]EventConfig!$A:$P,16,FALSE)","v":66}]
[4017,"支线-林风-血海宗弟子",4017,-1,-1,120,1,100,100,null,null,null,"支线-林风","血海宗弟子",null,240,{"$f":"VLOOKUP(A83,[1]EventLinkConfig!$Y:$AM,15,FALSE)","v":9135},{"$f":"VLOOKUP(Q83,[1]EventConfig!$A:$P,16,FALSE)","v":71}]
[4018,"支线-林风-血海宗弟子",4018,-1,-1,120,1,100,100,null,null,null,"支线-林风","血海宗弟子",null,250,{"$f":"VLOOKUP(A84,[1]EventLinkConfig!$Y:$AM,15,FALSE)","v":9135},{"$f":"VLOOKUP(Q84,[1]EventConfig!$A:$P,16,FALSE)","v":71}]
[4019,"支线-林风-血海宗弟子",4019,-1,-1,120,1,100,100,null,null,null,"支线-林风","血海宗弟子",null,260,{"$f":"VLOOKUP(A85,[1]EventLinkConfig!$Y:$AM,15,FALSE)","v":9135},{"$f":"VLOOKUP(Q85,[1]EventConfig!$A:$P,16,FALSE)","v":71}]
[4020,"支线-林风后续-夺晶之战",4020,-1,-1,120,1,100,100,null,null,null,"支线-林风后续","夺晶之战",null,270,{"$f":"VLOOKUP(A86,[1]EventLinkConfig!$Y:$AM,15,FALSE)","v":9139},{"$f":"VLOOKUP(Q86,[1]EventConfig!$A:$P,16,FALSE)","v":76}]
[4021,"支线-林风后续-夺晶之战",4021,-1,-1,120,1,100,100,null,null,null,"支线-林风后续","夺晶之战",null,280,{"$f":"VLOOKUP(A87,[1]EventLinkConfig!$Y:$AM,15,FALSE)","v":9139},{"$f":"VLOOKUP(Q87,[1]EventConfig!$A:$P,16,FALSE)","v":76}]
[4022,"支线-林风后续-夺晶之战2-援军",4022,-1,-1,120,1,100,100,null,null,null,"支线-林风后续","夺晶之战2-援军",null,290,{"$f":"VLOOKUP(A88,[1]EventLinkConfig!$Y:$AM,15,FALSE)","v":9140},{"$f":"VLOOKUP(Q88,[1]EventConfig!$A:$P,16,FALSE)","v":86}]
[4023,"支线-林风-消灭妖邪",4023,-1,-1,120,1,100,100,null,null,null,"支线-林风","消灭妖邪",null,300,9142,{"$f":"VLOOKUP(Q89,[1]EventConfig!$A:$P,16,FALSE)","v":101}]
[4024,"支线-仙山异样-消灭仙山西边的妖物",4024,-1,-1,120,1,100,100,null,null,null,"支线-仙山异样","消灭仙山西边的妖物",null,300,9144,{"$f":"VLOOKUP(Q90,[1]EventConfig!$A:$P,16,FALSE)","v":121}]
[4025,{"$f":"_xlfn.TEXTJOIN(\"-\",1,M91:N91)","v":"支线-仙山异样-仙山异样的秘密"},{"$f":"A91","v":4025},-1,-1,120,1,100,100,null,null,null,"支线-仙山异样","仙山异样的秘密",null,300,{"$f":"VLOOKUP(A91,[1]EventLinkConfig!$Y:$AM,15,FALSE)","v":9145},{"$f":"VLOOKUP(Q91,[1]EventConfig!$A:$P,16,FALSE)","v":131}]
[4026,{"$f":"_xlfn.TEXTJOIN(\"-\",1,M92:N92)","v":"被困的萤火虫"},{"$f":"A92","v":4026},-1,-1,120,1,100,100,null,null,null,"被困的萤火虫",null,null,300,{"$f":"VLOOKUP(A92,[1]EventLinkConfig!$Y:$AM,15,FALSE)","v":9159},{"$f":"VLOOKUP(Q92,[1]EventConfig!$A:$P,16,FALSE)","v":-1}]
[]
[5001,{"$f":"_xlfn.TEXTJOIN(\"-\",1,M94:N94)","v":"通用-法宝掉落-品质1"},{"$f":"A94","v":5001},-1,-1,120,1,100,100,null,null,null,"通用-法宝掉落","品质1",null,-1,101]
[{"$f":"A94+1","v":5002},{"$f":"_xlfn.TEXTJOIN(\"-\",1,M95:N95)","v":"通用-法宝掉落-品质2"},{"$f":"A95","v":5002},-1,-1,120,1,100,100,null,null,null,"通用-法宝掉落","品质2",null,-1,110]
[{"$f":"A95+1","v":5003},"通用-法宝掉落-品质3",5003,-1,-1,120,1,100,100,null,null,null,"通用-法宝掉落","品质3",null,-1,119]
[{"$f":"A96+1","v":5004},{"$f":"_xlfn.TEXTJOIN(\"-\",1,M97:N97)","v":"通用-法宝掉落-品质4"},{"$f":"A97","v":5004},-1,-1,120,1,100,100,null,null,null,"通用-法宝掉落","品质4",null,-1,128]
[{"$f":"A97+1","v":5005},{"$f":"_xlfn.TEXTJOIN(\"-\",1,M98:N98)","v":"通用-法宝掉落-品质5"},{"$f":"A98","v":5005},-1,-1,120,1,100,100,null,null,null,"通用-法宝掉落","品质5",null,-1,137]
[{"$f":"A98+1","v":5006},"通用-功法掉落-品质1",5006,-1,-1,120,1,100,100,null,null,null,"通用-功法掉落","品质1",null,-1,102]
[5007,"通用-功法掉落-品质2",5007,-1,-1,120,1,100,100,null,null,null,"通用-功法掉落","品质2",null,-1,111]
[5008,"通用-功法掉落-品质3",5008,-1,-1,120,1,100,100,null,null,null,"通用-功法掉落","品质3",null,-1,120]
[5009,"通用-功法掉落-品质4",5009,-1,-1,120,1,100,100,null,null,null,"通用-功法掉落","品质4",null,-1,129]
[5010,{"$f":"_xlfn.TEXTJOIN(\"-\",1,M103:N103)","v":"通用-功法掉落-品质5"},{"$f":"A103","v":5010},-1,-1,120,1,100,100,null,null,null,"通用-功法掉落","品质5",null,-1,138]
[]
[2001,"命运峰-第1层",{"$f":"A105","v":2001},{"$f":"VLOOKUP(A105,[2]TowerInfoConfig!$H:$R,10,FALSE)","v":0},{"$f":"VLOOKUP(A105,[2]TowerInfoConfig!$H:$R,11,FALSE)","v":"1001;1401"},120,1,100,100]
[2002,"命运峰-第2层",{"$f":"A106","v":2002},{"$f":"VLOOKUP(A106,[2]TowerInfoConfig!$H:$R,10,FALSE)","v":0},{"$f":"VLOOKUP(A106,[2]TowerInfoConfig!$H:$R,11,FALSE)","v":"1001;1701"},120,1,100,100]
[2003,"命运峰-第3层",2003,{"$f":"VLOOKUP(A107,[2]TowerInfoConfig!$H:$R,10,FALSE)","v":0},{"$f":"VLOOKUP(A107,[2]TowerInfoConfig!$H:$R,11,FALSE)","v":"1001;21012"},120,1,100,100]
[2004,"命运峰-第4层",{"$f":"A108","v":2004},{"$f":"VLOOKUP(A108,[2]TowerInfoConfig!$H:$R,10,FALSE)","v":0},{"$f":"VLOOKUP(A108,[2]TowerInfoConfig!$H:$R,11,FALSE)","v":"1001;1304"},120,1,100,100]
[2005,"命运峰-第5层",2005,{"$f":"VLOOKUP(A109,[2]TowerInfoConfig!$H:$R,10,FALSE)","v":0},{"$f":"VLOOKUP(A109,[2]TowerInfoConfig!$H:$R,11,FALSE)","v":"1001;1401"},120,1,100,100]
[2006,"命运峰-第6层",2006,{"$f":"VLOOKUP(A110,[2]TowerInfoConfig!$H:$R,10,FALSE)","v":0},{"$f":"VLOOKUP(A110,[2]TowerInfoConfig!$H:$R,11,FALSE)","v":"1001;1701"},120,1,100,100]
[2007,"命运峰-第7层",2007,{"$f":"VLOOKUP(A111,[2]TowerInfoConfig!$H:$R,10,FALSE)","v":0},{"$f":"VLOOKUP(A111,[2]TowerInfoConfig!$H:$R,11,FALSE)","v":"1001;21012"},120,1,100,100]
[2008,"命运峰-第8层",2008,{"$f":"VLOOKUP(A112,[2]TowerInfoConfig!$H:$R,10,FALSE)","v":0},{"$f":"VLOOKUP(A112,[2]TowerInfoConfig!$H:$R,11,FALSE)","v":"1001;1305"},120,1,100,100]
[2009,"命运峰-第9层",2009,{"$f":"VLOOKUP(A113,[2]TowerInfoConfig!$H:$R,10,FALSE)","v":0},{"$f":"VLOOKUP(A113,[2]TowerInfoConfig!$H:$R,11,FALSE)","v":"1001;1402"},120,1,100,100]
[2010,"命运峰-第10层",2010,{"$f":"VLOOKUP(A114,[2]TowerInfoConfig!$H:$R,10,FALSE)","v":0},{"$f":"VLOOKUP(A114,[2]TowerInfoConfig!$H:$R,11,FALSE)","v":"1001;1702"},120,1,100,100]
[2011,"命运峰-第11层",2011,{"$f":"VLOOKUP(A115,[2]TowerInfoConfig!$H:$R,10,FALSE)","v":0},{"$f":"VLOOKUP(A115,[2]TowerInfoConfig!$H:$R,11,FALSE)","v":"1001;21012"},120,1,100,100]
[2012,"命运峰-第12层",2012,{"$f":"VLOOKUP(A116,[2]TowerInfoConfig!$H:$R,10,FALSE)","v":0},{"$f":"VLOOKUP(A116,[2]TowerInfoConfig!$H:$R,11,FALSE)","v":"1001;1306"},120,1,100,100]
[2013,"命运峰-第13层",2013,{"$f":"VLOOKUP(A117,[2]TowerInfoConfig!$H:$R,10,FALSE)","v":0},{"$f":"VLOOKUP(A117,[2]TowerInfoConfig!$H:$R,11,FALSE)","v":"1001;1402"},120,1,100,100]
[2014,"命运峰-第14层",2014,{"$f":"VLOOKUP(A118,[2]TowerInfoConfig!$H:$R,10,FALSE)","v":0},{"$f":"VLOOKUP(A118,[2]TowerInfoConfig!$H:$R,11,FALSE)","v":"1001;1702"},120,1,100,100]
[2015,"命运峰-第15层",2015,{"$f":"VLOOKUP(A119,[2]TowerInfoConfig!$H:$R,10,FALSE)","v":0},{"$f":"VLOOKUP(A119,[2]TowerInfoConfig!$H:$R,11,FALSE)","v":"1001;21012"},120,1,100,100]
[2016,"命运峰-第16层",2016,{"$f":"VLOOKUP(A120,[2]TowerInfoConfig!$H:$R,10,FALSE)","v":0},{"$f":"VLOOKUP(A120,[2]TowerInfoConfig!$H:$R,11,FALSE)","v":"1001;1307"},120,1,100,100]
[2017,"命运峰-第17层",2017,{"$f":"VLOOKUP(A121,[2]TowerInfoConfig!$H:$R,10,FALSE)","v":0},{"$f":"VLOOKUP(A121,[2]TowerInfoConfig!$H:$R,11,FALSE)","v":"1001;1402"},120,1,100,100]
[2018,"命运峰-第18层",2018,{"$f":"VLOOKUP(A122,[2]TowerInfoConfig!$H:$R,10,FALSE)","v":0},{"$f":"VLOOKUP(A122,[2]TowerInfoConfig!$H:$R,11,FALSE)","v":"1001;1702"},120,1,100,100]
[2019,"命运峰-第19层",2019,{"$f":"VLOOKUP(A123,[2]TowerInfoConfig!$H:$R,10,FALSE)","v":0},{"$f":"VLOOKUP(A123,[2]TowerInfoConfig!$H:$R,11,FALSE)","v":"1001;21012"},120,1,100,100]
[2020,"命运峰-第20层",2020,{"$f":"VLOOKUP(A124,[2]TowerInfoConfig!$H:$R,10,FALSE)","v":0},{"$f":"VLOOKUP(A124,[2]TowerInfoConfig!$H:$R,11,FALSE)","v":"1001;1308"},120,1,100,100]
[2021,"命运峰-第21层",2021,{"$f":"VLOOKUP(A125,[2]TowerInfoConfig!$H:$R,10,FALSE)","v":0},{"$f":"VLOOKUP(A125,[2]TowerInfoConfig!$H:$R,11,FALSE)","v":"1001;1402"},120,1,100,100]
[2022,"命运峰-第22层",2022,{"$f":"VLOOKUP(A126,[2]TowerInfoConfig!$H:$R,10,FALSE)","v":0},{"$f":"VLOOKUP(A126,[2]TowerInfoConfig!$H:$R,11,FALSE)","v":"1001;1702"},120,1,100,100]
[2023,"命运峰-第23层",2023,{"$f":"VLOOKUP(A127,[2]TowerInfoConfig!$H:$R,10,FALSE)","v":0},{"$f":"VLOOKUP(A127,[2]TowerInfoConfig!$H:$R,11,FALSE)","v":"1001;21012"},120,1,100,100]
[2024,"命运峰-第24层",2024,{"$f":"VLOOKUP(A128,[2]TowerInfoConfig!$H:$R,10,FALSE)","v":0},{"$f":"VLOOKUP(A128,[2]TowerInfoConfig!$H:$R,11,FALSE)","v":"1001;1309"},120,1,100,100]
[2025,"命运峰-第25层",2025,{"$f":"VLOOKUP(A129,[2]TowerInfoConfig!$H:$R,10,FALSE)","v":0},{"$f":"VLOOKUP(A129,[2]TowerInfoConfig!$H:$R,11,FALSE)","v":"1001;1402"},120,1,100,100]
[2026,"命运峰-第26层",2026,{"$f":"VLOOKUP(A130,[2]TowerInfoConfig!$H:$R,10,FALSE)","v":0},{"$f":"VLOOKUP(A130,[2]TowerInfoConfig!$H:$R,11,FALSE)","v":"1001;1702"},120,1,100,100]
[2027,"命运峰-第27层",2027,{"$f":"VLOOKUP(A131,[2]TowerInfoConfig!$H:$R,10,FALSE)","v":0},{"$f":"VLOOKUP(A131,[2]TowerInfoConfig!$H:$R,11,FALSE)","v":"1001;21012"},120,1,100,100]
[2028,"命运峰-第28层",2028,{"$f":"VLOOKUP(A132,[2]TowerInfoConfig!$H:$R,10,FALSE)","v":0},{"$f":"VLOOKUP(A132,[2]TowerInfoConfig!$H:$R,11,FALSE)","v":"1001;1310"},120,1,100,100]
[2029,"命运峰-第29层",2029,{"$f":"VLOOKUP(A133,[2]TowerInfoConfig!$H:$R,10,FALSE)","v":0},{"$f":"VLOOKUP(A133,[2]TowerInfoConfig!$H:$R,11,FALSE)","v":"1001;1402"},120,1,100,100]
[2030,"命运峰-第30层",2030,{"$f":"VLOOKUP(A134,[2]TowerInfoConfig!$H:$R,10,FALSE)","v":0},{"$f":"VLOOKUP(A134,[2]TowerInfoConfig!$H:$R,11,FALSE)","v":"1001;1702"},120,1,100,100]
[2031,"命运峰-第31层",2031,{"$f":"VLOOKUP(A135,[2]TowerInfoConfig!$H:$R,10,FALSE)","v":0},{"$f":"VLOOKUP(A135,[2]TowerInfoConfig!$H:$R,11,FALSE)","v":"1001;21012"},120,1,100,100]
[2032,"命运峰-第32层",2032,{"$f":"VLOOKUP(A136,[2]TowerInfoConfig!$H:$R,10,FALSE)","v":0},{"$f":"VLOOKUP(A136,[2]TowerInfoConfig!$H:$R,11,FALSE)","v":"1001;1311"},120,1,100,100]
[2033,"命运峰-第33层",2033,{"$f":"VLOOKUP(A137,[2]TowerInfoConfig!$H:$R,10,FALSE)","v":0},{"$f":"VLOOKUP(A137,[2]TowerInfoConfig!$H:$R,11,FALSE)","v":"1001;1403"},120,1,100,100]
[2034,"命运峰-第34层",2034,{"$f":"VLOOKUP(A138,[2]TowerInfoConfig!$H:$R,10,FALSE)","v":0},{"$f":"VLOOKUP(A138,[2]TowerInfoConfig!$H:$R,11,FALSE)","v":"1001;1702"},120,1,100,100]
[2035,"命运峰-第35层",2035,{"$f":"VLOOKUP(A139,[2]TowerInfoConfig!$H:$R,10,FALSE)","v":0},{"$f":"VLOOKUP(A139,[2]TowerInfoConfig!$H:$R,11,FALSE)","v":"1001;21012"},120,1,100,100]
[2036,"命运峰-第36层",2036,{"$f":"VLOOKUP(A140,[2]TowerInfoConfig!$H:$R,10,FALSE)","v":0},{"$f":"VLOOKUP(A140,[2]TowerInfoConfig!$H:$R,11,FALSE)","v":"1001;1312"},120,1,100,100]
[2037,"命运峰-第37层",2037,{"$f":"VLOOKUP(A141,[2]TowerInfoConfig!$H:$R,10,FALSE)","v":0},{"$f":"VLOOKUP(A141,[2]TowerInfoConfig!$H:$R,11,FALSE)","v":"1001;1403"},120,1,100,100]
[2038,"命运峰-第38层",2038,{"$f":"VLOOKUP(A142,[2]TowerInfoConfig!$H:$R,10,FALSE)","v":0},{"$f":"VLOOKUP(A142,[2]TowerInfoConfig!$H:$R,11,FALSE)","v":"1001;1702"},120,1,100,100]
[2039,"命运峰-第39层",2039,{"$f":"VLOOKUP(A143,[2]TowerInfoConfig!$H:$R,10,FALSE)","v":0},{"$f":"VLOOKUP(A143,[2]TowerInfoConfig!$H:$R,11,FALSE)","v":"1001;21012"},120,1,100,100]
[2040,"命运峰-第40层",2040,{"$f":"VLOOKUP(A144,[2]TowerInfoConfig!$H:$R,10,FALSE)","v":0},{"$f":"VLOOKUP(A144,[2]TowerInfoConfig!$H:$R,11,FALSE)","v":"1001;1313"},120,1,100,100]
[2041,"命运峰-第41层",2041,{"$f":"VLOOKUP(A145,[2]TowerInfoConfig!$H:$R,10,FALSE)","v":0},{"$f":"VLOOKUP(A145,[2]TowerInfoConfig!$H:$R,11,FALSE)","v":"1001;1403"},120,1,100,100]
[2042,"命运峰-第42层",2042,{"$f":"VLOOKUP(A146,[2]TowerInfoConfig!$H:$R,10,FALSE)","v":0},{"$f":"VLOOKUP(A146,[2]TowerInfoConfig!$H:$R,11,FALSE)","v":"1001;1702"},120,1,100,100]
[2043,"命运峰-第43层",2043,{"$f":"VLOOKUP(A147,[2]TowerInfoConfig!$H:$R,10,FALSE)","v":0},{"$f":"VLOOKUP(A147,[2]TowerInfoConfig!$H:$R,11,FALSE)","v":"1001;21012"},120,1,100,100]
[2044,"命运峰-第44层",2044,{"$f":"VLOOKUP(A148,[2]TowerInfoConfig!$H:$R,10,FALSE)","v":0},{"$f":"VLOOKUP(A148,[2]TowerInfoConfig!$H:$R,11,FALSE)","v":"1001;1314"},120,1,100,100]
[2045,"命运峰-第45层",2045,{"$f":"VLOOKUP(A149,[2]TowerInfoConfig!$H:$R,10,FALSE)","v":0},{"$f":"VLOOKUP(A149,[2]TowerInfoConfig!$H:$R,11,FALSE)","v":"1001;1403"},120,1,100,100]
[2046,"命运峰-第46层",2046,{"$f":"VLOOKUP(A150,[2]TowerInfoConfig!$H:$R,10,FALSE)","v":0},{"$f":"VLOOKUP(A150,[2]TowerInfoConfig!$H:$R,11,FALSE)","v":"1001;1702"},120,1,100,100]
[2047,"命运峰-第47层",2047,{"$f":"VLOOKUP(A151,[2]TowerInfoConfig!$H:$R,10,FALSE)","v":0},{"$f":"VLOOKUP(A151,[2]TowerInfoConfig!$H:$R,11,FALSE)","v":"1001;21012"},120,1,100,100]
[2048,"命运峰-第48层",2048,{"$f":"VLOOKUP(A152,[2]TowerInfoConfig!$H:$R,10,FALSE)","v":0},{"$f":"VLOOKUP(A152,[2]TowerInfoConfig!$H:$R,11,FALSE)","v":"1001;1315"},120,1,100,100]
[2049,"命运峰-第49层",2049,{"$f":"VLOOKUP(A153,[2]TowerInfoConfig!$H:$R,10,FALSE)","v":0},{"$f":"VLOOKUP(A153,[2]TowerInfoConfig!$H:$R,11,FALSE)","v":"1001;1403"},120,1,100,100]
[2050,"命运峰-第50层",2050,{"$f":"VLOOKUP(A154,[2]TowerInfoConfig!$H:$R,10,FALSE)","v":0},{"$f":"VLOOKUP(A154,[2]TowerInfoConfig!$H:$R,11,FALSE)","v":"1001;1702"},120,1,100,100]
[2051,"命运峰-第51层",2051,{"$f":"VLOOKUP(A155,[2]TowerInfoConfig!$H:$R,10,FALSE)","v":0},{"$f":"VLOOKUP(A155,[2]TowerInfoConfig!$H:$R,11,FALSE)","v":"1001;21012"},120,1,100,100]
[2052,"命运峰-第52层",2052,{"$f":"VLOOKUP(A156,[2]TowerInfoConfig!$H:$R,10,FALSE)","v":0},{"$f":"VLOOKUP(A156,[2]TowerInfoConfig!$H:$R,11,FALSE)","v":"1001;1316"},120,1,100,100]
[2053,"命运峰-第53层",2053,{"$f":"VLOOKUP(A157,[2]TowerInfoConfig!$H:$R,10,FALSE)","v":0},{"$f":"VLOOKUP(A157,[2]TowerInfoConfig!$H:$R,11,FALSE)","v":"1001;1403"},120,1,100,100]
[2054,"命运峰-第54层",2054,{"$f":"VLOOKUP(A158,[2]TowerInfoConfig!$H:$R,10,FALSE)","v":0},{"$f":"VLOOKUP(A158,[2]TowerInfoConfig!$H:$R,11,FALSE)","v":"1001;1702"},120,1,100,100]
[2055,"命运峰-第55层",2055,{"$f":"VLOOKUP(A159,[2]TowerInfoConfig!$H:$R,10,FALSE)","v":0},{"$f":"VLOOKUP(A159,[2]TowerInfoConfig!$H:$R,11,FALSE)","v":"1001;21012"},120,1,100,100]
[2056,"命运峰-第56层",2056,{"$f":"VLOOKUP(A160,[2]TowerInfoConfig!$H:$R,10,FALSE)","v":0},{"$f":"VLOOKUP(A160,[2]TowerInfoConfig!$H:$R,11,FALSE)","v":"1001;1317"},120,1,100,100]
[2057,"命运峰-第57层",2057,{"$f":"VLOOKUP(A161,[2]TowerInfoConfig!$H:$R,10,FALSE)","v":0},{"$f":"VLOOKUP(A161,[2]TowerInfoConfig!$H:$R,11,FALSE)","v":"1001;1403"},120,1,100,100]
[2058,"命运峰-第58层",2058,{"$f":"VLOOKUP(A162,[2]TowerInfoConfig!$H:$R,10,FALSE)","v":0},{"$f":"VLOOKUP(A162,[2]TowerInfoConfig!$H:$R,11,FALSE)","v":"1001;1702"},120,1,100,100]
[2059,"命运峰-第59层",2059,{"$f":"VLOOKUP(A163,[2]TowerInfoConfig!$H:$R,10,FALSE)","v":0},{"$f":"VLOOKUP(A163,[2]TowerInfoConfig!$H:$R,11,FALSE)","v":"1001;21012"},120,1,100,100]
[2060,"命运峰-第60层",2060,{"$f":"VLOOKUP(A164,[2]TowerInfoConfig!$H:$R,10,FALSE)","v":0},{"$f":"VLOOKUP(A164,[2]TowerInfoConfig!$H:$R,11,FALSE)","v":"1001;1318"},120,1,100,100]
[2061,"命运峰-第61层",2061,{"$f":"VLOOKUP(A165,[2]TowerInfoConfig!$H:$R,10,FALSE)","v":0},{"$f":"VLOOKUP(A165,[2]TowerInfoConfig!$H:$R,11,FALSE)","v":"1001;1403"},120,1,100,100]
[2062,"命运峰-第62层",2062,{"$f":"VLOOKUP(A166,[2]TowerInfoConfig!$H:$R,10,FALSE)","v":0},{"$f":"VLOOKUP(A166,[2]TowerInfoConfig!$H:$R,11,FALSE)","v":"1001;1702"},120,1,100,100]
[2063,"命运峰-第63层",2063,{"$f":"VLOOKUP(A167,[2]TowerInfoConfig!$H:$R,10,FALSE)","v":0},{"$f":"VLOOKUP(A167,[2]TowerInfoConfig!$H:$R,11,FALSE)","v":"1001;21012"},120,1,100,100]
[2064,"命运峰-第64层",2064,{"$f":"VLOOKUP(A168,[2]TowerInfoConfig!$H:$R,10,FALSE)","v":0},{"$f":"VLOOKUP(A168,[2]TowerInfoConfig!$H:$R,11,FALSE)","v":"1001;1319"},120,1,100,100]
[2065,"命运峰-第65层",2065,{"$f":"VLOOKUP(A169,[2]TowerInfoConfig!$H:$R,10,FALSE)","v":0},{"$f":"VLOOKUP(A169,[2]TowerInfoConfig!$H:$R,11,FALSE)","v":"1001;1403"},120,1,100,100]
[2066,"命运峰-第66层",2066,{"$f":"VLOOKUP(A170,[2]TowerInfoConfig!$H:$R,10,FALSE)","v":0},{"$f":"VLOOKUP(A170,[2]TowerInfoConfig!$H:$R,11,FALSE)","v":"1001;1702"},120,1,100,100]
[2067,"命运峰-第67层",2067,{"$f":"VLOOKUP(A171,[2]TowerInfoConfig!$H:$R,10,FALSE)","v":0},{"$f":"VLOOKUP(A171,[2]TowerInfoConfig!$H:$R,11,FALSE)","v":"1001;21012"},120,1,100,100]
[2068,"命运峰-第68层",{"$f":"A172","v":2068},{"$f":"VLOOKUP(A172,[2]TowerInfoConfig!$H:$R,10,FALSE)","v":0},{"$f":"VLOOKUP(A172,[2]TowerInfoConfig!$H:$R,11,FALSE)","v":"1001;1320"},120,1,100,100]
[2069,"命运峰-第69层",2069,{"$f":"VLOOKUP(A173,[2]TowerInfoConfig!$H:$R,10,FALSE)","v":0},{"$f":"VLOOKUP(A173,[2]TowerInfoConfig!$H:$R,11,FALSE)","v":"1001;1404"},120,1,100,100]
[2070,"命运峰-第70层",2070,{"$f":"VLOOKUP(A174,[2]TowerInfoConfig!$H:$R,10,FALSE)","v":0},{"$f":"VLOOKUP(A174,[2]TowerInfoConfig!$H:$R,11,FALSE)","v":"1001;1702"},120,1,100,100]
[2071,"命运峰-第71层",2071,{"$f":"VLOOKUP(A175,[2]TowerInfoConfig!$H:$R,10,FALSE)","v":0},{"$f":"VLOOKUP(A175,[2]TowerInfoConfig!$H:$R,11,FALSE)","v":"1001;21012"},120,1,100,100]
[2072,"命运峰-第72层",2072,{"$f":"VLOOKUP(A176,[2]TowerInfoConfig!$H:$R,10,FALSE)","v":0},{"$f":"VLOOKUP(A176,[2]TowerInfoConfig!$H:$R,11,FALSE)","v":"1001;1321"},120,1,100,100]
[2073,"命运峰-第73层",2073,{"$f":"VLOOKUP(A177,[2]TowerInfoConfig!$H:$R,10,FALSE)","v":0},{"$f":"VLOOKUP(A177,[2]TowerInfoConfig!$H:$R,11,FALSE)","v":"1001;1404"},120,1,100,100]
[2074,"命运峰-第74层",2074,{"$f":"VLOOKUP(A178,[2]TowerInfoConfig!$H:$R,10,FALSE)","v":0},{"$f":"VLOOKUP(A178,[2]TowerInfoConfig!$H:$R,11,FALSE)","v":"1001;1702"},120,1,100,100]
[2075,"命运峰-第75层",2075,{"$f":"VLOOKUP(A179,[2]TowerInfoConfig!$H:$R,10,FALSE)","v":0},{"$f":"VLOOKUP(A179,[2]TowerInfoConfig!$H:$R,11,FALSE)","v":"1001;21012"},120,1,100,100]
[2076,"命运峰-第76层",2076,{"$f":"VLOOKUP(A180,[2]TowerInfoConfig!$H:$R,10,FALSE)","v":0},{"$f":"VLOOKUP(A180,[2]TowerInfoConfig!$H:$R,11,FALSE)","v":"1001;1322"},120,1,100,100]
[2077,"命运峰-第77层",2077,{"$f":"VLOOKUP(A181,[2]TowerInfoConfig!$H:$R,10,FALSE)","v":0},{"$f":"VLOOKUP(A181,[2]TowerInfoConfig!$H:$R,11,FALSE)","v":"1001;1404"},120,1,100,100]
[2078,"命运峰-第78层",2078,{"$f":"VLOOKUP(A182,[2]TowerInfoConfig!$H:$R,10,FALSE)","v":0},{"$f":"VLOOKUP(A182,[2]TowerInfoConfig!$H:$R,11,FALSE)","v":"1001;1702"},120,1,100,100]
[2079,"命运峰-第79层",2079,{"$f":"VLOOKUP(A183,[2]TowerInfoConfig!$H:$R,10,FALSE)","v":0},{"$f":"VLOOKUP(A183,[2]TowerInfoConfig!$H:$R,11,FALSE)","v":"1001;21012"},120,1,100,100]
[2080,"命运峰-第80层",2080,{"$f":"VLOOKUP(A184,[2]TowerInfoConfig!$H:$R,10,FALSE)","v":0},{"$f":"VLOOKUP(A184,[2]TowerInfoConfig!$H:$R,11,FALSE)","v":"1001;1323"},120,1,100,100]
[2081,"命运峰-第81层",2081,{"$f":"VLOOKUP(A185,[2]TowerInfoConfig!$H:$R,10,FALSE)","v":0},{"$f":"VLOOKUP(A185,[2]TowerInfoConfig!$H:$R,11,FALSE)","v":"1001;1404"},120,1,100,100]
[2082,"命运峰-第82层",2082,{"$f":"VLOOKUP(A186,[2]TowerInfoConfig!$H:$R,10,FALSE)","v":0},{"$f":"VLOOKUP(A186,[2]TowerInfoConfig!$H:$R,11,FALSE)","v":"1001;1702"},120,1,100,100]
[2083,"命运峰-第83层",2083,{"$f":"VLOOKUP(A187,[2]TowerInfoConfig!$H:$R,10,FALSE)","v":0},{"$f":"VLOOKUP(A187,[2]TowerInfoConfig!$H:$R,11,FALSE)","v":"1001;21012"},120,1,100,100]
[2084,"命运峰-第84层",2084,{"$f":"VLOOKUP(A188,[2]TowerInfoConfig!$H:$R,10,FALSE)","v":0},{"$f":"VLOOKUP(A188,[2]TowerInfoConfig!$H:$R,11,FALSE)","v":"1001;1324"},120,1,100,100]
[2085,"命运峰-第85层",2085,{"$f":"VLOOKUP(A189,[2]TowerInfoConfig!$H:$R,10,FALSE)","v":0},{"$f":"VLOOKUP(A189,[2]TowerInfoConfig!$H:$R,11,FALSE)","v":"1001;1404"},120,1,100,100]
[2086,"命运峰-第86层",{"$f":"A190","v":2086},{"$f":"VLOOKUP(A190,[2]TowerInfoConfig!$H:$R,10,FALSE)","v":0},{"$f":"VLOOKUP(A190,[2]TowerInfoConfig!$H:$R,11,FALSE)","v":"1001;1702"},120,1,100,100]
[2087,"命运峰-第87层",2087,{"$f":"VLOOKUP(A191,[2]TowerInfoConfig!$H:$R,10,FALSE)","v":0},{"$f":"VLOOKUP(A191,[2]TowerInfoConfig!$H:$R,11,FALSE)","v":"1001;21012"},120,1,100,100]
[2088,"命运峰-第88层",2088,{"$f":"VLOOKUP(A192,[2]TowerInfoConfig!$H:$R,10,FALSE)","v":0},{"$f":"VLOOKUP(A192,[2]TowerInfoConfig!$H:$R,11,FALSE)","v":"1001;1325"},120,1,100,100]
[2089,"命运峰-第89层",2089,{"$f":"VLOOKUP(A193,[2]TowerInfoConfig!$H:$R,10,FALSE)","v":0},{"$f":"VLOOKUP(A193,[2]TowerInfoConfig!$H:$R,11,FALSE)","v":"1001;1404"},120,1,100,100]
[2090,"命运峰-第90层",2090,{"$f":"VLOOKUP(A194,[2]TowerInfoConfig!$H:$R,10,FALSE)","v":0},{"$f":"VLOOKUP(A194,[2]TowerInfoConfig!$H:$R,11,FALSE)","v":"1001;1702"},120,1,100,100]
[2091,"命运峰-第91层",2091,{"$f":"VLOOKUP(A195,[2]TowerInfoConfig!$H:$R,10,FALSE)","v":0},{"$f":"VLOOKUP(A195,[2]TowerInfoConfig!$H:$R,11,FALSE)","v":"1001;21012"},120,1,100,100]
[2092,"命运峰-第92层",2092,{"$f":"VLOOKUP(A196,[2]TowerInfoConfig!$H:$R,10,FALSE)","v":0},{"$f":"VLOOKUP(A196,[2]TowerInfoConfig!$H:$R,11,FALSE)","v":"1001;1326"},120,1,100,100]
[2093,"命运峰-第93层",2093,{"$f":"VLOOKUP(A197,[2]TowerInfoConfig!$H:$R,10,FALSE)","v":0},{"$f":"VLOOKUP(A197,[2]TowerInfoConfig!$H:$R,11,FALSE)","v":"1001;1703"},120,1,100,100]
[2094,"命运峰-第94层",2094,{"$f":"VLOOKUP(A198,[2]TowerInfoConfig!$H:$R,10,FALSE)","v":0},{"$f":"VLOOKUP(A198,[2]TowerInfoConfig!$H:$R,11,FALSE)","v":"1001;1327"},120,1,100,100]
[2095,"命运峰-第95层",2095,{"$f":"VLOOKUP(A199,[2]TowerInfoConfig!$H:$R,10,FALSE)","v":0},{"$f":"VLOOKUP(A199,[2]TowerInfoConfig!$H:$R,11,FALSE)","v":"1001;1703"},120,1,100,100]
[2096,"命运峰-第96层",2096,{"$f":"VLOOKUP(A200,[2]TowerInfoConfig!$H:$R,10,FALSE)","v":0},{"$f":"VLOOKUP(A200,[2]TowerInfoConfig!$H:$R,11,FALSE)","v":"1001;1328"},120,1,100,100]
[2097,"命运峰-第97层",2097,{"$f":"VLOOKUP(A201,[2]TowerInfoConfig!$H:$R,10,FALSE)","v":0},{"$f":"VLOOKUP(A201,[2]TowerInfoConfig!$H:$R,11,FALSE)","v":"1001;1703"},120,1,100,100]
[2098,"命运峰-第98层",2098,{"$f":"VLOOKUP(A202,[2]TowerInfoConfig!$H:$R,10,FALSE)","v":0},{"$f":"VLOOKUP(A202,[2]TowerInfoConfig!$H:$R,11,FALSE)","v":"1001;1329"},120,1,100,100]
[2099,"命运峰-第99层",2099,{"$f":"VLOOKUP(A203,[2]TowerInfoConfig!$H:$R,10,FALSE)","v":0},{"$f":"VLOOKUP(A203,[2]TowerInfoConfig!$H:$R,11,FALSE)","v":"1001;1703"},120,1,100,100]
[2100,"命运峰-第100层",2100,{"$f":"VLOOKUP(A204,[2]TowerInfoConfig!$H:$R,10,FALSE)","v":0},{"$f":"VLOOKUP(A204,[2]TowerInfoConfig!$H:$R,11,FALSE)","v":"1001;1330"},120,1,100,100]
[]
[5011,{"$f":"_xlfn.TEXTJOIN(\"-\",1,M206:N206)","v":"通用-灵石掉落-品质1"},{"$f":"A206","v":5011},-1,-1,120,1,100,100,null,null,null,"通用-灵石掉落","品质1",null,-1,103]
[5012,"通用-灵石掉落-品质2",5012,-1,-1,120,1,100,100,null,null,null,"通用-灵石掉落","品质2",null,-1,112]
[5013,"通用-灵石掉落-品质3",5013,-1,-1,120,1,100,100,null,null,null,"通用-灵石掉落","品质3",null,-1,121]
[5014,"通用-灵石掉落-品质4",5014,-1,-1,120,1,100,100,null,null,null,"通用-灵石掉落","品质4",null,-1,130]
[5015,"通用-灵石掉落-品质5",5015,-1,-1,120,1,100,100,null,null,null,"通用-灵石掉落","品质5",null,-1,139]
[5016,{"$f":"_xlfn.TEXTJOIN(\"-\",1,M211:N211)","v":"通用-妖丹掉落-品质1"},{"$f":"A211","v":5016},-1,-1,120,1,100,100,null,null,null,"通用-妖丹掉落","品质1",null,-1,106]
[5017,"通用-妖丹掉落-品质2",5017,-1,-1,120,1,100,100,null,null,null,"通用-妖丹掉落","品质2",null,-1,115]
[5018,"通用-妖丹掉落-品质3",5018,-1,-1,120,1,100,100,null,null,null,"通用-妖丹掉落","品质3",null,-1,124]
[5019,"通用-妖丹掉落-品质4",5019,-1,-1,120,1,100,100,null,null,null,"通用-妖丹掉落","品质4",null,-1,133]
[5020,"通用-妖丹掉落-品质5",5020,-1,-1,120,1,100,100,null,null,null,"通用-妖丹掉落","品质5",null,-1,142]
[5021,{"$f":"_xlfn.TEXTJOIN(\"-\",1,M216:N216)","v":"通用-渡劫动态道具掉落-品质1"},{"$f":"A216","v":5021},-1,-1,120,1,100,100,null,null,null,"通用-渡劫动态道具掉落","品质1",null,-1,107]
[5022,"通用-渡劫动态道具掉落-品质2",5022,-1,-1,120,1,100,100,null,null,null,"通用-渡劫动态道具掉落","品质2",null,-1,116]
[5023,"通用-渡劫动态道具掉落-品质3",5023,-1,-1,120,1,100,100,null,null,null,"通用-渡劫动态道具掉落","品质3",null,-1,125]
[5024,"通用-渡劫动态道具掉落-品质4",5024,-1,-1,120,1,100,100,null,null,null,"通用-渡劫动态道具掉落","品质4",null,-1,134]
[5025,"通用-渡劫动态道具掉落-品质5",5025,-1,-1,120,1,100,100,null,null,null,"通用-渡劫动态道具掉落","品质5",null,-1,143]

{"sheet":"GroupConfig","index":1,"n_rows":223,"n_cols":26,"rows_kept":223,"cut":false,"hidden":false,"merged":[]}
["ID",null,"GroupMonsterLevel","GroupMonster","hpQiangDu","attQiangDu","duipingQiangDu","levelAdd"]
["int",null,"int[]","int[]","int[]","int[]","int[]","int[]"]
[]
["组ID","常用阵容ID","具体怪物等级\n-1代表跟随玩家等级\n-1后面可填动态修正等级","每组具体怪","每个怪的比例强度\n一个都不填就是默认强度","攻击强度","对拼强度","等级额外添加值","怪物1","怪物2","怪物3","怪物1生存强度","怪物2生存强度","怪物3生存强度","怪物1攻击强度","怪物2攻击强度","怪物3攻击强度","怪物1对拼强度","怪物2对拼强度","怪物3对拼强度","怪物1等级降低","怪物2等级降低","怪物3等级降低","怪物1","怪物2","怪物3"]
[100001,100001,-1,{"$f":"_xlfn.TEXTJOIN(\";\",1,I5:K5)","v":"1002"},{"$f":"_xlfn.TEXTJOIN(\";\",1,L5:N5)","v":""},{"$f":"_xlfn.TEXTJOIN(\";\",1,O5:Q5)","v":""},{"$f":"_xlfn.TEXTJOIN(\";\",1,R5:T5)","v":""},{"$f":"_xlfn.TEXTJOIN(\";\",1,U5:W5)","v":""},1002,{"$nulls":14},{"$f":"IF(I5=\"\",\"\",VLOOKUP(I5,[3]HeroModelConfig!$A:$D,4,FALSE))","v":"蒙面男子"},{"$f":"IF(J5=\"\",\"\",VLOOKUP(J5,[3]HeroModelConfig!$A:$D,4,FALSE))","v":""},{"$f":"IF(K5=\"\",\"\",VLOOKUP(K5,[3]HeroModelConfig!$A:$D,4,FALSE))","v":""}]
[100002,100002,-1,{"$f":"_xlfn.TEXTJOIN(\";\",1,I6:K6)","v":"1006"},{"$f":"_xlfn.TEXTJOIN(\";\",1,L6:N6)","v":""},{"$f":"_xlfn.TEXTJOIN(\";\",1,O6:Q6)","v":""},{"$f":"_xlfn.TEXTJOIN(\";\",1,R6:T6)","v":""},{"$f":"_xlfn.TEXTJOIN(\";\",1,U6:W6)","v":""},1006,{"$nulls":14},{"$f":"IF(I6=\"\",\"\",VLOOKUP(I6,[3]HeroModelConfig!$A:$D,4,FALSE))","v":"飞鹤"},{"$f":"IF(J6=\"\",\"\",VLOOKUP(J6,[3]HeroModelConfig!$A:$D,4,FALSE))","v":""},{"$f":"IF(K6=\"\",\"\",VLOOKUP(K6,[3]HeroModelConfig!$A:$D,4,FALSE))","v":""}]
[100003,100003,-1,"1003","","","","",1003,{"$nulls":14},{"$f":"IF(I7=\"\",\"\",VLOOKUP(I7,[3]HeroModelConfig!$A:$D,4,FALSE))","v":"蒙面女子"},{"$f":"IF(J7=\"\",\"\",VLOOKUP(J7,[3]HeroModelConfig!$A:$D,4,FALSE))","v":""},{"$f":"IF(K7=\"\",\"\",VLOOKUP(K7,[3]HeroModelConfig!$A:$D,4,FALSE))","v":""}]
[100004,100004,-1,"7002","","","","",7002,{"$nulls":14},{"$f":"IF(I8=\"\",\"\",VLOOKUP(I8,[3]HeroModelConfig!$A:$D,4,FALSE))","v":"突破-心魔1"},{"$f":"IF(J8=\"\",\"\",VLOOKUP(J8,[3]HeroModelConfig!$A:$D,4,FALSE))","v":""},{"$f":"IF(K8=\"\",\"\",VLOOKUP(K8,[3]HeroModelConfig!$A:$D,4,FALSE))","v":""}]
[100005,100005,-1,"7009","","","","",7009,{"$nulls":14},{"$f":"IF(I9=\"\",\"\",VLOOKUP(I9,[3]HeroModelConfig!$A:$D,4,FALSE))","v":"突破-心魔2"},{"$f":"IF(J9=\"\",\"\",VLOOKUP(J9,[3]HeroModelConfig!$A:$D,4,FALSE))","v":""},{"$f":"IF(K9=\"\",\"\",VLOOKUP(K9,[3]HeroModelConfig!$A:$D,4,FALSE))","v":""}]
[100006,100006,-1,"7010","","","","",7010,{"$nulls":14},{"$f":"IF(I10=\"\",\"\",VLOOKUP(I10,[3]HeroModelConfig!$A:$D,4,FALSE))","v":"突破-心魔3"},{"$f":"IF(J10=\"\",\"\",VLOOKUP(J10,[3]HeroModelConfig!$A:$D,4,FALSE))","v":""},{"$f":"IF(K10=\"\",\"\",VLOOKUP(K10,[3]HeroModelConfig!$A:$D,4,FALSE))","v":""}]
[100007,100007,-1,"1003;1002","90;30","77;26","75;25","0;0",1003,1002,null,90,30,null,77,26,null,75,25,null,0,0,null,{"$f":"IF(I11=\"\",\"\",VLOOKUP(I11,[3]HeroModelConfig!$A:$D,4,FALSE))","v":"蒙面女子"},{"$f":"IF(J11=\"\",\"\",VLOOKUP(J11,[3]HeroModelConfig!$A:$D,4,FALSE))","v":"蒙面男子"},{"$f":"IF(K11=\"\",\"\",VLOOKUP(K11,[3]HeroModelConfig!$A:$D,4,FALSE))","v":""}]
[100008,100008,-1,"1004;1006","90;30","77;26","75;25","0;0",1004,1006,null,90,30,null,77,26,null,75,25,null,0,0,null,{"$f":"IF(I12=\"\",\"\",VLOOKUP(I12,[3]HeroModelConfig!$A:$D,4,FALSE))","v":"蒙面女子"},{"$f":"IF(J12=\"\",\"\",VLOOKUP(J12,[3]HeroModelConfig!$A:$D,4,FALSE))","v":"飞鹤"},{"$f":"IF(K12=\"\",\"\",VLOOKUP(K12,[3]HeroModelConfig!$A:$D,4,FALSE))","v":""}]
[100009,100009,-1,"1005","","","","",1005,{"$nulls":14},{"$f":"IF(I13=\"\",\"\",VLOOKUP(I13,[3]HeroModelConfig!$A:$D,4,FALSE))","v":"树精"},{"$f":"IF(J13=\"\",\"\",VLOOKUP(J13,[3]HeroModelConfig!$A:$D,4,FALSE))","v":""},{"$f":"IF(K13=\"\",\"\",VLOOKUP(K13,[3]HeroModelConfig!$A:$D,4,FALSE))","v":""}]
[null,null,null,"","","","","",{"$nulls":15},{"$f":"IF(I14=\"\",\"\",VLOOKUP(I14,[3]HeroModelConfig!$A:$D,4,FALSE))","v":""},{"$f":"IF(J14=\"\",\"\",VLOOKUP(J14,[3]HeroModelConfig!$A:$D,4,FALSE))","v":""},{"$f":"IF(K14=\"\",\"\",VLOOKUP(K14,[3]HeroModelConfig!$A:$D,4,FALSE))","v":""}]
[1002,{"$f":"LevelbattleConfig!B11","v":"主线-击败结界兽"},{"$f":"VLOOKUP(A15,LevelbattleConfig!A:R,18,FALSE)","v":6},"7001","","","","",7001,{"$nulls":14},{"$f":"IF(I15=\"\",\"\",VLOOKUP(I15,[3]HeroModelConfig!$A:$D,4,FALSE))","v":"凤凰"},{"$f":"IF(J15=\"\",\"\",VLOOKUP(J15,[3]HeroModelConfig!$A:$D,4,FALSE))","v":""},{"$f":"IF(K15=\"\",\"\",VLOOKUP(K15,[3]HeroModelConfig!$A:$D,4,FALSE))","v":""}]
[{"$f":"A15+1","v":1003},{"$f":"LevelbattleConfig!B12","v":"主线-击败痴道人"},{"$f":"VLOOKUP(A16,LevelbattleConfig!A:R,18,FALSE)","v":16},"7004","","","","",7004,{"$nulls":14},{"$f":"IF(I16=\"\",\"\",VLOOKUP(I16,[3]HeroModelConfig!$A:$D,4,FALSE))","v":"痴道人"},{"$f":"IF(J16=\"\",\"\",VLOOKUP(J16,[3]HeroModelConfig!$A:$D,4,FALSE))","v":""},{"$f":"IF(K16=\"\",\"\",VLOOKUP(K16,[3]HeroModelConfig!$A:$D,4,FALSE))","v":""}]
[{"$f":"A16+1","v":1004},{"$f":"LevelbattleConfig!B13","v":"主线-妖兽横行"},{"$f":"VLOOKUP(A17,LevelbattleConfig!A:R,18,FALSE)","v":25},"7006","","","","",7006,{"$nulls":14},{"$f":"IF(I17=\"\",\"\",VLOOKUP(I17,[3]HeroModelConfig!$A:$D,4,FALSE))","v":"蜘蛛"},{"$f":"IF(J17=\"\",\"\",VLOOKUP(J17,[3]HeroModelConfig!$A:$D,4,FALSE))","v":""},{"$f":"IF(K17=\"\",\"\",VLOOKUP(K17,[3]HeroModelConfig!$A:$D,4,FALSE))","v":""}]
[1005,{"$f":"LevelbattleConfig!B14","v":"主线-击败后山小妖"},{"$f":"VLOOKUP(A18,LevelbattleConfig!A:R,18,FALSE)","v":46},"5001","","","","",5001,{"$nulls":14},{"$f":"IF(I18=\"\",\"\",VLOOKUP(I18,[3]HeroModelConfig!$A:$D,4,FALSE))","v":"金修精英"},{"$f":"IF(J18=\"\",\"\",VLOOKUP(J18,[3]HeroModelConfig!$A:$D,4,FALSE))","v":""},{"$f":"IF(K18=\"\",\"\",VLOOKUP(K18,[3]HeroModelConfig!$A:$D,4,FALSE))","v":""}]
[1006,{"$f":"LevelbattleConfig!B15","v":"主线-击败夜袭的妖兽"},{"$f":"VLOOKUP(A19,LevelbattleConfig!A:R,18,FALSE)","v":51},"5006","","","","",5006,{"$nulls":14},{"$f":"IF(I19=\"\",\"\",VLOOKUP(I19,[3]HeroModelConfig!$A:$D,4,FALSE))","v":"鼠先锋 "},{"$f":"IF(J19=\"\",\"\",VLOOKUP(J19,[3]HeroModelConfig!$A:$D,4,FALSE))","v":""},{"$f":"IF(K19=\"\",\"\",VLOOKUP(K19,[3]HeroModelConfig!$A:$D,4,FALSE))","v":""}]
[1007,{"$f":"LevelbattleConfig!B16","v":"主线-击败峰顶的妖王"},{"$f":"VLOOKUP(A20,LevelbattleConfig!A:R,18,FALSE)","v":56},"5007","","","","",5007,{"$nulls":14},{"$f":"IF(I20=\"\",\"\",VLOOKUP(I20,[3]HeroModelConfig!$A:$D,4,FALSE))","v":"穷奇"},{"$f":"IF(J20=\"\",\"\",VLOOKUP(J20,[3]HeroModelConfig!$A:$D,4,FALSE))","v":""},{"$f":"IF(K20=\"\",\"\",VLOOKUP(K20,[3]HeroModelConfig!$A:$D,4,FALSE))","v":""}]
[1008,{"$f":"LevelbattleConfig!B17","v":"主线-击败仙山的阵眼妖兽"},{"$f":"VLOOKUP(A21,LevelbattleConfig!A:R,18,FALSE)","v":86},"7004","","","","",7004,{"$nulls":14},{"$f":"IF(I21=\"\",\"\",VLOOKUP(I21,[3]HeroModelConfig!$A:$D,4,FALSE))","v":"痴道人"},{"$f":"IF(J21=\"\",\"\",VLOOKUP(J21,[3]HeroModelConfig!$A:$D,4,FALSE))","v":""},{"$f":"IF(K21=\"\",\"\",VLOOKUP(K21,[3]HeroModelConfig!$A:$D,4,FALSE))","v":""}]
[1009,{"$f":"LevelbattleConfig!B18","v":"主线-击杀灵兽获得天肥"},{"$f":"VLOOKUP(A22,LevelbattleConfig!A:R,18,FALSE)","v":101},"7001","","","","",7001,{"$nulls":14},{"$f":"IF(I22=\"\",\"\",VLOOKUP(I22,[3]HeroModelConfig!$A:$D,4,FALSE))","v":"凤凰"},{"$f":"IF(J22=\"\",\"\",VLOOKUP(J22,[3]HeroModelConfig!$A:$D,4,FALSE))","v":""},{"$f":"IF(K22=\"\",\"\",VLOOKUP(K22,[3]HeroModelConfig!$A:$D,4,FALSE))","v":""}]
[1010,{"$f":"LevelbattleConfig!B19","v":"主线-击败小麻雀的幻影"},{"$f":"VLOOKUP(A23,LevelbattleConfig!A:R,18,FALSE)","v":121},"7001","","","","",7001,{"$nulls":14},{"$f":"IF(I23=\"\",\"\",VLOOKUP(I23,[3]HeroModelConfig!$A:$D,4,FALSE))","v":"凤凰"},{"$f":"IF(J23=\"\",\"\",VLOOKUP(J23,[3]HeroModelConfig!$A:$D,4,FALSE))","v":""},{"$f":"IF(K23=\"\",\"\",VLOOKUP(K23,[3]HeroModelConfig!$A:$D,4,FALSE))","v":""}]
[{"$f":"A23+1","v":1011},{"$f":"LevelbattleConfig!B20","v":"主线-击败痴道人的幻影"},{"$f":"VLOOKUP(A24,LevelbattleConfig!A:R,18,FALSE)","v":121},"7001","","","","",7001,{"$nulls":14},{"$f":"IF(I24=\"\",\"\",VLOOKUP(I24,[3]HeroModelConfig!$A:$D,4,FALSE))","v":"凤凰"},{"$f":"IF(J24=\"\",\"\",VLOOKUP(J24,[3]HeroModelConfig!$A:$D,4,FALSE))","v":""},{"$f":"IF(K24=\"\",\"\",VLOOKUP(K24,[3]HeroModelConfig!$A:$D,4,FALSE))","v":""}]
[1012,{"$f":"LevelbattleConfig!B21","v":"主线-樗木之灵的幻影"},{"$f":"VLOOKUP(A25,LevelbattleConfig!A:R,18,FALSE)","v":121},"7005","","","","",7005,{"$nulls":14},{"$f":"IF(I25=\"\",\"\",VLOOKUP(I25,[3]HeroModelConfig!$A:$D,4,FALSE))","v":"樗木之灵"},{"$f":"IF(J25=\"\",\"\",VLOOKUP(J25,[3]HeroModelConfig!$A:$D,4,FALSE))","v":""},{"$f":"IF(K25=\"\",\"\",VLOOKUP(K25,[3]HeroModelConfig!$A:$D,4,FALSE))","v":""}]
[1013,{"$f":"LevelbattleConfig!B22","v":"主线-击败心魔"},{"$f":"VLOOKUP(A26,LevelbattleConfig!A:R,18,FALSE)","v":141},"5007","","","","",5007,{"$nulls":14},{"$f":"IF(I26=\"\",\"\",VLOOKUP(I26,[3]HeroModelConfig!$A:$D,4,FALSE))","v":"穷奇"},{"$f":"IF(J26=\"\",\"\",VLOOKUP(J26,[3]HeroModelConfig!$A:$D,4,FALSE))","v":""},{"$f":"IF(K26=\"\",\"\",VLOOKUP(K26,[3]HeroModelConfig!$A:$D,4,FALSE))","v":""}]
[1014,{"$f":"LevelbattleConfig!B23","v":"主线-击败北海妖兽2"},{"$f":"VLOOKUP(A27,LevelbattleConfig!A:R,18,FALSE)&\";\"&VLOOKUP(A27,LevelbattleConfig!A:R,18,FALSE)","v":"151;151"},"5006;1006","80;40","72;36","67;33","0;0",5006,1006,null,80,40,null,72,36,null,67,33,null,0,0,null,{"$f":"IF(I27=\"\",\"\",VLOOKUP(I27,[3]HeroModelConfig!$A:$D,4,FALSE))","v":"鼠先锋 "},{"$f":"IF(J27=\"\",\"\",VLOOKUP(J27,[3]HeroModelConfig!$A:$D,4,FALSE))","v":"飞鹤"},{"$f":"IF(K27=\"\",\"\",VLOOKUP(K27,[3]HeroModelConfig!$A:$D,4,FALSE))","v":""}]
[1015,{"$f":"LevelbattleConfig!B24","v":"主线-击败北海妖兽1"},{"$f":"VLOOKUP(A28,LevelbattleConfig!A:R,18,FALSE)&\";\"&VLOOKUP(A28,LevelbattleConfig!A:R,18,FALSE)","v":"25;25"},{"$f":"_xlfn.TEXTJOIN(\";\",1,I28:K28)","v":"5007;1006"},{"$f":"_xlfn.TEXTJOIN(\";\",1,L28:N28)","v":"80;40"},{"$f":"_xlfn.TEXTJOIN(\";\",1,O28:Q28)","v":"72;36"},{"$f":"_xlfn.TEXTJOIN(\";\",1,R28:T28)","v":"67;33"},{"$f":"_xlfn.TEXTJOIN(\";\",1,U28:W28)","v":"0;0"},5007,1006,null,80,40,null,72,36,null,67,33,null,0,0,null,{"$f":"IF(I28=\"\",\"\",VLOOKUP(I28,[3]HeroModelConfig!$A:$D,4,FALSE))","v":"穷奇"},{"$f":"IF(J28=\"\",\"\",VLOOKUP(J28,[3]HeroModelConfig!$A:$D,4,FALSE))","v":"飞鹤"},{"$f":"IF(K28=\"\",\"\",VLOOKUP(K28,[3]HeroModelConfig!$A:$D,4,FALSE))","v":""}]
[1016,{"$f":"LevelbattleConfig!B25","v":"主线-与樗木之灵切磋"},{"$f":"VLOOKUP(A29,LevelbattleConfig!A:R,18,FALSE)","v":69},{"$f":"_xlfn.TEXTJOIN(\";\",1,I29:K29)","v":"7005"},{"$f":"_xlfn.TEXTJOIN(\";\",1,L29:N29)","v":""},{"$f":"_xlfn.TEXTJOIN(\";\",1,O29:Q29)","v":""},{"$f":"_xlfn.TEXTJOIN(\";\",1,R29:T29)","v":""},{"$f":"_xlfn.TEXTJOIN(\";\",1,U29:W29)","v":""},7005,{"$nulls":14},{"$f":"IF(I29=\"\",\"\",VLOOKUP(I29,[3]HeroModelConfig!$A:$D,4,FALSE))","v":"樗木之灵"},{"$f":"IF(J29=\"\",\"\",VLOOKUP(J29,[3]HeroModelConfig!$A:$D,4,FALSE))","v":""},{"$f":"IF(K29=\"\",\"\",VLOOKUP(K29,[3]HeroModelConfig!$A:$D,4,FALSE))","v":""}]
[null,null,null,"","","","","",{"$nulls":15},{"$f":"IF(I30=\"\",\"\",VLOOKUP(I30,[3]HeroModelConfig!$A:$D,4,FALSE))","v":""},{"$f":"IF(J30=\"\",\"\",VLOOKUP(J30,[3]HeroModelConfig!$A:$D,4,FALSE))","v":""},{"$f":"IF(K30=\"\",\"\",VLOOKUP(K30,[3]HeroModelConfig!$A:$D,4,FALSE))","v":""}]
[{"$nulls":23},{"$f":"IF(I31=\"\",\"\",VLOOKUP(I31,[3]HeroModelConfig!$A:$D,4,FALSE))","v":""},{"$f":"IF(J31=\"\",\"\",VLOOKUP(J31,[3]HeroModelConfig!$A:$D,4,FALSE))","v":""},{"$f":"IF(K31=\"\",\"\",VLOOKUP(K31,[3]HeroModelConfig!$A:$D,4,FALSE))","v":""}]
[{"$nulls":23},{"$f":"IF(I32=\"\",\"\",VLOOKUP(I32,[3]HeroModelConfig!$A:$D,4,FALSE))","v":""},{"$f":"IF(J32=\"\",\"\",VLOOKUP(J32,[3]HeroModelConfig!$A:$D,4,FALSE))","v":""},{"$f":"IF(K32=\"\",\"\",VLOOKUP(K32,[3]HeroModelConfig!$A:$D,4,FALSE))","v":""}]
[{"$nulls":23},{"$f":"IF(I33=\"\",\"\",VLOOKUP(I33,[3]HeroModelConfig!$A:$D,4,FALSE))","v":""},{"$f":"IF(J33=\"\",\"\",VLOOKUP(J33,[3]HeroModelConfig!$A:$D,4,FALSE))","v":""},{"$f":"IF(K33=\"\",\"\",VLOOKUP(K33,[3]HeroModelConfig!$A:$D,4,FALSE))","v":""}]
[{"$nulls":23},{"$f":"IF(I34=\"\",\"\",VLOOKUP(I34,[3]HeroModelConfig!$A:$D,4,FALSE))","v":""},{"$f":"IF(J34=\"\",\"\",VLOOKUP(J34,[3]HeroModelConfig!$A:$D,4,FALSE))","v":""},{"$f":"IF(K34=\"\",\"\",VLOOKUP(K34,[3]HeroModelConfig!$A:$D,4,FALSE))","v":""}]
[{"$nulls":23},{"$f":"IF(I35=\"\",\"\",VLOOKUP(I35,[3]HeroModelConfig!$A:$D,4,FALSE))","v":""},{"$f":"IF(J35=\"\",\"\",VLOOKUP(J35,[3]HeroModelConfig!$A:$D,4,FALSE))","v":""},{"$f":"IF(K35=\"\",\"\",VLOOKUP(K35,[3]HeroModelConfig!$A:$D,4,FALSE))","v":""}]
[{"$nulls":23},{"$f":"IF(I36=\"\",\"\",VLOOKUP(I36,[3]HeroModelConfig!$A:$D,4,FALSE))","v":""},{"$f":"IF(J36=\"\",\"\",VLOOKUP(J36,[3]HeroModelConfig!$A:$D,4,FALSE))","v":""},{"$f":"IF(K36=\"\",\"\",VLOOKUP(K36,[3]HeroModelConfig!$A:$D,4,FALSE))","v":""}]
[{"$nulls":23},{"$f":"IF(I37=\"\",\"\",VLOOKUP(I37,[3]HeroModelConfig!$A:$D,4,FALSE))","v":""},{"$f":"IF(J37=\"\",\"\",VLOOKUP(J37,[3]HeroModelConfig!$A:$D,4,FALSE))","v":""},{"$f":"IF(K37=\"\",\"\",VLOOKUP(K37,[3]HeroModelConfig!$A:$D,4,FALSE))","v":""}]
[{"$nulls":23},{"$f":"IF(I38=\"\",\"\",VLOOKUP(I38,[3]HeroModelConfig!$A:$D,4,FALSE))","v":""},{"$f":"IF(J38=\"\",\"\",VLOOKUP(J38,[3]HeroModelConfig!$A:$D,4,FALSE))","v":""},{"$f":"IF(K38=\"\",\"\",VLOOKUP(K38,[3]HeroModelConfig!$A:$D,4,FALSE))","v":""}]
[{"$nulls":23},{"$f":"IF(I39=\"\",\"\",VLOOKUP(I39,[3]HeroModelConfig!$A:$D,4,FALSE))","v":""},{"$f":"IF(J39=\"\",\"\",VLOOKUP(J39,[3]HeroModelConfig!$A:$D,4,FALSE))","v":""},{"$f":"IF(K39=\"\",\"\",VLOOKUP(K39,[3]HeroModelConfig!$A:$D,4,FALSE))","v":""}]
[{"$nulls":23},{"$f":"IF(I40=\"\",\"\",VLOOKUP(I40,[3]HeroModelConfig!$A:$D,4,FALSE))","v":""},{"$f":"IF(J40=\"\",\"\",VLOOKUP(J40,[3]HeroModelConfig!$A:$D,4,FALSE))","v":""},{"$f":"IF(K40=\"\",\"\",VLOOKUP(K40,[3]HeroModelConfig!$A:$D,4,FALSE))","v":""}]
[{"$nulls":23},{"$f":"IF(I41=\"\",\"\",VLOOKUP(I41,[3]HeroModelConfig!$A:$D,4,FALSE))","v":""},{"$f":"IF(J41=\"\",\"\",VLOOKUP(J41,[3]HeroModelConfig!$A:$D,4,FALSE))","v":""},{"$f":"IF(K41=\"\",\"\",VLOOKUP(K41,[3]HeroModelConfig!$A:$D,4,FALSE))","v":""}]
[{"$nulls":23},{"$f":"IF(I42=\"\",\"\",VLOOKUP(I42,[3]HeroModelConfig!$A:$D,4,FALSE))","v":""},{"$f":"IF(J42=\"\",\"\",VLOOKUP(J42,[3]HeroModelConfig!$A:$D,4,FALSE))","v":""},{"$f":"IF(K42=\"\",\"\",VLOOKUP(K42,[3]HeroModelConfig!$A:$D,4,FALSE))","v":""}]
[{"$nulls":23},{"$f":"IF(I43=\"\",\"\",VLOOKUP(I43,[3]HeroModelConfig!$A:$D,4,FALSE))","v":""},{"$f":"IF(J43=\"\",\"\",VLOOKUP(J43,[3]HeroModelConfig!$A:$D,4,FALSE))","v":""},{"$f":"IF(K43=\"\",\"\",VLOOKUP(K43,[3]HeroModelConfig!$A:$D,4,FALSE))","v":""}]
[{"$nulls":23},{"$f":"IF(I44=\"\",\"\",VLOOKUP(I44,[3]HeroModelConfig!$A:$D,4,FALSE))","v":""},{"$f":"IF(J44=\"\",\"\",VLOOKUP(J44,[3]HeroModelConfig!$A:$D,4,FALSE))","v":""},{"$f":"IF(K44=\"\",\"\",VLOOKUP(K44,[3]HeroModelConfig!$A:$D,4,FALSE))","v":""}]
[{"$nulls":23},{"$f":"IF(I45=\"\",\"\",VLOOKUP(I45,[3]HeroModelConfig!$A:$D,4,FALSE))","v":""},{"$f":"IF(J45=\"\",\"\",VLOOKUP(J45,[3]HeroModelConfig!$A:$D,4,FALSE))","v":""},{"$f":"IF(K45=\"\",\"\",VLOOKUP(K45,[3]HeroModelConfig!$A:$D,4,FALSE))","v":""}]
[{"$nulls":23},{"$f":"IF(I46=\"\",\"\",VLOOKUP(I46,[3]HeroModelConfig!$A:$D,4,FALSE))","v":""},{"$f":"IF(J46=\"\",\"\",VLOOKUP(J46,[3]HeroModelConfig!$A:$D,4,FALSE))","v":""},{"$f":"IF(K46=\"\",\"\",VLOOKUP(K46,[3]HeroModelConfig!$A:$D,4,FALSE))","v":""}]
[{"$nulls":23},{"$f":"IF(I47=\"\",\"\",VLOOKUP(I47,[3]HeroModelConfig!$A:$D,4,FALSE))","v":""},{"$f":"IF(J47=\"\",\"\",VLOOKUP(J47,[3]HeroModelConfig!$A:$D,4,FALSE))","v":""},{"$f":"IF(K47=\"\",\"\",VLOOKUP(K47,[3]HeroModelConfig!$A:$D,4,FALSE))","v":""}]
[{"$nulls":23},{"$f":"IF(I48=\"\",\"\",VLOOKUP(I48,[3]HeroModelConfig!$A:$D,4,FALSE))","v":""},{"$f":"IF(J48=\"\",\"\",VLOOKUP(J48,[3]HeroModelConfig!$A:$D,4,FALSE))","v":""},{"$f":"IF(K48=\"\",\"\",VLOOKUP(K48,[3]HeroModelConfig!$A:$D,4,FALSE))","v":""}]
[{"$nulls":23},{"$f":"IF(I49=\"\",\"\",VLOOKUP(I49,[3]HeroModelConfig!$A:$D,4,FALSE))","v":""},{"$f":"IF(J49=\"\",\"\",VLOOKUP(J49,[3]HeroModelConfig!$A:$D,4,FALSE))","v":""},{"$f":"IF(K49=\"\",\"\",VLOOKUP(K49,[3]HeroModelConfig!$A:$D,4,FALSE))","v":""}]
[{"$nulls":23},{"$f":"IF(I50=\"\",\"\",VLOOKUP(I50,[3]HeroModelConfig!$A:$D,4,FALSE))","v":""},{"$f":"IF(J50=\"\",\"\",VLOOKUP(J50,[3]HeroModelConfig!$A:$D,4,FALSE))","v":""},{"$f":"IF(K50=\"\",\"\",VLOOKUP(K50,[3]HeroModelConfig!$A:$D,4,FALSE))","v":""}]
[{"$nulls":23},{"$f":"IF(I51=\"\",\"\",VLOOKUP(I51,[3]HeroModelConfig!$A:$D,4,FALSE))","v":""},{"$f":"IF(J51=\"\",\"\",VLOOKUP(J51,[3]HeroModelConfig!$A:$D,4,FALSE))","v":""},{"$f":"IF(K51=\"\",\"\",VLOOKUP(K51,[3]HeroModelConfig!$A:$D,4,FALSE))","v":""}]
[3001,{"$f":"LevelbattleConfig!B48","v":"道侣雀灵儿-击败风妖"},{"$f":"VLOOKUP(A52,LevelbattleConfig!A:R,18,FALSE)","v":11},{"$f":"_xlfn.TEXTJOIN(\";\",1,I52:K52)","v":"7007"},{"$f":"_xlfn.TEXTJOIN(\";\",1,L52:N52)","v":""},{"$f":"_xlfn.TEXTJOIN(\";\",1,O52:Q52)","v":""},{"$f":"_xlfn.TEXTJOIN(\";\",1,R52:T52)","v":""},{"$f":"_xlfn.TEXTJOIN(\";\",1,U52:W52)","v":""},7007,{"$nulls":14},{"$f":"IF(I52=\"\",\"\",VLOOKUP(I52,[3]HeroModelConfig!$A:$D,4,FALSE))","v":"树精"},{"$f":"IF(J52=\"\",\"\",VLOOKUP(J52,[3]HeroModelConfig!$A:$D,4,FALSE))","v":""},{"$f":"IF(K52=\"\",\"\",VLOOKUP(K52,[3]HeroModelConfig!$A:$D,4,FALSE))","v":""}]
[3002,{"$f":"LevelbattleConfig!B49","v":"道侣雀灵儿-击败大风妖兽"},{"$f":"VLOOKUP(A53,LevelbattleConfig!A:R,18,FALSE)","v":21},{"$f":"_xlfn.TEXTJOIN(\";\",1,I53:K53)","v":"7001"},{"$f":"_xlfn.TEXTJOIN(\";\",1,L53:N53)","v":""},{"$f":"_xlfn.TEXTJOIN(\";\",1,O53:Q53)","v":""},{"$f":"_xlfn.TEXTJOIN(\";\",1,R53:T53)","v":""},{"$f":"_xlfn.TEXTJOIN(\";\",1,U53:W53)","v":""},7001,{"$nulls":14},{"$f":"IF(I53=\"\",\"\",VLOOKUP(I53,[3]HeroModelConfig!$A:$D,4,FALSE))","v":"凤凰"},{"$f":"IF(J53=\"\",\"\",VLOOKUP(J53,[3]HeroModelConfig!$A:$D,4,FALSE))","v":""},{"$f":"IF(K53=\"\",\"\",VLOOKUP(K53,[3]HeroModelConfig!$A:$D,4,FALSE))","v":""}]
[{"$f":"A53+1","v":3003},{"$f":"LevelbattleConfig!B50","v":"道侣云枝-击败风妖"},{"$f":"VLOOKUP(A54,LevelbattleConfig!A:R,18,FALSE)","v":11},{"$f":"_xlfn.TEXTJOIN(\";\",1,I54:K54)","v":"7007"},{"$f":"_xlfn.TEXTJOIN(\";\",1,L54:N54)","v":""},{"$f":"_xlfn.TEXTJOIN(\";\",1,O54:Q54)","v":""},{"$f":"_xlfn.TEXTJOIN(\";\",1,R54:T54)","v":""},{"$f":"_xlfn.TEXTJOIN(\";\",1,U54:W54)","v":""},7007,{"$nulls":14},{"$f":"IF(I54=\"\",\"\",VLOOKUP(I54,[3]HeroModelConfig!$A:$D,4,FALSE))","v":"树精"},{"$f":"IF(J54=\"\",\"\",VLOOKUP(J54,[3]HeroModelConfig!$A:$D,4,FALSE))","v":""},{"$f":"IF(K54=\"\",\"\",VLOOKUP(K54,[3]HeroModelConfig!$A:$D,4,FALSE))","v":""}]
[3004,{"$f":"LevelbattleConfig!B51","v":"道侣云枝-击败风妖2"},{"$f":"VLOOKUP(A55,LevelbattleConfig!A:R,18,FALSE)","v":16},{"$f":"_xlfn.TEXTJOIN(\";\",1,I55:K55)","v":"7007"},{"$f":"_xlfn.TEXTJOIN(\";\",1,L55:N55)","v":""},{"$f":"_xlfn.TEXTJOIN(\";\",1,O55:Q55)","v":""},{"$f":"_xlfn.TEXTJOIN(\";\",1,R55:T55)","v":""},{"$f":"_xlfn.TEXTJOIN(\";\",1,U55:W55)","v":""},7007,{"$nulls":14},{"$f":"IF(I55=\"\",\"\",VLOOKUP(I55,[3]HeroModelConfig!$A:$D,4,FALSE))","v":"树精"},{"$f":"IF(J55=\"\",\"\",VLOOKUP(J55,[3]HeroModelConfig!$A:$D,4,FALSE))","v":""},{"$f":"IF(K55=\"\",\"\",VLOOKUP(K55,[3]HeroModelConfig!$A:$D,4,FALSE))","v":""}]
[3005,{"$f":"LevelbattleConfig!B52","v":"道侣云枝-击败风妖3"},{"$f":"VLOOKUP(A56,LevelbattleConfig!A:R,18,FALSE)","v":16},"5003","","","","",5003,{"$nulls":14},{"$f":"IF(I56=\"\",\"\",VLOOKUP(I56,[3]HeroModelConfig!$A:$D,4,FALSE))","v":"木修精英"},{"$f":"IF(J56=\"\",\"\",VLOOKUP(J56,[3]HeroModelConfig!$A:$D,4,FALSE))","v":""},{"$f":"IF(K56=\"\",\"\",VLOOKUP(K56,[3]HeroModelConfig!$A:$D,4,FALSE))","v":""}]
[3006,{"$f":"LevelbattleConfig!B53","v":"道侣云枝-击败风妖4"},{"$f":"VLOOKUP(A57,LevelbattleConfig!A:R,18,FALSE)","v":21},{"$f":"_xlfn.TEXTJOIN(\";\",1,I57:K57)","v":"5003"},{"$f":"_xlfn.TEXTJOIN(\";\",1,L57:N57)","v":""},{"$f":"_xlfn.TEXTJOIN(\";\",1,O57:Q57)","v":""},{"$f":"_xlfn.TEXTJOIN(\";\",1,R57:T57)","v":""},{"$f":"_xlfn.TEXTJOIN(\";\",1,U57:W57)","v":""},5003,{"$nulls":14},{"$f":"IF(I57=\"\",\"\",VLOOKUP(I57,[3]HeroModelConfig!$A:$D,4,FALSE))","v":"木修精英"},{"$f":"IF(J57=\"\",\"\",VLOOKUP(J57,[3]HeroModelConfig!$A:$D,4,FALSE))","v":""},{"$f":"IF(K57=\"\",\"\",VLOOKUP(K57,[3]HeroModelConfig!$A:$D,4,FALSE))","v":""}]
[3007,{"$f":"LevelbattleConfig!B54","v":"道侣云枝-击败风妖4"},{"$f":"VLOOKUP(A58,LevelbattleConfig!A:R,18,FALSE)","v":31},{"$f":"_xlfn.TEXTJOIN(\";\",1,I58:K58)","v":"5003"},{"$f":"_xlfn.TEXTJOIN(\";\",1,L58:N58)","v":""},{"$f":"_xlfn.TEXTJOIN(\";\",1,O58:Q58)","v":""},{"$f":"_xlfn.TEXTJOIN(\";\",1,R58:T58)","v":""},{"$f":"_xlfn.TEXTJOIN(\";\",1,U58:W58)","v":""},5003,{"$nulls":14},{"$f":"IF(I58=\"\",\"\",VLOOKUP(I58,[3]HeroModelConfig!$A:$D,4,FALSE))","v":"木修精英"},{"$f":"IF(J58=\"\",\"\",VLOOKUP(J58,[3]HeroModelConfig!$A:$D,4,FALSE))","v":""},{"$f":"IF(K58=\"\",\"\",VLOOKUP(K58,[3]HeroModelConfig!$A:$D,4,FALSE))","v":""}]
[3008,{"$f":"LevelbattleConfig!B55","v":"道侣云枝-击败风妖5"},{"$f":"VLOOKUP(A59,LevelbattleConfig!A:R,18,FALSE)","v":31},{"$f":"_xlfn.TEXTJOIN(\";\",1,I59:K59)","v":"7001"},{"$f":"_xlfn.TEXTJOIN(\";\",1,L59:N59)","v":""},{"$f":"_xlfn.TEXTJOIN(\";\",1,O59:Q59)","v":""},{"$f":"_xlfn.TEXTJOIN(\";\",1,R59:T59)","v":""},{"$f":"_xlfn.TEXTJOIN(\";\",1,U59:W59)","v":""},7001,{"$nulls":14},{"$f":"IF(I59=\"\",\"\",VLOOKUP(I59,[3]HeroModelConfig!$A:$D,4,FALSE))","v":"凤凰"},{"$f":"IF(J59=\"\",\"\",VLOOKUP(J59,[3]HeroModelConfig!$A:$D,4,FALSE))","v":""},{"$f":"IF(K59=\"\",\"\",VLOOKUP(K59,[3]HeroModelConfig!$A:$D,4,FALSE))","v":""}]
[3009,{"$f":"LevelbattleConfig!B56","v":"道侣婉溪-击败抢走玉佩的小妖"},{"$f":"VLOOKUP(A60,LevelbattleConfig!A:R,18,FALSE)","v":144},{"$f":"_xlfn.TEXTJOIN(\";\",1,I60:K60)","v":"5003"},{"$f":"_xlfn.TEXTJOIN(\";\",1,L60:N60)","v":""},{"$f":"_xlfn.TEXTJOIN(\";\",1,O60:Q60)","v":""},{"$f":"_xlfn.TEXTJOIN(\";\",1,R60:T60)","v":""},{"$f":"_xlfn.TEXTJOIN(\";\",1,U60:W60)","v":""},5003,{"$nulls":14},{"$f":"IF(I60=\"\",\"\",VLOOKUP(I60,[3]HeroModelConfig!$A:$D,4,FALSE))","v":"木修精英"},{"$f":"IF(J60=\"\",\"\",VLOOKUP(J60,[3]HeroModelConfig!$A:$D,4,FALSE))","v":""},{"$f":"IF(K60=\"\",\"\",VLOOKUP(K60,[3]HeroModelConfig!$A:$D,4,FALSE))","v":""}]
[3010,{"$f":"LevelbattleConfig!B57","v":"道侣婉溪-击败溪边水灵"},{"$f":"VLOOKUP(A61,LevelbattleConfig!A:R,18,FALSE)","v":145},{"$f":"_xlfn.TEXTJOIN(\";\",1,I61:K61)","v":"5002"},{"$f":"_xlfn.TEXTJOIN(\";\",1,L61:N61)","v":""},{"$f":"_xlfn.TEXTJOIN(\";\",1,O61:Q61)","v":""},{"$f":"_xlfn.TEXTJOIN(\";\",1,R61:T61)","v":""},{"$f":"_xlfn.TEXTJOIN(\";\",1,U61:W61)","v":""},5002,{"$nulls":14},{"$f":"IF(I61=\"\",\"\",VLOOKUP(I61,[3]HeroModelConfig!$A:$D,4,FALSE))","v":"水修精英"},{"$f":"IF(J61=\"\",\"\",VLOOKUP(J61,[3]HeroModelConfig!$A:$D,4,FALSE))","v":""},{"$f":"IF(K61=\"\",\"\",VLOOKUP(K61,[3]HeroModelConfig!$A:$D,4,FALSE))","v":""}]
[3011,{"$f":"LevelbattleConfig!B58","v":"道侣许由-击败守护灵草的小妖"},{"$f":"VLOOKUP(A62,LevelbattleConfig!A:R,18,FALSE)","v":66},{"$f":"_xlfn.TEXTJOIN(\";\",1,I62:K62)","v":"7008"},{"$f":"_xlfn.TEXTJOIN(\";\",1,L62:N62)","v":""},{"$f":"_xlfn.TEXTJOIN(\";\",1,O62:Q62)","v":""},{"$f":"_xlfn.TEXTJOIN(\";\",1,R62:T62)","v":""},{"$f":"_xlfn.TEXTJOIN(\";\",1,U62:W62)","v":""},7008,{"$nulls":14},{"$f":"IF(I62=\"\",\"\",VLOOKUP(I62,[3]HeroModelConfig!$A:$D,4,FALSE))","v":"飞鹤"},{"$f":"IF(J62=\"\",\"\",VLOOKUP(J62,[3]HeroModelConfig!$A:$D,4,FALSE))","v":""},{"$f":"IF(K62=\"\",\"\",VLOOKUP(K62,[3]HeroModelConfig!$A:$D,4,FALSE))","v":""}]
[3012,{"$f":"LevelbattleConfig!B59","v":"道侣许由-击败秘境灵草守卫"},{"$f":"VLOOKUP(A63,LevelbattleConfig!A:R,18,FALSE)","v":86},"5005","","","","",5005,{"$nulls":14},{"$f":"IF(I63=\"\",\"\",VLOOKUP(I63,[3]HeroModelConfig!$A:$D,4,FALSE))","v":"土系怪"},{"$f":"IF(J63=\"\",\"\",VLOOKUP(J63,[3]HeroModelConfig!$A:$D,4,FALSE))","v":""},{"$f":"IF(K63=\"\",\"\",VLOOKUP(K63,[3]HeroModelConfig!$A:$D,4,FALSE))","v":""}]
[3013,{"$f":"LevelbattleConfig!B60","v":"道侣疯道人-击败果园守卫"},{"$f":"VLOOKUP(A64,LevelbattleConfig!A:R,18,FALSE)","v":96},{"$f":"_xlfn.TEXTJOIN(\";\",1,I64:K64)","v":"5001"},{"$f":"_xlfn.TEXTJOIN(\";\",1,L64:N64)","v":""},{"$f":"_xlfn.TEXTJOIN(\";\",1,O64:Q64)","v":""},{"$f":"_xlfn.TEXTJOIN(\";\",1,R64:T64)","v":""},{"$f":"_xlfn.TEXTJOIN(\";\",1,U64:W64)","v":""},5001,{"$nulls":14},{"$f":"IF(I64=\"\",\"\",VLOOKUP(I64,[3]HeroModelConfig!$A:$D,4,FALSE))","v":"金修精英"},{"$f":"IF(J64=\"\",\"\",VLOOKUP(J64,[3]HeroModelConfig!$A:$D,4,FALSE))","v":""},{"$f":"IF(K64=\"\",\"\",VLOOKUP(K64,[3]HeroModelConfig!$A:$D,4,FALSE))","v":""}]
[3014,{"$f":"LevelbattleConfig!B61","v":"道侣疯道人-帮助疯道人驱妖"},{"$f":"VLOOKUP(A65,LevelbattleConfig!A:R,18,FALSE)","v":106},{"$f":"_xlfn.TEXTJOIN(\";\",1,I65:K65)","v":"5004"},{"$f":"_xlfn.TEXTJOIN(\";\",1,L65:N65)","v":""},{"$f":"_xlfn.TEXTJOIN(\";\",1,O65:Q65)","v":""},{"$f":"_xlfn.TEXTJOIN(\";\",1,R65:T65)","v":""},{"$f":"_xlfn.TEXTJOIN(\";\",1,U65:W65)","v":""},5004,{"$nulls":14},{"$f":"IF(I65=\"\",\"\",VLOOKUP(I65,[3]HeroModelConfig!$A:$D,4,FALSE))","v":"火修精英"},{"$f":"IF(J65=\"\",\"\",VLOOKUP(J65,[3]HeroModelConfig!$A:$D,4,FALSE))","v":""},{"$f":"IF(K65=\"\",\"\",VLOOKUP(K65,[3]HeroModelConfig!$A:$D,4,FALSE))","v":""}]
[3015,{"$f":"LevelbattleConfig!B62","v":"道侣疯道人-击败疯道人"},{"$f":"VLOOKUP(A66,LevelbattleConfig!A:R,18,FALSE)","v":126},{"$f":"_xlfn.TEXTJOIN(\";\",1,I66:K66)","v":"9001"},{"$f":"_xlfn.TEXTJOIN(\";\",1,L66:N66)","v":""},{"$f":"_xlfn.TEXTJOIN(\";\",1,O66:Q66)","v":""},{"$f":"_xlfn.TEXTJOIN(\";\",1,R66:T66)","v":""},{"$f":"_xlfn.TEXTJOIN(\";\",1,U66:W66)","v":""},9001,{"$nulls":14},{"$f":"IF(I66=\"\",\"\",VLOOKUP(I66,[3]HeroModelConfig!$A:$D,4,FALSE))","v":"boss"},{"$f":"IF(J66=\"\",\"\",VLOOKUP(J66,[3]HeroModelConfig!$A:$D,4,FALSE))","v":""},{"$f":"IF(K66=\"\",\"\",VLOOKUP(K66,[3]HeroModelConfig!$A:$D,4,FALSE))","v":""}]
[3016,{"$f":"LevelbattleConfig!B63","v":"道侣风瑶-击败误食灵石的妖兽"},{"$f":"VLOOKUP(A67,LevelbattleConfig!A:R,18,FALSE)","v":46},"9001","","","","",9001,{"$nulls":14},{"$f":"IF(I67=\"\",\"\",VLOOKUP(I67,[3]HeroModelConfig!$A:$D,4,FALSE))","v":"boss"},{"$f":"IF(J67=\"\",\"\",VLOOKUP(J67,[3]HeroModelConfig!$A:$D,4,FALSE))","v":""},{"$f":"IF(K67=\"\",\"\",VLOOKUP(K67,[3]HeroModelConfig!$A:$D,4,FALSE))","v":""}]
[{"$nulls":23},{"$f":"IF(I68=\"\",\"\",VLOOKUP(I68,[3]HeroModelConfig!$A:$D,4,FALSE))","v":""},{"$f":"IF(J68=\"\",\"\",VLOOKUP(J68,[3]HeroModelConfig!$A:$D,4,FALSE))","v":""},{"$f":"IF(K68=\"\",\"\",VLOOKUP(K68,[3]HeroModelConfig!$A:$D,4,FALSE))","v":""}]
[10001,{"$f":"LevelbattleConfig!B65","v":"引导 -开局第一场战斗"},210,{"$f":"_xlfn.TEXTJOIN(\";\",1,I69:K69)","v":"7003"},{"$f":"_xlfn.TEXTJOIN(\";\",1,L69:N69)","v":""},{"$f":"_xlfn.TEXTJOIN(\";\",1,O69:Q69)","v":""},{"$f":"_xlfn.TEXTJOIN(\";\",1,R69:T69)","v":""},{"$f":"_xlfn.TEXTJOIN(\";\",1,U69:W69)","v":""},7003,{"$nulls":14},{"$f":"IF(I69=\"\",\"\",VLOOKUP(I69,[3]HeroModelConfig!$A:$D,4,FALSE))","v":"开场战斗-心魔"},{"$f":"IF(J69=\"\",\"\",VLOOKUP(J69,[3]HeroModelConfig!$A:$D,4,FALSE))","v":""},{"$f":"IF(K69=\"\",\"\",VLOOKUP(K69,[3]HeroModelConfig!$A:$D,4,FALSE))","v":""}]
[null,null,null,{"$f":"_xlfn.TEXTJOIN(\";\",1,I70:K70)","v":""},{"$nulls":19},{"$f":"IF(I70=\"\",\"\",VLOOKUP(I70,[3]HeroModelConfig!$A:$D,4,FALSE))","v":""},{"$f":"IF(J70=\"\",\"\",VLOOKUP(J70,[3]HeroModelConfig!$A:$D,4,FALSE))","v":""},{"$f":"IF(K70=\"\",\"\",VLOOKUP(K70,[3]HeroModelConfig!$A:$D,4,FALSE))","v":""}]
[4001,{"$f":"VLOOKUP(A71,LevelbattleConfig!A:B,2,FALSE)","v":"支线-海岸异象-妖物调查"},{"$f":"VLOOKUP(A71,LevelbattleConfig!A:R,18,FALSE)","v":8},{"$f":"_xlfn.TEXTJOIN(\";\",1,I71:K71)","v":"5002"},{"$f":"_xlfn.TEXTJOIN(\";\",1,L71:N71)","v":""},{"$f":"_xlfn.TEXTJOIN(\";\",1,O71:Q71)","v":""},{"$f":"_xlfn.TEXTJOIN(\";\",1,R71:T71)","v":""},{"$f":"_xlfn.TEXTJOIN(\";\",1,U71:W71)","v":""},5002,{"$nulls":14},{"$f":"IF(I71=\"\",\"\",VLOOKUP(I71,[3]HeroModelConfig!$A:$D,4,FALSE))","v":"水修精英"},{"$f":"IF(J71=\"\",\"\",VLOOKUP(J71,[3]HeroModelConfig!$A:$D,4,FALSE))","v":""},{"$f":"IF(K71=\"\",\"\",VLOOKUP(K71,[3]HeroModelConfig!$A:$D,4,FALSE))","v":""}]
[4002,{"$f":"VLOOKUP(A72,LevelbattleConfig!A:B,2,FALSE)","v":"支线-幽魂-幽魂石守护兽"},{"$f":"VLOOKUP(A72,LevelbattleConfig!A:R,18,FALSE)","v":23},{"$f":"_xlfn.TEXTJOIN(\";\",1,I72:K72)","v":"5007"},{"$f":"_xlfn.TEXTJOIN(\";\",1,L72:N72)","v":""},{"$f":"_xlfn.TEXTJOIN(\";\",1,O72:Q72)","v":""},{"$f":"_xlfn.TEXTJOIN(\";\",1,R72:T72)","v":""},{"$f":"_xlfn.TEXTJOIN(\";\",1,U72:W72)","v":""},5007,{"$nulls":14},{"$f":"IF(I72=\"\",\"\",VLOOKUP(I72,[3]HeroModelConfig!$A:$D,4,FALSE))","v":"穷奇"},{"$f":"IF(J72=\"\",\"\",VLOOKUP(J72,[3]HeroModelConfig!$A:$D,4,FALSE))","v":""},{"$f":"IF(K72=\"\",\"\",VLOOKUP(K72,[3]HeroModelConfig!$A:$D,4,FALSE))","v":""}]
[4003,{"$f":"VLOOKUP(A73,LevelbattleConfig!A:B,2,FALSE)","v":"支线-馨儿-迷雾妖怪"},{"$f":"VLOOKUP(A73,LevelbattleConfig!A:R,18,FALSE)","v":20},"5001","","","","",5001,{"$nulls":14},{"$f":"IF(I73=\"\",\"\",VLOOKUP(I73,[3]HeroModelConfig!$A:$D,4,FALSE))","v":"金修精英"},{"$f":"IF(J73=\"\",\"\",VLOOKUP(J73,[3]HeroModelConfig!$A:$D,4,FALSE))","v":""},{"$f":"IF(K73=\"\",\"\",VLOOKUP(K73,[3]HeroModelConfig!$A:$D,4,FALSE))","v":""}]
[4004,{"$f":"VLOOKUP(A74,LevelbattleConfig!A:B,2,FALSE)","v":"支线-馨儿-发现信使"},{"$f":"VLOOKUP(A74,LevelbattleConfig!A:R,18,FALSE)","v":25},{"$f":"_xlfn.TEXTJOIN(\";\",1,I74:K74)","v":"5001"},{"$f":"_xlfn.TEXTJOIN(\";\",1,L74:N74)","v":""},{"$f":"_xlfn.TEXTJOIN(\";\",1,O74:Q74)","v":""},{"$f":"_xlfn.TEXTJOIN(\";\",1,R74:T74)","v":""},{"$f":"_xlfn.TEXTJOIN(\";\",1,U74:W74)","v":""},5001,{"$nulls":14},{"$f":"IF(I74=\"\",\"\",VLOOKUP(I74,[3]HeroModelConfig!$A:$D,4,FALSE))","v":"金修精英"},{"$f":"IF(J74=\"\",\"\",VLOOKUP(J74,[3]HeroModelConfig!$A:$D,4,FALSE))","v":""},{"$f":"IF(K74=\"\",\"\",VLOOKUP(K74,[3]HeroModelConfig!$A:$D,4,FALSE))","v":""}]
[4005,{"$f":"VLOOKUP(A75,LevelbattleConfig!A:B,2,FALSE)","v":"支线-馨儿-发现信使"},{"$f":"VLOOKUP(A75,LevelbattleConfig!A:R,18,FALSE)","v":25},"5003","","","","",5003,{"$nulls":14},{"$f":"IF(I75=\"\",\"\",VLOOKUP(I75,[3]HeroModelConfig!$A:$D,4,FALSE))","v":"木修精英"},{"$f":"IF(J75=\"\",\"\",VLOOKUP(J75,[3]HeroModelConfig!$A:$D,4,FALSE))","v":""},{"$f":"IF(K75=\"\",\"\",VLOOKUP(K75,[3]HeroModelConfig!$A:$D,4,FALSE))","v":""}]
[4006,{"$f":"VLOOKUP(A76,LevelbattleConfig!A:B,2,FALSE)","v":"支线-馨儿-风灵鸟的宝藏"},{"$f":"VLOOKUP(A76,LevelbattleConfig!A:R,18,FALSE)","v":30},"5002","","","","",5002,{"$nulls":14},{"$f":"IF(I76=\"\",\"\",VLOOKUP(I76,[3]HeroModelConfig!$A:$D,4,FALSE))","v":"水修精英"},{"$f":"IF(J76=\"\",\"\",VLOOKUP(J76,[3]HeroModelConfig!$A:$D,4,FALSE))","v":""},{"$f":"IF(K76=\"\",\"\",VLOOKUP(K76,[3]HeroModelConfig!$A:$D,4,FALSE))","v":""}]
[4007,{"$f":"VLOOKUP(A77,LevelbattleConfig!A:B,2,FALSE)","v":"支线-馨儿-浮岛灵泉的净化"},{"$f":"VLOOKUP(A77,LevelbattleConfig!A:R,18,FALSE)","v":35},"5005","","","","",5005,{"$nulls":14},{"$f":"IF(I77=\"\",\"\",VLOOKUP(I77,[3]HeroModelConfig!$A:$D,4,FALSE))","v":"土系怪"},{"$f":"IF(J77=\"\",\"\",VLOOKUP(J77,[3]HeroModelConfig!$A:$D,4,FALSE))","v":""},{"$f":"IF(K77=\"\",\"\",VLOOKUP(K77,[3]HeroModelConfig!$A:$D,4,FALSE))","v":""}]
[4008,{"$f":"VLOOKUP(A78,LevelbattleConfig!A:B,2,FALSE)","v":"支线-馨儿-浮岛盗修的阴谋"},{"$f":"VLOOKUP(A78,LevelbattleConfig!A:R,18,FALSE)","v":40},"5001","","","","",5001,{"$nulls":14},{"$f":"IF(I78=\"\",\"\",VLOOKUP(I78,[3]HeroModelConfig!$A:$D,4,FALSE))","v":"金修精英"},{"$f":"IF(J78=\"\",\"\",VLOOKUP(J78,[3]HeroModelConfig!$A:$D,4,FALSE))","v":""},{"$f":"IF(K78=\"\",\"\",VLOOKUP(K78,[3]HeroModelConfig!$A:$D,4,FALSE))","v":""}]
[4009,{"$f":"VLOOKUP(A79,LevelbattleConfig!A:B,2,FALSE)","v":"支线-柳轻烟-找到血海宗的人"},{"$f":"VLOOKUP(A79,LevelbattleConfig!A:R,18,FALSE)","v":26},"5002","","","","",5002,{"$nulls":14},{"$f":"IF(I79=\"\",\"\",VLOOKUP(I79,[3]HeroModelConfig!$A:$D,4,FALSE))","v":"水修精英"},{"$f":"IF(J79=\"\",\"\",VLOOKUP(J79,[3]HeroModelConfig!$A:$D,4,FALSE))","v":""},{"$f":"IF(K79=\"\",\"\",VLOOKUP(K79,[3]HeroModelConfig!$A:$D,4,FALSE))","v":""}]
[4010,{"$f":"VLOOKUP(A80,LevelbattleConfig!A:B,2,FALSE)","v":"支线-柳轻烟-找到血海宗的人2"},{"$f":"VLOOKUP(A80,LevelbattleConfig!A:R,18,FALSE)","v":31},{"$f":"_xlfn.TEXTJOIN(\";\",1,I80:K80)","v":"5004"},{"$f":"_xlfn.TEXTJOIN(\";\",1,L80:N80)","v":""},{"$f":"_xlfn.TEXTJOIN(\";\",1,O80:Q80)","v":""},{"$f":"_xlfn.TEXTJOIN(\";\",1,R80:T80)","v":""},{"$f":"_xlfn.TEXTJOIN(\";\",1,U80:W80)","v":""},5004,{"$nulls":14},{"$f":"IF(I80=\"\",\"\",VLOOKUP(I80,[3]HeroModelConfig!$A:$D,4,FALSE))","v":"火修精英"},{"$f":"IF(J80=\"\",\"\",VLOOKUP(J80,[3]HeroModelConfig!$A:$D,4,FALSE))","v":""},{"$f":"IF(K80=\"\",\"\",VLOOKUP(K80,[3]HeroModelConfig!$A:$D,4,FALSE))","v":""}]
[4011,{"$f":"VLOOKUP(A81,LevelbattleConfig!A:B,2,FALSE)","v":"支线-馨儿-灵花"},{"$f":"VLOOKUP(A81,LevelbattleConfig!A:R,18,FALSE)","v":31},"5006","","","","",5006,{"$nulls":14},{"$f":"IF(I81=\"\",\"\",VLOOKUP(I81,[3]HeroModelConfig!$A:$D,4,FALSE))","v":"鼠先锋 "},{"$f":"IF(J81=\"\",\"\",VLOOKUP(J81,[3]HeroModelConfig!$A:$D,4,FALSE))","v":""},{"$f":"IF(K81=\"\",\"\",VLOOKUP(K81,[3]HeroModelConfig!$A:$D,4,FALSE))","v":""}]
[4012,{"$f":"VLOOKUP(A82,LevelbattleConfig!A:B,2,FALSE)","v":"支线-馨儿-散修劫掠"},{"$f":"VLOOKUP(A82,LevelbattleConfig!A:R,18,FALSE)","v":41},"5001","","","","",5001,{"$nulls":14},{"$f":"IF(I82=\"\",\"\",VLOOKUP(I82,[3]HeroModelConfig!$A:$D,4,FALSE))","v":"金修精英"},{"$f":"IF(J82=\"\",\"\",VLOOKUP(J82,[3]HeroModelConfig!$A:$D,4,FALSE))","v":""},{"$f":"IF(K82=\"\",\"\",VLOOKUP(K82,[3]HeroModelConfig!$A:$D,4,FALSE))","v":""}]
[4013,{"$f":"VLOOKUP(A83,LevelbattleConfig!A:B,2,FALSE)","v":"支线-馨儿-散修劫掠2"},{"$f":"VLOOKUP(A83,LevelbattleConfig!A:R,18,FALSE)","v":51},"5003","","","","",5003,{"$nulls":14},{"$f":"IF(I83=\"\",\"\",VLOOKUP(I83,[3]HeroModelConfig!$A:$D,4,FALSE))","v":"木修精英"},{"$f":"IF(J83=\"\",\"\",VLOOKUP(J83,[3]HeroModelConfig!$A:$D,4,FALSE))","v":""},{"$f":"IF(K83=\"\",\"\",VLOOKUP(K83,[3]HeroModelConfig!$A:$D,4,FALSE))","v":""}]
[4014,{"$f":"VLOOKUP(A84,LevelbattleConfig!A:B,2,FALSE)","v":"支线-楚云缪-青狼散人"},{"$f":"VLOOKUP(A84,LevelbattleConfig!A:R,18,FALSE)","v":66},"5002","","","","",5002,{"$nulls":14},{"$f":"IF(I84=\"\",\"\",VLOOKUP(I84,[3]HeroModelConfig!$A:$D,4,FALSE))","v":"水修精英"},{"$f":"IF(J84=\"\",\"\",VLOOKUP(J84,[3]HeroModelConfig!$A:$D,4,FALSE))","v":""},{"$f":"IF(K84=\"\",\"\",VLOOKUP(K84,[3]HeroModelConfig!$A:$D,4,FALSE))","v":""}]
[4015,{"$f":"VLOOKUP(A85,LevelbattleConfig!A:B,2,FALSE)","v":"支线-血海宗的掠夺-血海宗的掠夺"},{"$f":"VLOOKUP(A85,LevelbattleConfig!A:R,18,FALSE)","v":61},"5001","","","","",5001,{"$nulls":14},{"$f":"IF(I85=\"\",\"\",VLOOKUP(I85,[3]HeroModelConfig!$A:$D,4,FALSE))","v":"金修精英"},{"$f":"IF(J85=\"\",\"\",VLOOKUP(J85,[3]HeroModelConfig!$A:$D,4,FALSE))","v":""},{"$f":"IF(K85=\"\",\"\",VLOOKUP(K85,[3]HeroModelConfig!$A:$D,4,FALSE))","v":""}]
[4016,{"$f":"VLOOKUP(A86,LevelbattleConfig!A:B,2,FALSE)","v":"支线-林风-逃离追杀"},{"$f":"VLOOKUP(A86,LevelbattleConfig!A:R,18,FALSE)","v":66},"5002","","","","",5002,{"$nulls":14},{"$f":"IF(I86=\"\",\"\",VLOOKUP(I86,[3]HeroModelConfig!$A:$D,4,FALSE))","v":"水修精英"},{"$f":"IF(J86=\"\",\"\",VLOOKUP(J86,[3]HeroModelConfig!$A:$D,4,FALSE))","v":""},{"$f":"IF(K86=\"\",\"\",VLOOKUP(K86,[3]HeroModelConfig!$A:$D,4,FALSE))","v":""}]
[4017,{"$f":"VLOOKUP(A87,LevelbattleConfig!A:B,2,FALSE)","v":"支线-林风-血海宗弟子"},{"$f":"VLOOKUP(A87,LevelbattleConfig!A:R,18,FALSE)","v":71},"5003","","","","",5003,{"$nulls":14},{"$f":"IF(I87=\"\",\"\",VLOOKUP(I87,[3]HeroModelConfig!$A:$D,4,FALSE))","v":"木修精英"},{"$f":"IF(J87=\"\",\"\",VLOOKUP(J87,[3]HeroModelConfig!$A:$D,4,FALSE))","v":""},{"$f":"IF(K87=\"\",\"\",VLOOKUP(K87,[3]HeroModelConfig!$A:$D,4,FALSE))","v":""}]
[4018,{"$f":"VLOOKUP(A88,LevelbattleConfig!A:B,2,FALSE)","v":"支线-林风-血海宗弟子"},{"$f":"VLOOKUP(A88,LevelbattleConfig!A:R,18,FALSE)","v":71},{"$f":"_xlfn.TEXTJOIN(\";\",1,I88:K88)","v":"5004"},{"$f":"_xlfn.TEXTJOIN(\";\",1,L88:N88)","v":""},{"$f":"_xlfn.TEXTJOIN(\";\",1,O88:Q88)","v":""},{"$f":"_xlfn.TEXTJOIN(\";\",1,R88:T88)","v":""},{"$f":"_xlfn.TEXTJOIN(\";\",1,U88:W88)","v":""},5004,{"$nulls":14},{"$f":"IF(I88=\"\",\"\",VLOOKUP(I88,[3]HeroModelConfig!$A:$D,4,FALSE))","v":"火修精英"},{"$f":"IF(J88=\"\",\"\",VLOOKUP(J88,[3]HeroModelConfig!$A:$D,4,FALSE))","v":""},{"$f":"IF(K88=\"\",\"\",VLOOKUP(K88,[3]HeroModelConfig!$A:$D,4,FALSE))","v":""}]
[4019,{"$f":"VLOOKUP(A89,LevelbattleConfig!A:B,2,FALSE)","v":"支线-林风-血海宗弟子"},{"$f":"VLOOKUP(A89,LevelbattleConfig!A:R,18,FALSE)","v":71},"5005","","","","",5005,{"$nulls":14},{"$f":"IF(I89=\"\",\"\",VLOOKUP(I89,[3]HeroModelConfig!$A:$D,4,FALSE))","v":"土系怪"},{"$f":"IF(J89=\"\",\"\",VLOOKUP(J89,[3]HeroModelConfig!$A:$D,4,FALSE))","v":""},{"$f":"IF(K89=\"\",\"\",VLOOKUP(K89,[3]HeroModelConfig!$A:$D,4,FALSE))","v":""}]
[4020,{"$f":"VLOOKUP(A90,LevelbattleConfig!A:B,2,FALSE)","v":"支线-林风后续-夺晶之战"},{"$f":"VLOOKUP(A90,LevelbattleConfig!A:R,18,FALSE)","v":76},"5001","","","","",5001,{"$nulls":14},{"$f":"IF(I90=\"\",\"\",VLOOKUP(I90,[3]HeroModelConfig!$A:$D,4,FALSE))","v":"金修精英"},{"$f":"IF(J90=\"\",\"\",VLOOKUP(J90,[3]HeroModelConfig!$A:$D,4,FALSE))","v":""},{"$f":"IF(K90=\"\",\"\",VLOOKUP(K90,[3]HeroModelConfig!$A:$D,4,FALSE))","v":""}]
[4021,{"$f":"VLOOKUP(A91,LevelbattleConfig!A:B,2,FALSE)","v":"支线-林风后续-夺晶之战"},{"$f":"VLOOKUP(A91,LevelbattleConfig!A:R,18,FALSE)","v":76},"5002","","","","",5002,{"$nulls":14},{"$f":"IF(I91=\"\",\"\",VLOOKUP(I91,[3]HeroModelConfig!$A:$D,4,FALSE))","v":"水修精英"},{"$f":"IF(J91=\"\",\"\",VLOOKUP(J91,[3]HeroModelConfig!$A:$D,4,FALSE))","v":""},{"$f":"IF(K91=\"\",\"\",VLOOKUP(K91,[3]HeroModelConfig!$A:$D,4,FALSE))","v":""}]
[4022,{"$f":"VLOOKUP(A92,LevelbattleConfig!A:B,2,FALSE)","v":"支线-林风后续-夺晶之战2-援军"},{"$f":"VLOOKUP(A92,LevelbattleConfig!A:R,18,FALSE)","v":86},"5003","","","","",5003,{"$nulls":14},{"$f":"IF(I92=\"\",\"\",VLOOKUP(I92,[3]HeroModelConfig!$A:$D,4,FALSE))","v":"木修精英"},{"$f":"IF(J92=\"\",\"\",VLOOKUP(J92,[3]HeroModelConfig!$A:$D,4,FALSE))","v":""},{"$f":"IF(K92=\"\",\"\",VLOOKUP(K92,[3]HeroModelConfig!$A:$D,4,FALSE))","v":""}]
[4023,{"$f":"VLOOKUP(A93,LevelbattleConfig!A:B,2,FALSE)","v":"支线-林风-消灭妖邪"},{"$f":"VLOOKUP(A93,LevelbattleConfig!A:R,18,FALSE)","v":101},"5006","","","","",5006,{"$nulls":14},{"$f":"IF(I93=\"\",\"\",VLOOKUP(I93,[3]HeroModelConfig!$A:$D,4,FALSE))","v":"鼠先锋 "},{"$f":"IF(J93=\"\",\"\",VLOOKUP(J93,[3]HeroModelConfig!$A:$D,4,FALSE))","v":""},{"$f":"IF(K93=\"\",\"\",VLOOKUP(K93,[3]HeroModelConfig!$A:$D,4,FALSE))","v":""}]
[4024,{"$f":"VLOOKUP(A94,LevelbattleConfig!A:B,2,FALSE)","v":"支线-仙山异样-消灭仙山西边的妖物"},{"$f":"VLOOKUP(A94,LevelbattleConfig!A:R,18,FALSE)","v":121},"5007","","","","",5007,{"$nulls":14},{"$f":"IF(I94=\"\",\"\",VLOOKUP(I94,[3]HeroModelConfig!$A:$D,4,FALSE))","v":"穷奇"},{"$f":"IF(J94=\"\",\"\",VLOOKUP(J94,[3]HeroModelConfig!$A:$D,4,FALSE))","v":""},{"$f":"IF(K94=\"\",\"\",VLOOKUP(K94,[3]HeroModelConfig!$A:$D,4,FALSE))","v":""}]
[4025,{"$f":"VLOOKUP(A95,LevelbattleConfig!A:B,2,FALSE)","v":"支线-仙山异样-仙山异样的秘密"},{"$f":"VLOOKUP(A95,LevelbattleConfig!A:R,18,FALSE)","v":131},"5007","","","","",5007,{"$nulls":14},{"$f":"IF(I95=\"\",\"\",VLOOKUP(I95,[3]HeroModelConfig!$A:$D,4,FALSE))","v":"穷奇"},{"$f":"IF(J95=\"\",\"\",VLOOKUP(J95,[3]HeroModelConfig!$A:$D,4,FALSE))","v":""},{"$f":"IF(K95=\"\",\"\",VLOOKUP(K95,[3]HeroModelConfig!$A:$D,4,FALSE))","v":""}]
[4026,{"$f":"VLOOKUP(A96,LevelbattleConfig!A:B,2,FALSE)","v":"被困的萤火虫"},{"$f":"VLOOKUP(A96,LevelbattleConfig!A:R,18,FALSE)","v":-1},{"$f":"_xlfn.TEXTJOIN(\";\",1,I96:K96)","v":"1008"},{"$f":"_xlfn.TEXTJOIN(\";\",1,L96:N96)","v":""},{"$f":"_xlfn.TEXTJOIN(\";\",1,O96:Q96)","v":""},{"$f":"_xlfn.TEXTJOIN(\";\",1,R96:T96)","v":""},{"$f":"_xlfn.TEXTJOIN(\";\",1,U96:W96)","v":""},1008,{"$nulls":14},{"$f":"IF(I96=\"\",\"\",VLOOKUP(I96,[3]HeroModelConfig!$A:$D,4,FALSE))","v":"蜘蛛"},{"$f":"IF(J96=\"\",\"\",VLOOKUP(J96,[3]HeroModelConfig!$A:$D,4,FALSE))","v":""},{"$f":"IF(K96=\"\",\"\",VLOOKUP(K96,[3]HeroModelConfig!$A:$D,4,FALSE))","v":""}]
[{"$nulls":23},{"$f":"IF(I97=\"\",\"\",VLOOKUP(I97,[3]HeroModelConfig!$A:$D,4,FALSE))","v":""},{"$f":"IF(J97=\"\",\"\",VLOOKUP(J97,[3]HeroModelConfig!$A:$D,4,FALSE))","v":""},{"$f":"IF(K97=\"\",\"\",VLOOKUP(K97,[3]HeroModelConfig!$A:$D,4,FALSE))","v":""}]
[5001,{"$f":"VLOOKUP(A98,LevelbattleConfig!A:B,2,FALSE)","v":"通用-法宝掉落-品质1"},{"$f":"VLOOKUP(A98,LevelbattleConfig!A:P,16,FALSE)","v":-1},{"$f":"_xlfn.TEXTJOIN(\";\",1,I98:K98)","v":"1005"},{"$f":"_xlfn.TEXTJOIN(\";\",1,L98:N98)","v":"80"},{"$f":"_xlfn.TEXTJOIN(\";\",1,O98:Q98)","v":"80"},{"$f":"_xlfn.TEXTJOIN(\";\",1,R98:T98)","v":"80"},{"$f":"_xlfn.TEXTJOIN(\";\",1,U98:W98)","v":""},1005,null,null,80,null,null,80,null,null,80,{"$nulls":5},{"$f":"IF(I98=\"\",\"\",VLOOKUP(I98,[3]HeroModelConfig!$A:$D,4,FALSE))","v":"树精"},{"$f":"IF(J98=\"\",\"\",VLOOKUP(J98,[3]HeroModelConfig!$A:$D,4,FALSE))","v":""},{"$f":"IF(K98=\"\",\"\",VLOOKUP(K98,[3]HeroModelConfig!$A:$D,4,FALSE))","v":""}]
[5002,{"$f":"VLOOKUP(A99,LevelbattleConfig!A:B,2,FALSE)","v":"通用-法宝掉落-品质2"},{"$f":"VLOOKUP(A99,LevelbattleConfig!A:P,16,FALSE)","v":-1},"1005",{"$f":"_xlfn.TEXTJOIN(\";\",1,L99:N99)","v":"90"},{"$f":"_xlfn.TEXTJOIN(\";\",1,O99:Q99)","v":"90"},{"$f":"_xlfn.TEXTJOIN(\";\",1,R99:T99)","v":"90"},{"$f":"_xlfn.TEXTJOIN(\";\",1,U99:W99)","v":""},1005,null,null,90,null,null,90,null,null,90,{"$nulls":5},{"$f":"IF(I99=\"\",\"\",VLOOKUP(I99,[3]HeroModelConfig!$A:$D,4,FALSE))","v":"树精"},{"$f":"IF(J99=\"\",\"\",VLOOKUP(J99,[3]HeroModelConfig!$A:$D,4,FALSE))","v":""},{"$f":"IF(K99=\"\",\"\",VLOOKUP(K99,[3]HeroModelConfig!$A:$D,4,FALSE))","v":""}]
[5003,{"$f":"VLOOKUP(A100,LevelbattleConfig!A:B,2,FALSE)","v":"通用-法宝掉落-品质3"},{"$f":"VLOOKUP(A100,LevelbattleConfig!A:P,16,FALSE)","v":-1},"1005","100","100","100","",1005,null,null,100,null,null,100,null,null,100,{"$nulls":5},{"$f":"IF(I100=\"\",\"\",VLOOKUP(I100,[3]HeroModelConfig!$A:$D,4,FALSE))","v":"树精"},{"$f":"IF(J100=\"\",\"\",VLOOKUP(J100,[3]HeroModelConfig!$A:$D,4,FALSE))","v":""},{"$f":"IF(K100=\"\",\"\",VLOOKUP(K100,[3]HeroModelConfig!$A:$D,4,FALSE))","v":""}]
[5004,{"$f":"VLOOKUP(A101,LevelbattleConfig!A:B,2,FALSE)","v":"通用-法宝掉落-品质4"},{"$f":"VLOOKUP(A101,LevelbattleConfig!A:P,16,FALSE)","v":-1},"1005","105","105","105","",1005,null,null,105,null,null,105,null,null,105,{"$nulls":5},{"$f":"IF(I101=\"\",\"\",VLOOKUP(I101,[3]HeroModelConfig!$A:$D,4,FALSE))","v":"树精"},{"$f":"IF(J101=\"\",\"\",VLOOKUP(J101,[3]HeroModelConfig!$A:$D,4,FALSE))","v":""},{"$f":"IF(K101=\"\",\"\",VLOOKUP(K101,[3]HeroModelConfig!$A:$D,4,FALSE))","v":""}]
[5005,{"$f":"VLOOKUP(A102,LevelbattleConfig!A:B,2,FALSE)","v":"通用-法宝掉落-品质5"},{"$f":"VLOOKUP(A102,LevelbattleConfig!A:P,16,FALSE)","v":-1},"1005","110","110","110","",1005,null,null,110,null,null,110,null,null,110,{"$nulls":5},{"$f":"IF(I102=\"\",\"\",VLOOKUP(I102,[3]HeroModelConfig!$A:$D,4,FALSE))","v":"树精"},{"$f":"IF(J102=\"\",\"\",VLOOKUP(J102,[3]HeroModelConfig!$A:$D,4,FALSE))","v":""},{"$f":"IF(K102=\"\",\"\",VLOOKUP(K102,[3]HeroModelConfig!$A:$D,4,FALSE))","v":""}]
[5006,{"$f":"VLOOKUP(A103,LevelbattleConfig!A:B,2,FALSE)","v":"通用-功法掉落-品质1"},{"$f":"VLOOKUP(A103,LevelbattleConfig!A:P,16,FALSE)","v":-1},"1006","80","80","80","",1006,null,null,80,null,null,80,null,null,80,{"$nulls":5},{"$f":"IF(I103=\"\",\"\",VLOOKUP(I103,[3]HeroModelConfig!$A:$D,4,FALSE))","v":"飞鹤"},{"$f":"IF(J103=\"\",\"\",VLOOKUP(J103,[3]HeroModelConfig!$A:$D,4,FALSE))","v":""},{"$f":"IF(K103=\"\",\"\",VLOOKUP(K103,[3]HeroModelConfig!$A:$D,4,FALSE))","v":""}]
[5007,{"$f":"VLOOKUP(A104,LevelbattleConfig!A:B,2,FALSE)","v":"通用-功法掉落-品质2"},{"$f":"VLOOKUP(A104,LevelbattleConfig!A:P,16,FALSE)","v":-1},"1006","90","90","90","",1006,null,null,90,null,null,90,null,null,90,{"$nulls":5},{"$f":"IF(I104=\"\",\"\",VLOOKUP(I104,[3]HeroModelConfig!$A:$D,4,FALSE))","v":"飞鹤"},{"$f":"IF(J104=\"\",\"\",VLOOKUP(J104,[3]HeroModelConfig!$A:$D,4,FALSE))","v":""},{"$f":"IF(K104=\"\",\"\",VLOOKUP(K104,[3]HeroModelConfig!$A:$D,4,FALSE))","v":""}]
[5008,{"$f":"VLOOKUP(A105,LevelbattleConfig!A:B,2,FALSE)","v":"通用-功法掉落-品质3"},{"$f":"VLOOKUP(A105,LevelbattleConfig!A:P,16,FALSE)","v":-1},"1006","100","100","100","",1006,null,null,100,null,null,100,null,null,100,{"$nulls":5},{"$f":"IF(I105=\"\",\"\",VLOOKUP(I105,[3]HeroModelConfig!$A:$D,4,FALSE))","v":"飞鹤"},{"$f":"IF(J105=\"\",\"\",VLOOKUP(J105,[3]HeroModelConfig!$A:$D,4,FALSE))","v":""},{"$f":"IF(K105=\"\",\"\",VLOOKUP(K105,[3]HeroModelConfig!$A:$D,4,FALSE))","v":""}]
[5009,{"$f":"VLOOKUP(A106,LevelbattleConfig!A:B,2,FALSE)","v":"通用-功法掉落-品质4"},{"$f":"VLOOKUP(A106,LevelbattleConfig!A:P,16,FALSE)","v":-1},"1006","105","105","105","",1006,null,null,105,null,null,105,null,null,105,{"$nulls":5},{"$f":"IF(I106=\"\",\"\",VLOOKUP(I106,[3]HeroModelConfig!$A:$D,4,FALSE))","v":"飞鹤"},{"$f":"IF(J106=\"\",\"\",VLOOKUP(J106,[3]HeroModelConfig!$A:$D,4,FALSE))","v":""},{"$f":"IF(K106=\"\",\"\",VLOOKUP(K106,[3]HeroModelConfig!$A:$D,4,FALSE))","v":""}]
[5010,{"$f":"VLOOKUP(A107,LevelbattleConfig!A:B,2,FALSE)","v":"通用-功法掉落-品质5"},{"$f":"VLOOKUP(A107,LevelbattleConfig!A:P,16,FALSE)","v":-1},"1006","110","110","110","",1006,null,null,110,null,null,110,null,null,110,{"$nulls":5},{"$f":"IF(I107=\"\",\"\",VLOOKUP(I107,[3]HeroModelConfig!$A:$D,4,FALSE))","v":"飞鹤"},{"$f":"IF(J107=\"\",\"\",VLOOKUP(J107,[3]HeroModelConfig!$A:$D,4,FALSE))","v":""},{"$f":"IF(K107=\"\",\"\",VLOOKUP(K107,[3]HeroModelConfig!$A:$D,4,FALSE))","v":""}]
[5011,{"$f":"VLOOKUP(A108,LevelbattleConfig!A:B,2,FALSE)","v":"通用-灵石掉落-品质1"},{"$f":"VLOOKUP(A108,LevelbattleConfig!A:P,16,FALSE)","v":-1},{"$f":"_xlfn.TEXTJOIN(\";\",1,I108:K108)","v":"1007"},{"$f":"_xlfn.TEXTJOIN(\";\",1,L108:N108)","v":"80"},{"$f":"_xlfn.TEXTJOIN(\";\",1,O108:Q108)","v":"80"},{"$f":"_xlfn.TEXTJOIN(\";\",1,R108:T108)","v":"80"},{"$f":"_xlfn.TEXTJOIN(\";\",1,U108:W108)","v":""},1007,null,null,80,null,null,80,null,null,80,{"$nulls":5},{"$f":"IF(I108=\"\",\"\",VLOOKUP(I108,[3]HeroModelConfig!$A:$D,4,FALSE))","v":"灵狐"},{"$f":"IF(J108=\"\",\"\",VLOOKUP(J108,[3]HeroModelConfig!$A:$D,4,FALSE))","v":""},{"$f":"IF(K108=\"\",\"\",VLOOKUP(K108,[3]HeroModelConfig!$A:$D,4,FALSE))","v":""}]
[5012,{"$f":"VLOOKUP(A109,LevelbattleConfig!A:B,2,FALSE)","v":"通用-灵石掉落-品质2"},{"$f":"VLOOKUP(A109,LevelbattleConfig!A:P,16,FALSE)","v":-1},"1007","90","90","90","",1007,null,null,90,null,null,90,null,null,90,{"$nulls":5},{"$f":"IF(I109=\"\",\"\",VLOOKUP(I109,[3]HeroModelConfig!$A:$D,4,FALSE))","v":"灵狐"},{"$f":"IF(J109=\"\",\"\",VLOOKUP(J109,[3]HeroModelConfig!$A:$D,4,FALSE))","v":""},{"$f":"IF(K109=\"\",\"\",VLOOKUP(K109,[3]HeroModelConfig!$A:$D,4,FALSE))","v":""}]
[5013,{"$f":"VLOOKUP(A110,LevelbattleConfig!A:B,2,FALSE)","v":"通用-灵石掉落-品质3"},{"$f":"VLOOKUP(A110,LevelbattleConfig!A:P,16,FALSE)","v":-1},"1007","100","100","100","",1007,null,null,100,null,null,100,null,null,100,{"$nulls":5},{"$f":"IF(I110=\"\",\"\",VLOOKUP(I110,[3]HeroModelConfig!$A:$D,4,FALSE))","v":"灵狐"},{"$f":"IF(J110=\"\",\"\",VLOOKUP(J110,[3]HeroModelConfig!$A:$D,4,FALSE))","v":""},{"$f":"IF(K110=\"\",\"\",VLOOKUP(K110,[3]HeroModelConfig!$A:$D,4,FALSE))","v":""}]
[5014,{"$f":"VLOOKUP(A111,LevelbattleConfig!A:B,2,FALSE)","v":"通用-灵石掉落-品质4"},{"$f":"VLOOKUP(A111,LevelbattleConfig!A:P,16,FALSE)","v":-1},"1007","105","105","105","",1007,null,null,105,null,null,105,null,null,105,{"$nulls":5},{"$f":"IF(I111=\"\",\"\",VLOOKUP(I111,[3]HeroModelConfig!$A:$D,4,FALSE))","v":"灵狐"},{"$f":"IF(J111=\"\",\"\",VLOOKUP(J111,[3]HeroModelConfig!$A:$D,4,FALSE))","v":""},{"$f":"IF(K111=\"\",\"\",VLOOKUP(K111,[3]HeroModelConfig!$A:$D,4,FALSE))","v":""}]
[5015,{"$f":"VLOOKUP(A112,LevelbattleConfig!A:B,2,FALSE)","v":"通用-灵石掉落-品质5"},{"$f":"VLOOKUP(A112,LevelbattleConfig!A:P,16,FALSE)","v":-1},"1007","110","110","110","",1007,null,null,110,null,null,110,null,null,110,{"$nulls":5},{"$f":"IF(I112=\"\",\"\",VLOOKUP(I112,[3]HeroModelConfig!$A:$D,4,FALSE))","v":"灵狐"},{"$f":"IF(J112=\"\",\"\",VLOOKUP(J112,[3]HeroModelConfig!$A:$D,4,FALSE))","v":""},{"$f":"IF(K112=\"\",\"\",VLOOKUP(K112,[3]HeroModelConfig!$A:$D,4,FALSE))","v":""}]
[5016,{"$f":"VLOOKUP(A113,LevelbattleConfig!A:B,2,FALSE)","v":"通用-妖丹掉落-品质1"},{"$f":"VLOOKUP(A113,LevelbattleConfig!A:P,16,FALSE)","v":-1},{"$f":"_xlfn.TEXTJOIN(\";\",1,I113:K113)","v":"1008"},{"$f":"_xlfn.TEXTJOIN(\";\",1,L113:N113)","v":"80"},{"$f":"_xlfn.TEXTJOIN(\";\",1,O113:Q113)","v":"80"},{"$f":"_xlfn.TEXTJOIN(\";\",1,R113:T113)","v":"80"},{"$f":"_xlfn.TEXTJOIN(\";\",1,U113:W113)","v":""},1008,null,null,80,null,null,80,null,null,80,{"$nulls":5},{"$f":"IF(I113=\"\",\"\",VLOOKUP(I113,[3]HeroModelConfig!$A:$D,4,FALSE))","v":"蜘蛛"},{"$f":"IF(J113=\"\",\"\",VLOOKUP(J113,[3]HeroModelConfig!$A:$D,4,FALSE))","v":""},{"$f":"IF(K113=\"\",\"\",VLOOKUP(K113,[3]HeroModelConfig!$A:$D,4,FALSE))","v":""}]
[5017,{"$f":"VLOOKUP(A114,LevelbattleConfig!A:B,2,FALSE)","v":"通用-妖丹掉落-品质2"},{"$f":"VLOOKUP(A114,LevelbattleConfig!A:P,16,FALSE)","v":-1},"1008","90","90","90","",1008,null,null,90,null,null,90,null,null,90,{"$nulls":5},{"$f":"IF(I114=\"\",\"\",VLOOKUP(I114,[3]HeroModelConfig!$A:$D,4,FALSE))","v":"蜘蛛"},{"$f":"IF(J114=\"\",\"\",VLOOKUP(J114,[3]HeroModelConfig!$A:$D,4,FALSE))","v":""},{"$f":"IF(K114=\"\",\"\",VLOOKUP(K114,[3]HeroModelConfig!$A:$D,4,FALSE))","v":""}]
[5018,{"$f":"VLOOKUP(A115,LevelbattleConfig!A:B,2,FALSE)","v":"通用-妖丹掉落-品质3"},{"$f":"VLOOKUP(A115,LevelbattleConfig!A:P,16,FALSE)","v":-1},"1008","100","100","100","",1008,null,null,100,null,null,100,null,null,100,{"$nulls":5},{"$f":"IF(I115=\"\",\"\",VLOOKUP(I115,[3]HeroModelConfig!$A:$D,4,FALSE))","v":"蜘蛛"},{"$f":"IF(J115=\"\",\"\",VLOOKUP(J115,[3]HeroModelConfig!$A:$D,4,FALSE))","v":""},{"$f":"IF(K115=\"\",\"\",VLOOKUP(K115,[3]HeroModelConfig!$A:$D,4,FALSE))","v":""}]
[5019,{"$f":"VLOOKUP(A116,LevelbattleConfig!A:B,2,FALSE)","v":"通用-妖丹掉落-品质4"},{"$f":"VLOOKUP(A116,LevelbattleConfig!A:P,16,FALSE)","v":-1},"1008","105","105","105","",1008,null,null,105,null,null,105,null,null,105,{"$nulls":5},{"$f":"IF(I116=\"\",\"\",VLOOKUP(I116,[3]HeroModelConfig!$A:$D,4,FALSE))","v":"蜘蛛"},{"$f":"IF(J116=\"\",\"\",VLOOKUP(J116,[3]HeroModelConfig!$A:$D,4,FALSE))","v":""},{"$f":"IF(K116=\"\",\"\",VLOOKUP(K116,[3]HeroModelConfig!$A:$D,4,FALSE))","v":""}]
[5020,{"$f":"VLOOKUP(A117,LevelbattleConfig!A:B,2,FALSE)","v":"通用-妖丹掉落-品质5"},{"$f":"VLOOKUP(A117,LevelbattleConfig!A:P,16,FALSE)","v":-1},"1008","110","110","110","",1008,null,null,110,null,null,110,null,null,110,{"$nulls":5},{"$f":"IF(I117=\"\",\"\",VLOOKUP(I117,[3]HeroModelConfig!$A:$D,4,FALSE))","v":"蜘蛛"},{"$f":"IF(J117=\"\",\"\",VLOOKUP(J117,[3]HeroModelConfig!$A:$D,4,FALSE))","v":""},{"$f":"IF(K117=\"\",\"\",VLOOKUP(K117,[3]HeroModelConfig!$A:$D,4,FALSE))","v":""}]
[5021,{"$f":"VLOOKUP(A118,LevelbattleConfig!A:B,2,FALSE)","v":"通用-渡劫动态道具掉落-品质1"},{"$f":"VLOOKUP(A118,LevelbattleConfig!A:P,16,FALSE)","v":-1},"1001;1003","64;32","56;29","54;26","",1001,1003,null,{"$f":"ROUND(L98*0.8,0)","v":64},{"$f":"ROUND(L98*0.4,0)","v":32},null,{"$f":"ROUND(O98*0.7,0)","v":56},{"$f":"ROUND(O98*0.36,0)","v":29},null,{"$f":"ROUND(R98*0.67,0)","v":54},{"$f":"ROUND(R98*0.33,0)","v":26},{"$nulls":4},{"$f":"IF(I118=\"\",\"\",VLOOKUP(I118,[3]HeroModelConfig!$A:$D,4,FALSE))","v":"蒙面男子"},{"$f":"IF(J118=\"\",\"\",VLOOKUP(J118,[3]HeroModelConfig!$A:$D,4,FALSE))","v":"蒙面女子"},{"$f":"IF(K118=\"\",\"\",VLOOKUP(K118,[3]HeroModelConfig!$A:$D,4,FALSE))","v":""}]
[5022,{"$f":"VLOOKUP(A119,LevelbattleConfig!A:B,2,FALSE)","v":"通用-渡劫动态道具掉落-品质2"},{"$f":"VLOOKUP(A119,LevelbattleConfig!A:P,16,FALSE)","v":-1},"1001;1003","72;36","63;32","54;30","",1001,1003,null,{"$f":"ROUND(L99*0.8,0)","v":72},{"$f":"ROUND(L99*0.4,0)","v":36},null,{"$f":"ROUND(O99*0.7,0)","v":63},{"$f":"ROUND(O99*0.36,0)","v":32},null,{"$f":"R99*0.6","v":54},{"$f":"ROUND(R99*0.33,0)","v":30},{"$nulls":4},{"$f":"IF(I119=\"\",\"\",VLOOKUP(I119,[3]HeroModelConfig!$A:$D,4,FALSE))","v":"蒙面男子"},{"$f":"IF(J119=\"\",\"\",VLOOKUP(J119,[3]HeroModelConfig!$A:$D,4,FALSE))","v":"蒙面女子"},{"$f":"IF(K119=\"\",\"\",VLOOKUP(K119,[3]HeroModelConfig!$A:$D,4,FALSE))","v":""}]
[5023,{"$f":"VLOOKUP(A120,LevelbattleConfig!A:B,2,FALSE)","v":"通用-渡劫动态道具掉落-品质3"},{"$f":"VLOOKUP(A120,LevelbattleConfig!A:P,16,FALSE)","v":-1},"1001;1003","80;40","70;36","60;33","",1001,1003,null,80,40,null,70,36,null,60,33,{"$nulls":4},{"$f":"IF(I120=\"\",\"\",VLOOKUP(I120,[3]HeroModelConfig!$A:$D,4,FALSE))","v":"蒙面男子"},{"$f":"IF(J120=\"\",\"\",VLOOKUP(J120,[3]HeroModelConfig!$A:$D,4,FALSE))","v":"蒙面女子"},{"$f":"IF(K120=\"\",\"\",VLOOKUP(K120,[3]HeroModelConfig!$A:$D,4,FALSE))","v":""}]
[5024,{"$f":"VLOOKUP(A121,LevelbattleConfig!A:B,2,FALSE)","v":"通用-渡劫动态道具掉落-品质4"},{"$f":"VLOOKUP(A121,LevelbattleConfig!A:P,16,FALSE)","v":-1},"1001;1003","84;42","74;38","63;35","",1001,1003,null,84,42,null,74,38,null,63,35,{"$nulls":4},{"$f":"IF(I121=\"\",\"\",VLOOKUP(I121,[3]HeroModelConfig!$A:$D,4,FALSE))","v":"蒙面男子"},{"$f":"IF(J121=\"\",\"\",VLOOKUP(J121,[3]HeroModelConfig!$A:$D,4,FALSE))","v":"蒙面女子"},{"$f":"IF(K121=\"\",\"\",VLOOKUP(K121,[3]HeroModelConfig!$A:$D,4,FALSE))","v":""}]
[5025,{"$f":"VLOOKUP(A122,LevelbattleConfig!A:B,2,FALSE)","v":"通用-渡劫动态道具掉落-品质5"},{"$f":"VLOOKUP(A122,LevelbattleConfig!A:P,16,FALSE)","v":-1},"1001;1003","88;44","77;40","66;36","",1001,1003,null,88,44,null,77,40,null,66,36,{"$nulls":4},{"$f":"IF(I122=\"\",\"\",VLOOKUP(I122,[3]HeroModelConfig!$A:$D,4,FALSE))","v":"蒙面男子"},{"$f":"IF(J122=\"\",\"\",VLOOKUP(J122,[3]HeroModelConfig!$A:$D,4,FALSE))","v":"蒙面女子"},{"$f":"IF(K122=\"\",\"\",VLOOKUP(K122,[3]HeroModelConfig!$A:$D,4,FALSE))","v":""}]
[{"$nulls":23},{"$f":"IF(I123=\"\",\"\",VLOOKUP(I123,[3]HeroModelConfig!$A:$D,4,FALSE))","v":""},{"$f":"IF(J123=\"\",\"\",VLOOKUP(J123,[3]HeroModelConfig!$A:$D,4,FALSE))","v":""},{"$f":"IF(K123=\"\",\"\",VLOOKUP(K123,[3]HeroModelConfig!$A:$D,4,FALSE))","v":""}]
[2001,"命运峰-第1层",{"$f":"VLOOKUP(A124,[2]TowerInfoConfig!$H:$P,9,FALSE)","v":31},{"$f":"_xlfn.TEXTJOIN(\";\",1,I124:K124)","v":"5001"},{"$f":"_xlfn.TEXTJOIN(\";\",1,L124:N124)","v":""},{"$f":"_xlfn.TEXTJOIN(\";\",1,O124:Q124)","v":""},{"$f":"_xlfn.TEXTJOIN(\";\",1,R124:T124)","v":""},{"$f":"_xlfn.TEXTJOIN(\";\",1,U124:W124)","v":""},5001,{"$nulls":14},{"$f":"IF(I124=\"\",\"\",VLOOKUP(I124,[3]HeroModelConfig!$A:$D,4,FALSE))","v":"金修精英"},{"$f":"IF(J124=\"\",\"\",VLOOKUP(J124,[3]HeroModelConfig!$A:$D,4,FALSE))","v":""},{"$f":"IF(K124=\"\",\"\",VLOOKUP(K124,[3]HeroModelConfig!$A:$D,4,FALSE))","v":""}]
[2002,"命运峰-第2层",{"$f":"VLOOKUP(A125,[2]TowerInfoConfig!$H:$P,9,FALSE)","v":33},"5002","","","","",5002,{"$nulls":14},{"$f":"IF(I125=\"\",\"\",VLOOKUP(I125,[3]HeroModelConfig!$A:$D,4,FALSE))","v":"水修精英"},{"$f":"IF(J125=\"\",\"\",VLOOKUP(J125,[3]HeroModelConfig!$A:$D,4,FALSE))","v":""},{"$f":"IF(K125=\"\",\"\",VLOOKUP(K125,[3]HeroModelConfig!$A:$D,4,FALSE))","v":""}]
[2003,"命运峰-第3层",{"$f":"VLOOKUP(A126,[2]TowerInfoConfig!$H:$P,9,FALSE)","v":36},"5003","","","","",5003,{"$nulls":14},{"$f":"IF(I126=\"\",\"\",VLOOKUP(I126,[3]HeroModelConfig!$A:$D,4,FALSE))","v":"木修精英"},{"$f":"IF(J126=\"\",\"\",VLOOKUP(J126,[3]HeroModelConfig!$A:$D,4,FALSE))","v":""},{"$f":"IF(K126=\"\",\"\",VLOOKUP(K126,[3]HeroModelConfig!$A:$D,4,FALSE))","v":""}]
[2004,"命运峰-第4层",{"$f":"VLOOKUP(A127,[2]TowerInfoConfig!$H:$P,9,FALSE)","v":39},"5004","","","","",5004,{"$nulls":14},{"$f":"IF(I127=\"\",\"\",VLOOKUP(I127,[3]HeroModelConfig!$A:$D,4,FALSE))","v":"火修精英"},{"$f":"IF(J127=\"\",\"\",VLOOKUP(J127,[3]HeroModelConfig!$A:$D,4,FALSE))","v":""},{"$f":"IF(K127=\"\",\"\",VLOOKUP(K127,[3]HeroModelConfig!$A:$D,4,FALSE))","v":""}]
[2005,"命运峰-第5层",{"$f":"VLOOKUP(A128,[2]TowerInfoConfig!$H:$P,9,FALSE)","v":41},"9001","","","","",9001,{"$nulls":14},{"$f":"IF(I128=\"\",\"\",VLOOKUP(I128,[3]HeroModelConfig!$A:$D,4,FALSE))","v":"boss"},{"$f":"IF(J128=\"\",\"\",VLOOKUP(J128,[3]HeroModelConfig!$A:$D,4,FALSE))","v":""},{"$f":"IF(K128=\"\",\"\",VLOOKUP(K128,[3]HeroModelConfig!$A:$D,4,FALSE))","v":""}]
[2006,"命运峰-第6层",{"$f":"VLOOKUP(A129,[2]TowerInfoConfig!$H:$P,9,FALSE)","v":43},"5004","","","","",5004,{"$nulls":14},{"$f":"IF(I129=\"\",\"\",VLOOKUP(I129,[3]HeroModelConfig!$A:$D,4,FALSE))","v":"火修精英"},{"$f":"IF(J129=\"\",\"\",VLOOKUP(J129,[3]HeroModelConfig!$A:$D,4,FALSE))","v":""},{"$f":"IF(K129=\"\",\"\",VLOOKUP(K129,[3]HeroModelConfig!$A:$D,4,FALSE))","v":""}]
[2007,"命运峰-第7层",{"$f":"VLOOKUP(A130,[2]TowerInfoConfig!$H:$P,9,FALSE)","v":46},"5005","","","","",5005,{"$nulls":14},{"$f":"IF(I130=\"\",\"\",VLOOKUP(I130,[3]HeroModelConfig!$A:$D,4,FALSE))","v":"土系怪"},{"$f":"IF(J130=\"\",\"\",VLOOKUP(J130,[3]HeroModelConfig!$A:$D,4,FALSE))","v":""},{"$f":"IF(K130=\"\",\"\",VLOOKUP(K130,[3]HeroModelConfig!$A:$D,4,FALSE))","v":""}]
[2008,"命运峰-第8层",{"$f":"VLOOKUP(A131,[2]TowerInfoConfig!$H:$P,9,FALSE)","v":49},"5006","","","","",5006,{"$nulls":14},{"$f":"IF(I131=\"\",\"\",VLOOKUP(I131,[3]HeroModelConfig!$A:$D,4,FALSE))","v":"鼠先锋 "},{"$f":"IF(J131=\"\",\"\",VLOOKUP(J131,[3]HeroModelConfig!$A:$D,4,FALSE))","v":""},{"$f":"IF(K131=\"\",\"\",VLOOKUP(K131,[3]HeroModelConfig!$A:$D,4,FALSE))","v":""}]
[2009,"命运峰-第9层",{"$f":"VLOOKUP(A132,[2]TowerInfoConfig!$H:$P,9,FALSE)","v":51},"5007","","","","",5007,{"$nulls":14},{"$f":"IF(I132=\"\",\"\",VLOOKUP(I132,[3]HeroModelConfig!$A:$D,4,FALSE))","v":"穷奇"},{"$f":"IF(J132=\"\",\"\",VLOOKUP(J132,[3]HeroModelConfig!$A:$D,4,FALSE))","v":""},{"$f":"IF(K132=\"\",\"\",VLOOKUP(K132,[3]HeroModelConfig!$A:$D,4,FALSE))","v":""}]
[2010,"命运峰-第10层",{"$f":"VLOOKUP(A133,[2]TowerInfoConfig!$H:$P,9,FALSE)","v":53},"9002","","","","",9002,{"$nulls":14},{"$f":"IF(I133=\"\",\"\",VLOOKUP(I133,[3]HeroModelConfig!$A:$D,4,FALSE))","v":"凤凰"},{"$f":"IF(J133=\"\",\"\",VLOOKUP(J133,[3]HeroModelConfig!$A:$D,4,FALSE))","v":""},{"$f":"IF(K133=\"\",\"\",VLOOKUP(K133,[3]HeroModelConfig!$A:$D,4,FALSE))","v":""}]
[2011,"命运峰-第11层",{"$f":"VLOOKUP(A134,[2]TowerInfoConfig!$H:$P,9,FALSE)","v":56},"5001","","","","",5001,{"$nulls":14},{"$f":"IF(I134=\"\",\"\",VLOOKUP(I134,[3]HeroModelConfig!$A:$D,4,FALSE))","v":"金修精英"},{"$f":"IF(J134=\"\",\"\",VLOOKUP(J134,[3]HeroModelConfig!$A:$D,4,FALSE))","v":""},{"$f":"IF(K134=\"\",\"\",VLOOKUP(K134,[3]HeroModelConfig!$A:$D,4,FALSE))","v":""}]
[2012,"命运峰-第12层",{"$f":"VLOOKUP(A135,[2]TowerInfoConfig!$H:$P,9,FALSE)","v":59},"5002","","","","",5002,{"$nulls":14},{"$f":"IF(I135=\"\",\"\",VLOOKUP(I135,[3]HeroModelConfig!$A:$D,4,FALSE))","v":"水修精英"},{"$f":"IF(J135=\"\",\"\",VLOOKUP(J135,[3]HeroModelConfig!$A:$D,4,FALSE))","v":""},{"$f":"IF(K135=\"\",\"\",VLOOKUP(K135,[3]HeroModelConfig!$A:$D,4,FALSE))","v":""}]
[2013,"命运峰-第13层",{"$f":"VLOOKUP(A136,[2]TowerInfoConfig!$H:$P,9,FALSE)","v":61},"5003","","","","",5003,{"$nulls":14},{"$f":"IF(I136=\"\",\"\",VLOOKUP(I136,[3]HeroModelConfig!$A:$D,4,FALSE))","v":"木修精英"},{"$f":"IF(J136=\"\",\"\",VLOOKUP(J136,[3]HeroModelConfig!$A:$D,4,FALSE))","v":""},{"$f":"IF(K136=\"\",\"\",VLOOKUP(K136,[3]HeroModelConfig!$A:$D,4,FALSE))","v":""}]
[2014,"命运峰-第14层",{"$f":"VLOOKUP(A137,[2]TowerInfoConfig!$H:$P,9,FALSE)","v":63},"5004","","","","",5004,{"$nulls":14},{"$f":"IF(I137=\"\",\"\",VLOOKUP(I137,[3]HeroModelConfig!$A:$D,4,FALSE))","v":"火修精英"},{"$f":"IF(J137=\"\",\"\",VLOOKUP(J137,[3]HeroModelConfig!$A:$D,4,FALSE))","v":""},{"$f":"IF(K137=\"\",\"\",VLOOKUP(K137,[3]HeroModelConfig!$A:$D,4,FALSE))","v":""}]
[2015,"命运峰-第15层",{"$f":"VLOOKUP(A138,[2]TowerInfoConfig!$H:$P,9,FALSE)","v":66},"9003","","","","",9003,{"$nulls":14},{"$f":"IF(I138=\"\",\"\",VLOOKUP(I138,[3]HeroModelConfig!$A:$D,4,FALSE))","v":"北海神龟"},{"$f":"IF(J138=\"\",\"\",VLOOKUP(J138,[3]HeroModelConfig!$A:$D,4,FALSE))","v":""},{"$f":"IF(K138=\"\",\"\",VLOOKUP(K138,[3]HeroModelConfig!$A:$D,4,FALSE))","v":""}]
[2016,"命运峰-第16层",{"$f":"VLOOKUP(A139,[2]TowerInfoConfig!$H:$P,9,FALSE)","v":69},"5004","","","","",5004,{"$nulls":14},{"$f":"IF(I139=\"\",\"\",VLOOKUP(I139,[3]HeroModelConfig!$A:$D,4,FALSE))","v":"火修精英"},{"$f":"IF(J139=\"\",\"\",VLOOKUP(J139,[3]HeroModelConfig!$A:$D,4,FALSE))","v":""},{"$f":"IF(K139=\"\",\"\",VLOOKUP(K139,[3]HeroModelConfig!$A:$D,4,FALSE))","v":""}]
[2017,"命运峰-第17层",{"$f":"VLOOKUP(A140,[2]TowerInfoConfig!$H:$P,9,FALSE)","v":71},"5005","","","","",5005,{"$nulls":14},{"$f":"IF(I140=\"\",\"\",VLOOKUP(I140,[3]HeroModelConfig!$A:$D,4,FALSE))","v":"土系怪"},{"$f":"IF(J140=\"\",\"\",VLOOKUP(J140,[3]HeroModelConfig!$A:$D,4,FALSE))","v":""},{"$f":"IF(K140=\"\",\"\",VLOOKUP(K140,[3]HeroModelConfig!$A:$D,4,FALSE))","v":""}]
[2018,"命运峰-第18层",{"$f":"VLOOKUP(A141,[2]TowerInfoConfig!$H:$P,9,FALSE)","v":73},"5006","","","","",5006,{"$nulls":14},{"$f":"IF(I141=\"\",\"\",VLOOKUP(I141,[3]HeroModelConfig!$A:$D,4,FALSE))","v":"鼠先锋 "},{"$f":"IF(J141=\"\",\"\",VLOOKUP(J141,[3]HeroModelConfig!$A:$D,4,FALSE))","v":""},{"$f":"IF(K141=\"\",\"\",VLOOKUP(K141,[3]HeroModelConfig!$A:$D,4,FALSE))","v":""}]
[2019,"命运峰-第19层",{"$f":"VLOOKUP(A142,[2]TowerInfoConfig!$H:$P,9,FALSE)","v":76},"5007","","","","",5007,{"$nulls":14},{"$f":"IF(I142=\"\",\"\",VLOOKUP(I142,[3]HeroModelConfig!$A:$D,4,FALSE))","v":"穷奇"},{"$f":"IF(J142=\"\",\"\",VLOOKUP(J142,[3]HeroModelConfig!$A:$D,4,FALSE))","v":""},{"$f":"IF(K142=\"\",\"\",VLOOKUP(K142,[3]HeroModelConfig!$A:$D,4,FALSE))","v":""}]
[2020,"命运峰-第20层",{"$f":"VLOOKUP(A143,[2]TowerInfoConfig!$H:$P,9,FALSE)","v":79},"9004","","","","",9004,{"$nulls":14},{"$f":"IF(I143=\"\",\"\",VLOOKUP(I143,[3]HeroModelConfig!$A:$D,4,FALSE))","v":"樗木之灵"},{"$f":"IF(J143=\"\",\"\",VLOOKUP(J143,[3]HeroModelConfig!$A:$D,4,FALSE))","v":""},{"$f":"IF(K143=\"\",\"\",VLOOKUP(K143,[3]HeroModelConfig!$A:$D,4,FALSE))","v":""}]
[2021,"命运峰-第21层",{"$f":"VLOOKUP(A144,[2]TowerInfoConfig!$H:$P,9,FALSE)","v":81},{"$f":"_xlfn.TEXTJOIN(\";\",1,I144:K144)","v":"5001"},{"$f":"_xlfn.TEXTJOIN(\";\",1,L144:N144)","v":""},{"$f":"_xlfn.TEXTJOIN(\";\",1,O144:Q144)","v":""},{"$f":"_xlfn.TEXTJOIN(\";\",1,R144:T144)","v":""},{"$f":"_xlfn.TEXTJOIN(\";\",1,U144:W144)","v":""},5001,{"$nulls":14},{"$f":"IF(I144=\"\",\"\",VLOOKUP(I144,[3]HeroModelConfig!$A:$D,4,FALSE))","v":"金修精英"},{"$f":"IF(J144=\"\",\"\",VLOOKUP(J144,[3]HeroModelConfig!$A:$D,4,FALSE))","v":""},{"$f":"IF(K144=\"\",\"\",VLOOKUP(K144,[3]HeroModelConfig!$A:$D,4,FALSE))","v":""}]
[2022,"命运峰-第22层",{"$f":"VLOOKUP(A145,[2]TowerInfoConfig!$H:$P,9,FALSE)","v":83},"5002","","","","",5002,{"$nulls":14},{"$f":"IF(I145=\"\",\"\",VLOOKUP(I145,[3]HeroModelConfig!$A:$D,4,FALSE))","v":"水修精英"},{"$f":"IF(J145=\"\",\"\",VLOOKUP(J145,[3]HeroModelConfig!$A:$D,4,FALSE))","v":""},{"$f":"IF(K145=\"\",\"\",VLOOKUP(K145,[3]HeroModelConfig!$A:$D,4,FALSE))","v":""}]
[2023,"命运峰-第23层",{"$f":"VLOOKUP(A146,[2]TowerInfoConfig!$H:$P,9,FALSE)","v":86},"5003","","","","",5003,{"$nulls":14},{"$f":"IF(I146=\"\",\"\",VLOOKUP(I146,[3]HeroModelConfig!$A:$D,4,FALSE))","v":"木修精英"},{"$f":"IF(J146=\"\",\"\",VLOOKUP(J146,[3]HeroModelConfig!$A:$D,4,FALSE))","v":""},{"$f":"IF(K146=\"\",\"\",VLOOKUP(K146,[3]HeroModelConfig!$A:$D,4,FALSE))","v":""}]
[2024,"命运峰-第24层",{"$f":"VLOOKUP(A147,[2]TowerInfoConfig!$H:$P,9,FALSE)","v":89},"5004","","","","",5004,{"$nulls":14},{"$f":"IF(I147=\"\",\"\",VLOOKUP(I147,[3]HeroModelConfig!$A:$D,4,FALSE))","v":"火修精英"},{"$f":"IF(J147=\"\",\"\",VLOOKUP(J147,[3]HeroModelConfig!$A:$D,4,FALSE))","v":""},{"$f":"IF(K147=\"\",\"\",VLOOKUP(K147,[3]HeroModelConfig!$A:$D,4,FALSE))","v":""}]
[2025,"命运峰-第25层",{"$f":"VLOOKUP(A148,[2]TowerInfoConfig!$H:$P,9,FALSE)","v":91},"9005","","","","",9005,{"$nulls":14},{"$f":"IF(I148=\"\",\"\",VLOOKUP(I148,[3]HeroModelConfig!$A:$D,4,FALSE))","v":"心魔"},{"$f":"IF(J148=\"\",\"\",VLOOKUP(J148,[3]HeroModelConfig!$A:$D,4,FALSE))","v":""},{"$f":"IF(K148=\"\",\"\",VLOOKUP(K148,[3]HeroModelConfig!$A:$D,4,FALSE))","v":""}]
[2026,"命运峰-第26层",{"$f":"VLOOKUP(A149,[2]TowerInfoConfig!$H:$P,9,FALSE)","v":93},"5004","","","","",5004,{"$nulls":14},{"$f":"IF(I149=\"\",\"\",VLOOKUP(I149,[3]HeroModelConfig!$A:$D,4,FALSE))","v":"火修精英"},{"$f":"IF(J149=\"\",\"\",VLOOKUP(J149,[3]HeroModelConfig!$A:$D,4,FALSE))","v":""},{"$f":"IF(K149=\"\",\"\",VLOOKUP(K149,[3]HeroModelConfig!$A:$D,4,FALSE))","v":""}]
[2027,"命运峰-第27层",{"$f":"VLOOKUP(A150,[2]TowerInfoConfig!$H:$P,9,FALSE)","v":96},"5005","","","","",5005,{"$nulls":14},{"$f":"IF(I150=\"\",\"\",VLOOKUP(I150,[3]HeroModelConfig!$A:$D,4,FALSE))","v":"土系怪"},{"$f":"IF(J150=\"\",\"\",VLOOKUP(J150,[3]HeroModelConfig!$A:$D,4,FALSE))","v":""},{"$f":"IF(K150=\"\",\"\",VLOOKUP(K150,[3]HeroModelConfig!$A:$D,4,FALSE))","v":""}]
[2028,"命运峰-第28层",{"$f":"VLOOKUP(A151,[2]TowerInfoConfig!$H:$P,9,FALSE)","v":99},"5006","","","","",5006,{"$nulls":14},{"$f":"IF(I151=\"\",\"\",VLOOKUP(I151,[3]HeroModelConfig!$A:$D,4,FALSE))","v":"鼠先锋 "},{"$f":"IF(J151=\"\",\"\",VLOOKUP(J151,[3]HeroModelConfig!$A:$D,4,FALSE))","v":""},{"$f":"IF(K151=\"\",\"\",VLOOKUP(K151,[3]HeroModelConfig!$A:$D,4,FALSE))","v":""}]
[2029,"命运峰-第29层",{"$f":"VLOOKUP(A152,[2]TowerInfoConfig!$H:$P,9,FALSE)","v":101},"5007","","","","",5007,{"$nulls":14},{"$f":"IF(I152=\"\",\"\",VLOOKUP(I152,[3]HeroModelConfig!$A:$D,4,FALSE))","v":"穷奇"},{"$f":"IF(J152=\"\",\"\",VLOOKUP(J152,[3]HeroModelConfig!$A:$D,4,FALSE))","v":""},{"$f":"IF(K152=\"\",\"\",VLOOKUP(K152,[3]HeroModelConfig!$A:$D,4,FALSE))","v":""}]
[2030,"命运峰-第30层",{"$f":"VLOOKUP(A153,[2]TowerInfoConfig!$H:$P,9,FALSE)","v":103},"9002","","","","",9002,{"$nulls":14},{"$f":"IF(I153=\"\",\"\",VLOOKUP(I153,[3]HeroModelConfig!$A:$D,4,FALSE))","v":"凤凰"},{"$f":"IF(J153=\"\",\"\",VLOOKUP(J153,[3]HeroModelConfig!$A:$D,4,FALSE))","v":""},{"$f":"IF(K153=\"\",\"\",VLOOKUP(K153,[3]HeroModelConfig!$A:$D,4,FALSE))","v":""}]
[2031,"命运峰-第31层",{"$f":"VLOOKUP(A154,[2]TowerInfoConfig!$H:$P,9,FALSE)","v":106},"5001","","","","",5001,{"$nulls":14},{"$f":"IF(I154=\"\",\"\",VLOOKUP(I154,[3]HeroModelConfig!$A:$D,4,FALSE))","v":"金修精英"},{"$f":"IF(J154=\"\",\"\",VLOOKUP(J154,[3]HeroModelConfig!$A:$D,4,FALSE))","v":""},{"$f":"IF(K154=\"\",\"\",VLOOKUP(K154,[3]HeroModelConfig!$A:$D,4,FALSE))","v":""}]
[2032,"命运峰-第32层",{"$f":"VLOOKUP(A155,[2]TowerInfoConfig!$H:$P,9,FALSE)","v":109},"5002","","","","",5002,{"$nulls":14},{"$f":"IF(I155=\"\",\"\",VLOOKUP(I155,[3]HeroModelConfig!$A:$D,4,FALSE))","v":"水修精英"},{"$f":"IF(J155=\"\",\"\",VLOOKUP(J155,[3]HeroModelConfig!$A:$D,4,FALSE))","v":""},{"$f":"IF(K155=\"\",\"\",VLOOKUP(K155,[3]HeroModelConfig!$A:$D,4,FALSE))","v":""}]
[2033,"命运峰-第33层",{"$f":"VLOOKUP(A156,[2]TowerInfoConfig!$H:$P,9,FALSE)","v":111},"5003","","","","",5003,{"$nulls":14},{"$f":"IF(I156=\"\",\"\",VLOOKUP(I156,[3]HeroModelConfig!$A:$D,4,FALSE))","v":"木修精英"},{"$f":"IF(J156=\"\",\"\",VLOOKUP(J156,[3]HeroModelConfig!$A:$D,4,FALSE))","v":""},{"$f":"IF(K156=\"\",\"\",VLOOKUP(K156,[3]HeroModelConfig!$A:$D,4,FALSE))","v":""}]
[2034,"命运峰-第34层",{"$f":"VLOOKUP(A157,[2]TowerInfoConfig!$H:$P,9,FALSE)","v":113},"5004","","","","",5004,{"$nulls":14},{"$f":"IF(I157=\"\",\"\",VLOOKUP(I157,[3]HeroModelConfig!$A:$D,4,FALSE))","v":"火修精英"},{"$f":"IF(J157=\"\",\"\",VLOOKUP(J157,[3]HeroModelConfig!$A:$D,4,FALSE))","v":""},{"$f":"IF(K157=\"\",\"\",VLOOKUP(K157,[3]HeroModelConfig!$A:$D,4,FALSE))","v":""}]
[2035,"命运峰-第35层",{"$f":"VLOOKUP(A158,[2]TowerInfoConfig!$H:$P,9,FALSE)","v":116},"9001","","","","",9001,{"$nulls":14},{"$f":"IF(I158=\"\",\"\",VLOOKUP(I158,[3]HeroModelConfig!$A:$D,4,FALSE))","v":"boss"},{"$f":"IF(J158=\"\",\"\",VLOOKUP(J158,[3]HeroModelConfig!$A:$D,4,FALSE))","v":""},{"$f":"IF(K158=\"\",\"\",VLOOKUP(K158,[3]HeroModelConfig!$A:$D,4,FALSE))","v":""}]
[2036,"命运峰-第36层",{"$f":"VLOOKUP(A159,[2]TowerInfoConfig!$H:$P,9,FALSE)","v":119},"5004","","","","",5004,{"$nulls":14},{"$f":"IF(I159=\"\",\"\",VLOOKUP(I159,[3]HeroModelConfig!$A:$D,4,FALSE))","v":"火修精英"},{"$f":"IF(J159=\"\",\"\",VLOOKUP(J159,[3]HeroModelConfig!$A:$D,4,FALSE))","v":""},{"$f":"IF(K159=\"\",\"\",VLOOKUP(K159,[3]HeroModelConfig!$A:$D,4,FALSE))","v":""}]
[2037,"命运峰-第37层",{"$f":"VLOOKUP(A160,[2]TowerInfoConfig!$H:$P,9,FALSE)","v":121},"5005","","","","",5005,{"$nulls":14},{"$f":"IF(I160=\"\",\"\",VLOOKUP(I160,[3]HeroModelConfig!$A:$D,4,FALSE))","v":"土系怪"},{"$f":"IF(J160=\"\",\"\",VLOOKUP(J160,[3]HeroModelConfig!$A:$D,4,FALSE))","v":""},{"$f":"IF(K160=\"\",\"\",VLOOKUP(K160,[3]HeroModelConfig!$A:$D,4,FALSE))","v":""}]
[2038,"命运峰-第38层",{"$f":"VLOOKUP(A161,[2]TowerInfoConfig!$H:$P,9,FALSE)","v":123},"5006","","","","",5006,{"$nulls":14},{"$f":"IF(I161=\"\",\"\",VLOOKUP(I161,[3]HeroModelConfig!$A:$D,4,FALSE))","v":"鼠先锋 "},{"$f":"IF(J161=\"\",\"\",VLOOKUP(J161,[3]HeroModelConfig!$A:$D,4,FALSE))","v":""},{"$f":"IF(K161=\"\",\"\",VLOOKUP(K161,[3]HeroModelConfig!$A:$D,4,FALSE))","v":""}]
[2039,"命运峰-第39层",{"$f":"VLOOKUP(A162,[2]TowerInfoConfig!$H:$P,9,FALSE)","v":126},"5007","","","","",5007,{"$nulls":14},{"$f":"IF(I162=\"\",\"\",VLOOKUP(I162,[3]HeroModelConfig!$A:$D,4,FALSE))","v":"穷奇"},{"$f":"IF(J162=\"\",\"\",VLOOKUP(J162,[3]HeroModelConfig!$A:$D,4,FALSE))","v":""},{"$f":"IF(K162=\"\",\"\",VLOOKUP(K162,[3]HeroModelConfig!$A:$D,4,FALSE))","v":""}]
[2040,"命运峰-第40层",{"$f":"VLOOKUP(A163,[2]TowerInfoConfig!$H:$P,9,FALSE)","v":129},"9002","","","","",9002,{"$nulls":14},{"$f":"IF(I163=\"\",\"\",VLOOKUP(I163,[3]HeroModelConfig!$A:$D,4,FALSE))","v":"凤凰"},{"$f":"IF(J163=\"\",\"\",VLOOKUP(J163,[3]HeroModelConfig!$A:$D,4,FALSE))","v":""},{"$f":"IF(K163=\"\",\"\",VLOOKUP(K163,[3]HeroModelConfig!$A:$D,4,FALSE))","v":""}]
[2041,"命运峰-第41层",{"$f":"VLOOKUP(A164,[2]TowerInfoConfig!$H:$P,9,FALSE)","v":131},"5001","","","","",5001,{"$nulls":14},{"$f":"IF(I164=\"\",\"\",VLOOKUP(I164,[3]HeroModelConfig!$A:$D,4,FALSE))","v":"金修精英"},{"$f":"IF(J164=\"\",\"\",VLOOKUP(J164,[3]HeroModelConfig!$A:$D,4,FALSE))","v":""},{"$f":"IF(K164=\"\",\"\",VLOOKUP(K164,[3]HeroModelConfig!$A:$D,4,FALSE))","v":""}]
[2042,"命运峰-第42层",{"$f":"VLOOKUP(A165,[2]TowerInfoConfig!$H:$P,9,FALSE)","v":133},"5002","","","","",5002,{"$nulls":14},{"$f":"IF(I165=\"\",\"\",VLOOKUP(I165,[3]HeroModelConfig!$A:$D,4,FALSE))","v":"水修精英"},{"$f":"IF(J165=\"\",\"\",VLOOKUP(J165,[3]HeroModelConfig!$A:$D,4,FALSE))","v":""},{"$f":"IF(K165=\"\",\"\",VLOOKUP(K165,[3]HeroModelConfig!$A:$D,4,FALSE))","v":""}]
[2043,"命运峰-第43层",{"$f":"VLOOKUP(A166,[2]TowerInfoConfig!$H:$P,9,FALSE)","v":136},"5003","","","","",5003,{"$nulls":14},{"$f":"IF(I166=\"\",\"\",VLOOKUP(I166,[3]HeroModelConfig!$A:$D,4,FALSE))","v":"木修精英"},{"$f":"IF(J166=\"\",\"\",VLOOKUP(J166,[3]HeroModelConfig!$A:$D,4,FALSE))","v":""},{"$f":"IF(K166=\"\",\"\",VLOOKUP(K166,[3]HeroModelConfig!$A:$D,4,FALSE))","v":""}]
[2044,"命运峰-第44层",{"$f":"VLOOKUP(A167,[2]TowerInfoConfig!$H:$P,9,FALSE)","v":139},"5004","","","","",5004,{"$nulls":14},{"$f":"IF(I167=\"\",\"\",VLOOKUP(I167,[3]HeroModelConfig!$A:$D,4,FALSE))","v":"火修精英"},{"$f":"IF(J167=\"\",\"\",VLOOKUP(J167,[3]HeroModelConfig!$A:$D,4,FALSE))","v":""},{"$f":"IF(K167=\"\",\"\",VLOOKUP(K167,[3]HeroModelConfig!$A:$D,4,FALSE))","v":""}]
[2045,"命运峰-第45层",{"$f":"VLOOKUP(A168,[2]TowerInfoConfig!$H:$P,9,FALSE)","v":141},"9003","","","","",9003,{"$nulls":14},{"$f":"IF(I168=\"\",\"\",VLOOKUP(I168,[3]HeroModelConfig!$A:$D,4,FALSE))","v":"北海神龟"},{"$f":"IF(J168=\"\",\"\",VLOOKUP(J168,[3]HeroModelConfig!$A:$D,4,FALSE))","v":""},{"$f":"IF(K168=\"\",\"\",VLOOKUP(K168,[3]HeroModelConfig!$A:$D,4,FALSE))","v":""}]
[2046,"命运峰-第46层",{"$f":"VLOOKUP(A169,[2]TowerInfoConfig!$H:$P,9,FALSE)","v":143},"5004","","","","",5004,{"$nulls":14},{"$f":"IF(I169=\"\",\"\",VLOOKUP(I169,[3]HeroModelConfig!$A:$D,4,FALSE))","v":"火修精英"},{"$f":"IF(J169=\"\",\"\",VLOOKUP(J169,[3]HeroModelConfig!$A:$D,4,FALSE))","v":""},{"$f":"IF(K169=\"\",\"\",VLOOKUP(K169,[3]HeroModelConfig!$A:$D,4,FALSE))","v":""}]
[2047,"命运峰-第47层",{"$f":"VLOOKUP(A170,[2]TowerInfoConfig!$H:$P,9,FALSE)","v":146},"5005","","","","",5005,{"$nulls":14},{"$f":"IF(I170=\"\",\"\",VLOOKUP(I170,[3]HeroModelConfig!$A:$D,4,FALSE))","v":"土系怪"},{"$f":"IF(J170=\"\",\"\",VLOOKUP(J170,[3]HeroModelConfig!$A:$D,4,FALSE))","v":""},{"$f":"IF(K170=\"\",\"\",VLOOKUP(K170,[3]HeroModelConfig!$A:$D,4,FALSE))","v":""}]
[2048,"命运峰-第48层",{"$f":"VLOOKUP(A171,[2]TowerInfoConfig!$H:$P,9,FALSE)","v":149},"5006","","","","",5006,{"$nulls":14},{"$f":"IF(I171=\"\",\"\",VLOOKUP(I171,[3]HeroModelConfig!$A:$D,4,FALSE))","v":"鼠先锋 "},{"$f":"IF(J171=\"\",\"\",VLOOKUP(J171,[3]HeroModelConfig!$A:$D,4,FALSE))","v":""},{"$f":"IF(K171=\"\",\"\",VLOOKUP(K171,[3]HeroModelConfig!$A:$D,4,FALSE))","v":""}]
[2049,"命运峰-第49层",{"$f":"VLOOKUP(A172,[2]TowerInfoConfig!$H:$P,9,FALSE)","v":151},"5007","","","","",5007,{"$nulls":14},{"$f":"IF(I172=\"\",\"\",VLOOKUP(I172,[3]HeroModelConfig!$A:$D,4,FALSE))","v":"穷奇"},{"$f":"IF(J172=\"\",\"\",VLOOKUP(J172,[3]HeroModelConfig!$A:$D,4,FALSE))","v":""},{"$f":"IF(K172=\"\",\"\",VLOOKUP(K172,[3]HeroModelConfig!$A:$D,4,FALSE))","v":""}]
[2050,"命运峰-第50层",{"$f":"VLOOKUP(A173,[2]TowerInfoConfig!$H:$P,9,FALSE)","v":153},"9004","","","","",9004,{"$nulls":14},{"$f":"IF(I173=\"\",\"\",VLOOKUP(I173,[3]HeroModelConfig!$A:$D,4,FALSE))","v":"樗木之灵"},{"$f":"IF(J173=\"\",\"\",VLOOKUP(J173,[3]HeroModelConfig!$A:$D,4,FALSE))","v":""},{"$f":"IF(K173=\"\",\"\",VLOOKUP(K173,[3]HeroModelConfig!$A:$D,4,FALSE))","v":""}]
[2051,"命运峰-第51层",{"$f":"VLOOKUP(A174,[2]TowerInfoConfig!$H:$P,9,FALSE)","v":156},"5001","","","","",5001,{"$nulls":14},{"$f":"IF(I174=\"\",\"\",VLOOKUP(I174,[3]HeroModelConfig!$A:$D,4,FALSE))","v":"金修精英"},{"$f":"IF(J174=\"\",\"\",VLOOKUP(J174,[3]HeroModelConfig!$A:$D,4,FALSE))","v":""},{"$f":"IF(K174=\"\",\"\",VLOOKUP(K174,[3]HeroModelConfig!$A:$D,4,FALSE))","v":""}]
[2052,"命运峰-第52层",{"$f":"VLOOKUP(A175,[2]TowerInfoConfig!$H:$P,9,FALSE)","v":159},"5002","","","","",5002,{"$nulls":14},{"$f":"IF(I175=\"\",\"\",VLOOKUP(I175,[3]HeroModelConfig!$A:$D,4,FALSE))","v":"水修精英"},{"$f":"IF(J175=\"\",\"\",VLOOKUP(J175,[3]HeroModelConfig!$A:$D,4,FALSE))","v":""},{"$f":"IF(K175=\"\",\"\",VLOOKUP(K175,[3]HeroModelConfig!$A:$D,4,FALSE))","v":""}]
[2053,"命运峰-第53层",{"$f":"VLOOKUP(A176,[2]TowerInfoConfig!$H:$P,9,FALSE)","v":161},"5003","","","","",5003,{"$nulls":14},{"$f":"IF(I176=\"\",\"\",VLOOKUP(I176,[3]HeroModelConfig!$A:$D,4,FALSE))","v":"木修精英"},{"$f":"IF(J176=\"\",\"\",VLOOKUP(J176,[3]HeroModelConfig!$A:$D,4,FALSE))","v":""},{"$f":"IF(K176=\"\",\"\",VLOOKUP(K176,[3]HeroModelConfig!$A:$D,4,FALSE))","v":""}]
[2054,"命运峰-第54层",{"$f":"VLOOKUP(A177,[2]TowerInfoConfig!$H:$P,9,FALSE)","v":163},"5004","","","","",5004,{"$nulls":14},{"$f":"IF(I177=\"\",\"\",VLOOKUP(I177,[3]HeroModelConfig!$A:$D,4,FALSE))","v":"火修精英"},{"$f":"IF(J177=\"\",\"\",VLOOKUP(J177,[3]HeroModelConfig!$A:$D,4,FALSE))","v":""},{"$f":"IF(K177=\"\",\"\",VLOOKUP(K177,[3]HeroModelConfig!$A:$D,4,FALSE))","v":""}]
[2055,"命运峰-第55层",{"$f":"VLOOKUP(A178,[2]TowerInfoConfig!$H:$P,9,FALSE)","v":166},"9005","","","","",9005,{"$nulls":14},{"$f":"IF(I178=\"\",\"\",VLOOKUP(I178,[3]HeroModelConfig!$A:$D,4,FALSE))","v":"心魔"},{"$f":"IF(J178=\"\",\"\",VLOOKUP(J178,[3]HeroModelConfig!$A:$D,4,FALSE))","v":""},{"$f":"IF(K178=\"\",\"\",VLOOKUP(K178,[3]HeroModelConfig!$A:$D,4,FALSE))","v":""}]
[2056,"命运峰-第56层",{"$f":"VLOOKUP(A179,[2]TowerInfoConfig!$H:$P,9,FALSE)","v":169},"5004","","","","",5004,{"$nulls":14},{"$f":"IF(I179=\"\",\"\",VLOOKUP(I179,[3]HeroModelConfig!$A:$D,4,FALSE))","v":"火修精英"},{"$f":"IF(J179=\"\",\"\",VLOOKUP(J179,[3]HeroModelConfig!$A:$D,4,FALSE))","v":""},{"$f":"IF(K179=\"\",\"\",VLOOKUP(K179,[3]HeroModelConfig!$A:$D,4,FALSE))","v":""}]
[2057,"命运峰-第57层",{"$f":"VLOOKUP(A180,[2]TowerInfoConfig!$H:$P,9,FALSE)","v":171},"5005","","","","",5005,{"$nulls":14},{"$f":"IF(I180=\"\",\"\",VLOOKUP(I180,[3]HeroModelConfig!$A:$D,4,FALSE))","v":"土系怪"},{"$f":"IF(J180=\"\",\"\",VLOOKUP(J180,[3]HeroModelConfig!$A:$D,4,FALSE))","v":""},{"$f":"IF(K180=\"\",\"\",VLOOKUP(K180,[3]HeroModelConfig!$A:$D,4,FALSE))","v":""}]
[2058,"命运峰-第58层",{"$f":"VLOOKUP(A181,[2]TowerInfoConfig!$H:$P,9,FALSE)","v":173},"5006","","","","",5006,{"$nulls":14},{"$f":"IF(I181=\"\",\"\",VLOOKUP(I181,[3]HeroModelConfig!$A:$D,4,FALSE))","v":"鼠先锋 "},{"$f":"IF(J181=\"\",\"\",VLOOKUP(J181,[3]HeroModelConfig!$A:$D,4,FALSE))","v":""},{"$f":"IF(K181=\"\",\"\",VLOOKUP(K181,[3]HeroModelConfig!$A:$D,4,FALSE))","v":""}]
[2059,"命运峰-第59层",{"$f":"VLOOKUP(A182,[2]TowerInfoConfig!$H:$P,9,FALSE)","v":176},"5007","","","","",5007,{"$nulls":14},{"$f":"IF(I182=\"\",\"\",VLOOKUP(I182,[3]HeroModelConfig!$A:$D,4,FALSE))","v":"穷奇"},{"$f":"IF(J182=\"\",\"\",VLOOKUP(J182,[3]HeroModelConfig!$A:$D,4,FALSE))","v":""},{"$f":"IF(K182=\"\",\"\",VLOOKUP(K182,[3]HeroModelConfig!$A:$D,4,FALSE))","v":""}]
[2060,"命运峰-第60层",{"$f":"VLOOKUP(A183,[2]TowerInfoConfig!$H:$P,9,FALSE)","v":179},"9002","","","","",9002,{"$nulls":14},{"$f":"IF(I183=\"\",\"\",VLOOKUP(I183,[3]HeroModelConfig!$A:$D,4,FALSE))","v":"凤凰"},{"$f":"IF(J183=\"\",\"\",VLOOKUP(J183,[3]HeroModelConfig!$A:$D,4,FALSE))","v":""},{"$f":"IF(K183=\"\",\"\",VLOOKUP(K183,[3]HeroModelConfig!$A:$D,4,FALSE))","v":""}]
[2061,"命运峰-第61层",{"$f":"VLOOKUP(A184,[2]TowerInfoConfig!$H:$P,9,FALSE)","v":181},"5001","","","","",5001,{"$nulls":14},{"$f":"IF(I184=\"\",\"\",VLOOKUP(I184,[3]HeroModelConfig!$A:$D,4,FALSE))","v":"金修精英"},{"$f":"IF(J184=\"\",\"\",VLOOKUP(J184,[3]HeroModelConfig!$A:$D,4,FALSE))","v":""},{"$f":"IF(K184=\"\",\"\",VLOOKUP(K184,[3]HeroModelConfig!$A:$D,4,FALSE))","v":""}]
[2062,"命运峰-第62层",{"$f":"VLOOKUP(A185,[2]TowerInfoConfig!$H:$P,9,FALSE)","v":183},"5002","","","","",5002,{"$nulls":14},{"$f":"IF(I185=\"\",\"\",VLOOKUP(I185,[3]HeroModelConfig!$A:$D,4,FALSE))","v":"水修精英"},{"$f":"IF(J185=\"\",\"\",VLOOKUP(J185,[3]HeroModelConfig!$A:$D,4,FALSE))","v":""},{"$f":"IF(K185=\"\",\"\",VLOOKUP(K185,[3]HeroModelConfig!$A:$D,4,FALSE))","v":""}]
[2063,"命运峰-第63层",{"$f":"VLOOKUP(A186,[2]TowerInfoConfig!$H:$P,9,FALSE)","v":186},"5003","","","","",5003,{"$nulls":14},{"$f":"IF(I186=\"\",\"\",VLOOKUP(I186,[3]HeroModelConfig!$A:$D,4,FALSE))","v":"木修精英"},{"$f":"IF(J186=\"\",\"\",VLOOKUP(J186,[3]HeroModelConfig!$A:$D,4,FALSE))","v":""},{"$f":"IF(K186=\"\",\"\",VLOOKUP(K186,[3]HeroModelConfig!$A:$D,4,FALSE))","v":""}]
[2064,"命运峰-第64层",{"$f":"VLOOKUP(A187,[2]TowerInfoConfig!$H:$P,9,FALSE)","v":189},"5004","","","","",5004,{"$nulls":14},{"$f":"IF(I187=\"\",\"\",VLOOKUP(I187,[3]HeroModelConfig!$A:$D,4,FALSE))","v":"火修精英"},{"$f":"IF(J187=\"\",\"\",VLOOKUP(J187,[3]HeroModelConfig!$A:$D,4,FALSE))","v":""},{"$f":"IF(K187=\"\",\"\",VLOOKUP(K187,[3]HeroModelConfig!$A:$D,4,FALSE))","v":""}]
[2065,"命运峰-第65层",{"$f":"VLOOKUP(A188,[2]TowerInfoConfig!$H:$P,9,FALSE)","v":191},"9001","","","","",9001,{"$nulls":14},{"$f":"IF(I188=\"\",\"\",VLOOKUP(I188,[3]HeroModelConfig!$A:$D,4,FALSE))","v":"boss"},{"$f":"IF(J188=\"\",\"\",VLOOKUP(J188,[3]HeroModelConfig!$A:$D,4,FALSE))","v":""},{"$f":"IF(K188=\"\",\"\",VLOOKUP(K188,[3]HeroModelConfig!$A:$D,4,FALSE))","v":""}]
[2066,"命运峰-第66层",{"$f":"VLOOKUP(A189,[2]TowerInfoConfig!$H:$P,9,FALSE)","v":193},"5004","","","","",5004,{"$nulls":14},{"$f":"IF(I189=\"\",\"\",VLOOKUP(I189,[3]HeroModelConfig!$A:$D,4,FALSE))","v":"火修精英"},{"$f":"IF(J189=\"\",\"\",VLOOKUP(J189,[3]HeroModelConfig!$A:$D,4,FALSE))","v":""},{"$f":"IF(K189=\"\",\"\",VLOOKUP(K189,[3]HeroModelConfig!$A:$D,4,FALSE))","v":""}]
[2067,"命运峰-第67层",{"$f":"VLOOKUP(A190,[2]TowerInfoConfig!$H:$P,9,FALSE)","v":196},"5005","","","","",5005,{"$nulls":14},{"$f":"IF(I190=\"\",\"\",VLOOKUP(I190,[3]HeroModelConfig!$A:$D,4,FALSE))","v":"土系怪"},{"$f":"IF(J190=\"\",\"\",VLOOKUP(J190,[3]HeroModelConfig!$A:$D,4,FALSE))","v":""},{"$f":"IF(K190=\"\",\"\",VLOOKUP(K190,[3]HeroModelConfig!$A:$D,4,FALSE))","v":""}]
[2068,"命运峰-第68层",{"$f":"VLOOKUP(A191,[2]TowerInfoConfig!$H:$P,9,FALSE)","v":199},"5006","","","","",5006,{"$nulls":14},{"$f":"IF(I191=\"\",\"\",VLOOKUP(I191,[3]HeroModelConfig!$A:$D,4,FALSE))","v":"鼠先锋 "},{"$f":"IF(J191=\"\",\"\",VLOOKUP(J191,[3]HeroModelConfig!$A:$D,4,FALSE))","v":""},{"$f":"IF(K191=\"\",\"\",VLOOKUP(K191,[3]HeroModelConfig!$A:$D,4,FALSE))","v":""}]
[2069,"命运峰-第69层",{"$f":"VLOOKUP(A192,[2]TowerInfoConfig!$H:$P,9,FALSE)","v":201},"5007","","","","",5007,{"$nulls":14},{"$f":"IF(I192=\"\",\"\",VLOOKUP(I192,[3]HeroModelConfig!$A:$D,4,FALSE))","v":"穷奇"},{"$f":"IF(J192=\"\",\"\",VLOOKUP(J192,[3]HeroModelConfig!$A:$D,4,FALSE))","v":""},{"$f":"IF(K192=\"\",\"\",VLOOKUP(K192,[3]HeroModelConfig!$A:$D,4,FALSE))","v":""}]
[2070,"命运峰-第70层",{"$f":"VLOOKUP(A193,[2]TowerInfoConfig!$H:$P,9,FALSE)","v":203},"9002","","","","",9002,{"$nulls":14},{"$f":"IF(I193=\"\",\"\",VLOOKUP(I193,[3]HeroModelConfig!$A:$D,4,FALSE))","v":"凤凰"},{"$f":"IF(J193=\"\",\"\",VLOOKUP(J193,[3]HeroModelConfig!$A:$D,4,FALSE))","v":""},{"$f":"IF(K193=\"\",\"\",VLOOKUP(K193,[3]HeroModelConfig!$A:$D,4,FALSE))","v":""}]
[2071,"命运峰-第71层",{"$f":"VLOOKUP(A194,[2]TowerInfoConfig!$H:$P,9,FALSE)","v":206},"5001","","","","",5001,{"$nulls":14},{"$f":"IF(I194=\"\",\"\",VLOOKUP(I194,[3]HeroModelConfig!$A:$D,4,FALSE))","v":"金修精英"},{"$f":"IF(J194=\"\",\"\",VLOOKUP(J194,[3]HeroModelConfig!$A:$D,4,FALSE))","v":""},{"$f":"IF(K194=\"\",\"\",VLOOKUP(K194,[3]HeroModelConfig!$A:$D,4,FALSE))","v":""}]
[2072,"命运峰-第72层",{"$f":"VLOOKUP(A195,[2]TowerInfoConfig!$H:$P,9,FALSE)","v":209},"5002","","","","",5002,{"$nulls":14},{"$f":"IF(I195=\"\",\"\",VLOOKUP(I195,[3]HeroModelConfig!$A:$D,4,FALSE))","v":"水修精英"},{"$f":"IF(J195=\"\",\"\",VLOOKUP(J195,[3]HeroModelConfig!$A:$D,4,FALSE))","v":""},{"$f":"IF(K195=\"\",\"\",VLOOKUP(K195,[3]HeroModelConfig!$A:$D,4,FALSE))","v":""}]
[2073,"命运峰-第73层",{"$f":"VLOOKUP(A196,[2]TowerInfoConfig!$H:$P,9,FALSE)","v":211},"5003","","","","",5003,{"$nulls":14},{"$f":"IF(I196=\"\",\"\",VLOOKUP(I196,[3]HeroModelConfig!$A:$D,4,FALSE))","v":"木修精英"},{"$f":"IF(J196=\"\",\"\",VLOOKUP(J196,[3]HeroModelConfig!$A:$D,4,FALSE))","v":""},{"$f":"IF(K196=\"\",\"\",VLOOKUP(K196,[3]HeroModelConfig!$A:$D,4,FALSE))","v":""}]
[2074,"命运峰-第74层",{"$f":"VLOOKUP(A197,[2]TowerInfoConfig!$H:$P,9,FALSE)","v":213},"5004","","","","",5004,{"$nulls":14},{"$f":"IF(I197=\"\",\"\",VLOOKUP(I197,[3]HeroModelConfig!$A:$D,4,FALSE))","v":"火修精英"},{"$f":"IF(J197=\"\",\"\",VLOOKUP(J197,[3]HeroModelConfig!$A:$D,4,FALSE))","v":""},{"$f":"IF(K197=\"\",\"\",VLOOKUP(K197,[3]HeroModelConfig!$A:$D,4,FALSE))","v":""}]
[2075,"命运峰-第75层",{"$f":"VLOOKUP(A198,[2]TowerInfoConfig!$H:$P,9,FALSE)","v":216},"9003","","","","",9003,{"$nulls":14},{"$f":"IF(I198=\"\",\"\",VLOOKUP(I198,[3]HeroModelConfig!$A:$D,4,FALSE))","v":"北海神龟"},{"$f":"IF(J198=\"\",\"\",VLOOKUP(J198,[3]HeroModelConfig!$A:$D,4,FALSE))","v":""},{"$f":"IF(K198=\"\",\"\",VLOOKUP(K198,[3]HeroModelConfig!$A:$D,4,FALSE))","v":""}]
[2076,"命运峰-第76层",{"$f":"VLOOKUP(A199,[2]TowerInfoConfig!$H:$P,9,FALSE)","v":219},"5004","","","","",5004,{"$nulls":14},{"$f":"IF(I199=\"\",\"\",VLOOKUP(I199,[3]HeroModelConfig!$A:$D,4,FALSE))","v":"火修精英"},{"$f":"IF(J199=\"\",\"\",VLOOKUP(J199,[3]HeroModelConfig!$A:$D,4,FALSE))","v":""},{"$f":"IF(K199=\"\",\"\",VLOOKUP(K199,[3]HeroModelConfig!$A:$D,4,FALSE))","v":""}]
[2077,"命运峰-第77层",{"$f":"VLOOKUP(A200,[2]TowerInfoConfig!$H:$P,9,FALSE)","v":221},"5005","","","","",5005,{"$nulls":14},{"$f":"IF(I200=\"\",\"\",VLOOKUP(I200,[3]HeroModelConfig!$A:$D,4,FALSE))","v":"土系怪"},{"$f":"IF(J200=\"\",\"\",VLOOKUP(J200,[3]HeroModelConfig!$A:$D,4,FALSE))","v":""},{"$f":"IF(K200=\"\",\"\",VLOOKUP(K200,[3]HeroModelConfig!$A:$D,4,FALSE))","v":""}]
[2078,"命运峰-第78层",{"$f":"VLOOKUP(A201,[2]TowerInfoConfig!$H:$P,9,FALSE)","v":223},"5006","","","","",5006,{"$nulls":14},{"$f":"IF(I201=\"\",\"\",VLOOKUP(I201,[3]HeroModelConfig!$A:$D,4,FALSE))","v":"鼠先锋 "},{"$f":"IF(J201=\"\",\"\",VLOOKUP(J201,[3]HeroModelConfig!$A:$D,4,FALSE))","v":""},{"$f":"IF(K201=\"\",\"\",VLOOKUP(K201,[3]HeroModelConfig!$A:$D,4,FALSE))","v":""}]
[2079,"命运峰-第79层",{"$f":"VLOOKUP(A202,[2]TowerInfoConfig!$H:$P,9,FALSE)","v":226},"5007","","","","",5007,{"$nulls":14},{"$f":"IF(I202=\"\",\"\",VLOOKUP(I202,[3]HeroModelConfig!$A:$D,4,FALSE))","v":"穷奇"},{"$f":"IF(J202=\"\",\"\",VLOOKUP(J202,[3]HeroModelConfig!$A:$D,4,FALSE))","v":""},{"$f":"IF(K202=\"\",\"\",VLOOKUP(K202,[3]HeroModelConfig!$A:$D,4,FALSE))","v":""}]
[2080,"命运峰-第80层",{"$f":"VLOOKUP(A203,[2]TowerInfoConfig!$H:$P,9,FALSE)","v":229},"9004","","","","",9004,{"$nulls":14},{"$f":"IF(I203=\"\",\"\",VLOOKUP(I203,[3]HeroModelConfig!$A:$D,4,FALSE))","v":"樗木之灵"},{"$f":"IF(J203=\"\",\"\",VLOOKUP(J203,[3]HeroModelConfig!$A:$D,4,FALSE))","v":""},{"$f":"IF(K203=\"\",\"\",VLOOKUP(K203,[3]HeroModelConfig!$A:$D,4,FALSE))","v":""}]
[2081,"命运峰-第81层",{"$f":"VLOOKUP(A204,[2]TowerInfoConfig!$H:$P,9,FALSE)","v":231},"5001","","","","",5001,{"$nulls":14},{"$f":"IF(I204=\"\",\"\",VLOOKUP(I204,[3]HeroModelConfig!$A:$D,4,FALSE))","v":"金修精英"},{"$f":"IF(J204=\"\",\"\",VLOOKUP(J204,[3]HeroModelConfig!$A:$D,4,FALSE))","v":""},{"$f":"IF(K204=\"\",\"\",VLOOKUP(K204,[3]HeroModelConfig!$A:$D,4,FALSE))","v":""}]
[2082,"命运峰-第82层",{"$f":"VLOOKUP(A205,[2]TowerInfoConfig!$H:$P,9,FALSE)","v":233},"5002","","","","",5002,{"$nulls":14},{"$f":"IF(I205=\"\",\"\",VLOOKUP(I205,[3]HeroModelConfig!$A:$D,4,FALSE))","v":"水修精英"},{"$f":"IF(J205=\"\",\"\",VLOOKUP(J205,[3]HeroModelConfig!$A:$D,4,FALSE))","v":""},{"$f":"IF(K205=\"\",\"\",VLOOKUP(K205,[3]HeroModelConfig!$A:$D,4,FALSE))","v":""}]
[2083,"命运峰-第83层",{"$f":"VLOOKUP(A206,[2]TowerInfoConfig!$H:$P,9,FALSE)","v":236},"5003","","","","",5003,{"$nulls":14},{"$f":"IF(I206=\"\",\"\",VLOOKUP(I206,[3]HeroModelConfig!$A:$D,4,FALSE))","v":"木修精英"},{"$f":"IF(J206=\"\",\"\",VLOOKUP(J206,[3]HeroModelConfig!$A:$D,4,FALSE))","v":""},{"$f":"IF(K206=\"\",\"\",VLOOKUP(K206,[3]HeroModelConfig!$A:$D,4,FALSE))","v":""}]
[2084,"命运峰-第84层",{"$f":"VLOOKUP(A207,[2]TowerInfoConfig!$H:$P,9,FALSE)","v":239},"5004","","","","",5004,{"$nulls":14},{"$f":"IF(I207=\"\",\"\",VLOOKUP(I207,[3]HeroModelConfig!$A:$D,4,FALSE))","v":"火修精英"},{"$f":"IF(J207=\"\",\"\",VLOOKUP(J207,[3]HeroModelConfig!$A:$D,4,FALSE))","v":""},{"$f":"IF(K207=\"\",\"\",VLOOKUP(K207,[3]HeroModelConfig!$A:$D,4,FALSE))","v":""}]
[2085,"命运峰-第85层",{"$f":"VLOOKUP(A208,[2]TowerInfoConfig!$H:$P,9,FALSE)","v":241},{"$f":"_xlfn.TEXTJOIN(\";\",1,I208:K208)","v":"9005"},{"$f":"_xlfn.TEXTJOIN(\";\",1,L208:N208)","v":""},{"$f":"_xlfn.TEXTJOIN(\";\",1,O208:Q208)","v":""},{"$f":"_xlfn.TEXTJOIN(\";\",1,R208:T208)","v":""},{"$f":"_xlfn.TEXTJOIN(\";\",1,U208:W208)","v":""},9005,{"$nulls":14},{"$f":"IF(I208=\"\",\"\",VLOOKUP(I208,[3]HeroModelConfig!$A:$D,4,FALSE))","v":"心魔"},{"$f":"IF(J208=\"\",\"\",VLOOKUP(J208,[3]HeroModelConfig!$A:$D,4,FALSE))","v":""},{"$f":"IF(K208=\"\",\"\",VLOOKUP(K208,[3]HeroModelConfig!$A:$D,4,FALSE))","v":""}]
[2086,"命运峰-第86层",{"$f":"VLOOKUP(A209,[2]TowerInfoConfig!$H:$P,9,FALSE)","v":243},"5004","","","","",5004,{"$nulls":14},{"$f":"IF(I209=\"\",\"\",VLOOKUP(I209,[3]HeroModelConfig!$A:$D,4,FALSE))","v":"火修精英"},{"$f":"IF(J209=\"\",\"\",VLOOKUP(J209,[3]HeroModelConfig!$A:$D,4,FALSE))","v":""},{"$f":"IF(K209=\"\",\"\",VLOOKUP(K209,[3]HeroModelConfig!$A:$D,4,FALSE))","v":""}]
[2087,"命运峰-第87层",{"$f":"VLOOKUP(A210,[2]TowerInfoConfig!$H:$P,9,FALSE)","v":246},"5005","","","","",5005,{"$nulls":14},{"$f":"IF(I210=\"\",\"\",VLOOKUP(I210,[3]HeroModelConfig!$A:$D,4,FALSE))","v":"土系怪"},{"$f":"IF(J210=\"\",\"\",VLOOKUP(J210,[3]HeroModelConfig!$A:$D,4,FALSE))","v":""},{"$f":"IF(K210=\"\",\"\",VLOOKUP(K210,[3]HeroModelConfig!$A:$D,4,FALSE))","v":""}]
[2088,"命运峰-第88层",{"$f":"VLOOKUP(A211,[2]TowerInfoConfig!$H:$P,9,FALSE)","v":249},"5006","","","","",5006,{"$nulls":14},{"$f":"IF(I211=\"\",\"\",VLOOKUP(I211,[3]HeroModelConfig!$A:$D,4,FALSE))","v":"鼠先锋 "},{"$f":"IF(J211=\"\",\"\",VLOOKUP(J211,[3]HeroModelConfig!$A:$D,4,FALSE))","v":""},{"$f":"IF(K211=\"\",\"\",VLOOKUP(K211,[3]HeroModelConfig!$A:$D,4,FALSE))","v":""}]
[2089,"命运峰-第89层",{"$f":"VLOOKUP(A212,[2]TowerInfoConfig!$H:$P,9,FALSE)","v":251},"5007","","","","",5007,{"$nulls":14},{"$f":"IF(I212=\"\",\"\",VLOOKUP(I212,[3]HeroModelConfig!$A:$D,4,FALSE))","v":"穷奇"},{"$f":"IF(J212=\"\",\"\",VLOOKUP(J212,[3]HeroModelConfig!$A:$D,4,FALSE))","v":""},{"$f":"IF(K212=\"\",\"\",VLOOKUP(K212,[3]HeroModelConfig!$A:$D,4,FALSE))","v":""}]
[2090,"命运峰-第90层",{"$f":"VLOOKUP(A213,[2]TowerInfoConfig!$H:$P,9,FALSE)","v":253},"9002","","","","",9002,{"$nulls":14},{"$f":"IF(I213=\"\",\"\",VLOOKUP(I213,[3]HeroModelConfig!$A:$D,4,FALSE))","v":"凤凰"},{"$f":"IF(J213=\"\",\"\",VLOOKUP(J213,[3]HeroModelConfig!$A:$D,4,FALSE))","v":""},{"$f":"IF(K213=\"\",\"\",VLOOKUP(K213,[3]HeroModelConfig!$A:$D,4,FALSE))","v":""}]
[2091,"命运峰-第91层",{"$f":"VLOOKUP(A214,[2]TowerInfoConfig!$H:$P,9,FALSE)","v":256},"5001","","","","",5001,{"$nulls":14},{"$f":"IF(I214=\"\",\"\",VLOOKUP(I214,[3]HeroModelConfig!$A:$D,4,FALSE))","v":"金修精英"},{"$f":"IF(J214=\"\",\"\",VLOOKUP(J214,[3]HeroModelConfig!$A:$D,4,FALSE))","v":""},{"$f":"IF(K214=\"\",\"\",VLOOKUP(K214,[3]HeroModelConfig!$A:$D,4,FALSE))","v":""}]
[2092,"命运峰-第92层",{"$f":"VLOOKUP(A215,[2]TowerInfoConfig!$H:$P,9,FALSE)","v":260},"5002","","","","",5002,{"$nulls":14},{"$f":"IF(I215=\"\",\"\",VLOOKUP(I215,[3]HeroModelConfig!$A:$D,4,FALSE))","v":"水修精英"},{"$f":"IF(J215=\"\",\"\",VLOOKUP(J215,[3]HeroModelConfig!$A:$D,4,FALSE))","v":""},{"$f":"IF(K215=\"\",\"\",VLOOKUP(K215,[3]HeroModelConfig!$A:$D,4,FALSE))","v":""}]
[2093,"命运峰-第93层",{"$f":"VLOOKUP(A216,[2]TowerInfoConfig!$H:$P,9,FALSE)","v":265},"5003","","","","",5003,{"$nulls":14},{"$f":"IF(I216=\"\",\"\",VLOOKUP(I216,[3]HeroModelConfig!$A:$D,4,FALSE))","v":"木修精英"},{"$f":"IF(J216=\"\",\"\",VLOOKUP(J216,[3]HeroModelConfig!$A:$D,4,FALSE))","v":""},{"$f":"IF(K216=\"\",\"\",VLOOKUP(K216,[3]HeroModelConfig!$A:$D,4,FALSE))","v":""}]
[2094,"命运峰-第94层",{"$f":"VLOOKUP(A217,[2]TowerInfoConfig!$H:$P,9,FALSE)","v":270},"5004","","","","",5004,{"$nulls":14},{"$f":"IF(I217=\"\",\"\",VLOOKUP(I217,[3]HeroModelConfig!$A:$D,4,FALSE))","v":"火修精英"},{"$f":"IF(J217=\"\",\"\",VLOOKUP(J217,[3]HeroModelConfig!$A:$D,4,FALSE))","v":""},{"$f":"IF(K217=\"\",\"\",VLOOKUP(K217,[3]HeroModelConfig!$A:$D,4,FALSE))","v":""}]
[2095,"命运峰-第95层",{"$f":"VLOOKUP(A218,[2]TowerInfoConfig!$H:$P,9,FALSE)","v":275},"9005","","","","",9005,{"$nulls":14},{"$f":"IF(I218=\"\",\"\",VLOOKUP(I218,[3]HeroModelConfig!$A:$D,4,FALSE))","v":"心魔"},{"$f":"IF(J218=\"\",\"\",VLOOKUP(J218,[3]HeroModelConfig!$A:$D,4,FALSE))","v":""},{"$f":"IF(K218=\"\",\"\",VLOOKUP(K218,[3]HeroModelConfig!$A:$D,4,FALSE))","v":""}]
[2096,"命运峰-第96层",{"$f":"VLOOKUP(A219,[2]TowerInfoConfig!$H:$P,9,FALSE)","v":280},"5004","","","","",5004,{"$nulls":14},{"$f":"IF(I219=\"\",\"\",VLOOKUP(I219,[3]HeroModelConfig!$A:$D,4,FALSE))","v":"火修精英"},{"$f":"IF(J219=\"\",\"\",VLOOKUP(J219,[3]HeroModelConfig!$A:$D,4,FALSE))","v":""},{"$f":"IF(K219=\"\",\"\",VLOOKUP(K219,[3]HeroModelConfig!$A:$D,4,FALSE))","v":""}]
[2097,"命运峰-第97层",{"$f":"VLOOKUP(A220,[2]TowerInfoConfig!$H:$P,9,FALSE)","v":285},"5005","","","","",5005,{"$nulls":14},{"$f":"IF(I220=\"\",\"\",VLOOKUP(I220,[3]HeroModelConfig!$A:$D,4,FALSE))","v":"土系怪"},{"$f":"IF(J220=\"\",\"\",VLOOKUP(J220,[3]HeroModelConfig!$A:$D,4,FALSE))","v":""},{"$f":"IF(K220=\"\",\"\",VLOOKUP(K220,[3]HeroModelConfig!$A:$D,4,FALSE))","v":""}]
[2098,"命运峰-第98层",{"$f":"VLOOKUP(A221,[2]TowerInfoConfig!$H:$P,9,FALSE)","v":290},"5006","","","","",5006,{"$nulls":14},{"$f":"IF(I221=\"\",\"\",VLOOKUP(I221,[3]HeroModelConfig!$A:$D,4,FALSE))","v":"鼠先锋 "},{"$f":"IF(J221=\"\",\"\",VLOOKUP(J221,[3]HeroModelConfig!$A:$D,4,FALSE))","v":""},{"$f":"IF(K221=\"\",\"\",VLOOKUP(K221,[3]HeroModelConfig!$A:$D,4,FALSE))","v":""}]
[2099,"命运峰-第99层",{"$f":"VLOOKUP(A222,[2]TowerInfoConfig!$H:$P,9,FALSE)","v":295},"5007","","","","",5007,{"$nulls":14},{"$f":"IF(I222=\"\",\"\",VLOOKUP(I222,[3]HeroModelConfig!$A:$D,4,FALSE))","v":"穷奇"},{"$f":"IF(J222=\"\",\"\",VLOOKUP(J222,[3]HeroModelConfig!$A:$D,4,FALSE))","v":""},{"$f":"IF(K222=\"\",\"\",VLOOKUP(K222,[3]HeroModelConfig!$A:$D,4,FALSE))","v":""}]
[2100,"命运峰-第100层",{"$f":"VLOOKUP(A223,[2]TowerInfoConfig!$H:$P,9,FALSE)","v":300},"9002","","","","",9002,{"$nulls":14},{"$f":"IF(I223=\"\",\"\",VLOOKUP(I223,[3]HeroModelConfig!$A:$D,4,FALSE))","v":"凤凰"},{"$f":"IF(J223=\"\",\"\",VLOOKUP(J223,[3]HeroModelConfig!$A:$D,4,FALSE))","v":""},{"$f":"IF(K223=\"\",\"\",VLOOKUP(K223,[3]HeroModelConfig!$A:$D,4,FALSE))","v":""}]

{"sheet":"强度验算","index":2,"n_rows":38,"n_cols":14,"rows_kept":38,"cut":false,"hidden":false,"merged":[]}
[null,"生存修正","生命","攻击修正","对拼修正","秒伤","怪物存活时间",null,"玩家打怪物",null,null,"怪物打玩家"]
[{"$nulls":8},"阶段1","阶段2",null,"阶段1","阶段2"]
["怪物1",null,2000,null,null,100,{"$f":"C3/100","v":20},null,{"$f":"G3*F3","v":2000}]
[]
[{"$nulls":6},1.2,null,{"$f":"SUM(I6:I7)","v":1800},{"$f":"SUM(J6:J7)","v":600},null,{"$f":"SUM(L6:L7)","v":1846.05},{"$f":"SUM(M6:M7)","v":153.94999999999999},{"$f":"SUM(L5:M5)","v":2000}]
["主怪",0.9,{"$f":"C$3*$B6","v":1800},0.76900000000000002,{"$f":"B6/SUM(B$6:B$7)","v":0.75},{"$f":"F$3*$D6","v":76.900000000000006},{"$f":"C6/F$3","v":18},{"$f":"B6/D6","v":1.1703511053316},{"$f":"G6*F$3","v":1800},null,null,{"$f":"F6*G6","v":1384.2}]
["辅怪1",{"$f":"C7/C$3","v":0.3},{"$f":"J7","v":600},{"$f":"F7/F$3","v":0.256583333333333},{"$f":"B7/SUM(B$6:B$7)","v":0.25},{"$f":"(C$3-L6)/G7","v":25.658333333333299},{"$f":"G$3*G5","v":24},{"$f":"B7/D7","v":1.16921078272166},null,{"$f":"F$3*(G7-G6)","v":600},null,{"$f":"F7*G6","v":461.85},{"$f":"C$3-L5","v":153.94999999999999}]
[]
[{"$nulls":6},{"$f":"G5","v":1.2},null,{"$f":"SUM(I10:I11)","v":1600},{"$f":"SUM(J10:J11)","v":800},null,{"$f":"SUM(L10:L11)","v":1714.13333333333},{"$f":"SUM(M10:M11)","v":285.86666666666702},{"$f":"SUM(L9:M9)","v":2000}]
["主怪",0.8,{"$f":"C$3*$B10","v":1600},0.71399999999999997,{"$f":"B10/SUM(B$10:B$11)","v":0.66666666666666696},{"$f":"F$3*$D10","v":71.400000000000006},{"$f":"C10/F$3","v":16},{"$f":"B10/D10","v":1.12044817927171},{"$f":"G10*F$3","v":1600},null,null,{"$f":"F10*G10","v":1142.4000000000001}]
["辅怪1",{"$f":"C11/C$3","v":0.4},{"$f":"J11","v":800},{"$f":"F11/F$3","v":0.357333333333333},{"$f":"B11/SUM(B$10:B$11)","v":0.33333333333333298},{"$f":"(C$3-L10)/G11","v":35.733333333333299},{"$f":"G$3*G9","v":24},{"$f":"B11/D11","v":1.1194029850746301},null,{"$f":"F$3*(G11-G10)","v":800},null,{"$f":"F11*G10","v":571.73333333333301},{"$f":"C$3-L9","v":285.86666666666702}]
[]
[{"$nulls":6},{"$f":"G5","v":1.2},null,{"$f":"SUM(I14:I15)","v":1400},{"$f":"SUM(J14:J15)","v":1000},null,{"$f":"SUM(L14:L15)","v":1541.1666666666699},{"$f":"SUM(M14:M15)","v":458.83333333333297},{"$f":"SUM(L13:M13)","v":2000}]
["主怪",0.7,{"$f":"C$3*$B14","v":1400},0.64200000000000002,{"$f":"B14/SUM(B$14:B$15)","v":0.58333333333333304},{"$f":"F$3*$D14","v":64.2},{"$f":"C14/F$3","v":14},{"$f":"B14/D14","v":1.09034267912773},{"$f":"G14*F$3","v":1400},null,null,{"$f":"F14*G14","v":898.8}]
["辅怪1",{"$f":"C15/C$3","v":0.5},{"$f":"J15","v":1000},{"$f":"F15/F$3","v":0.45883333333333298},{"$f":"B15/SUM(B$14:B$15)","v":0.41666666666666702},{"$f":"(C$3-L14)/G15","v":45.883333333333297},{"$f":"G$3*G13","v":24},{"$f":"B15/D15","v":1.0897203051216899},null,{"$f":"F$3*(G15-G14)","v":1000},null,{"$f":"F15*G14","v":642.36666666666702},{"$f":"C$3-L13","v":458.83333333333297}]
[]
[{"$nulls":6},{"$f":"G5","v":1.2},null,{"$f":"SUM(I18:I19)","v":1200},{"$f":"SUM(J18:J19)","v":1200},null,{"$f":"SUM(L18:L19)","v":1333.6},{"$f":"SUM(M18:M19)","v":666.4},{"$f":"SUM(L17:M17)","v":2000}]
["主怪",0.6,{"$f":"C$3*$B18","v":1200},0.55600000000000005,{"$f":"B18/SUM(B$18:B$19)","v":0.5},{"$f":"F$3*$D18","v":55.6},{"$f":"C18/F$3","v":12},{"$f":"B18/D18","v":1.07913669064748},{"$f":"G18*F$3","v":1200},null,null,{"$f":"F18*G18","v":667.2}]
["辅怪1",{"$f":"C19/C$3","v":0.6},{"$f":"J19","v":1200},{"$f":"F19/F$3","v":0.55533333333333301},{"$f":"B19/SUM(B$18:B$19)","v":0.5},{"$f":"(C$3-L18)/G19","v":55.533333333333303},{"$f":"G$3*G17","v":24},{"$f":"B19/D19","v":1.0804321728691499},null,{"$f":"F$3*(G19-G18)","v":1200},null,{"$f":"F19*G18","v":666.4},{"$f":"C$3-L17","v":666.4}]
[]
[]
[]
[]
[{"$nulls":6},1.3,null,{"$f":"SUM(I25:I26)","v":1800},{"$f":"SUM(J25:J26)","v":800},null,{"$f":"SUM(L25:L26)","v":1810.52307692308},{"$f":"SUM(M25:M26)","v":189.47692307692299},{"$f":"SUM(L24:M24)","v":2000}]
["主怪",0.9,{"$f":"C$3*$B25","v":1800},0.76900000000000002,null,{"$f":"F$3*$D25","v":76.900000000000006},{"$f":"C25/F$3","v":18},{"$f":"B25/D25","v":1.1703511053316},{"$f":"G25*F$3","v":1800},null,null,{"$f":"F25*G25","v":1384.2}]
["辅怪1",{"$f":"C26/C$3","v":0.4},{"$f":"J26","v":800},{"$f":"F26/F$3","v":0.23684615384615401},null,{"$f":"(C$3-L25)/G26","v":23.684615384615402},{"$f":"G$3*G24","v":26},{"$f":"B26/D26","v":1.6888600194868499},null,{"$f":"F$3*(G26-G25)","v":800},null,{"$f":"F26*G25","v":426.323076923077},{"$f":"C$3-L24","v":189.47692307692299}]
[]
[{"$nulls":6},{"$f":"G24","v":1.3},null,{"$f":"SUM(I29:I30)","v":1600},{"$f":"SUM(J29:J30)","v":1000},null,{"$f":"SUM(L29:L30)","v":1670.1538461538501},{"$f":"SUM(M29:M30)","v":329.84615384615398},{"$f":"SUM(L28:M28)","v":2000}]
["主怪",0.8,{"$f":"C$3*$B29","v":1600},0.71399999999999997,null,{"$f":"F$3*$D29","v":71.400000000000006},{"$f":"C29/F$3","v":16},{"$f":"B29/D29","v":1.12044817927171},{"$f":"G29*F$3","v":1600},null,null,{"$f":"F29*G29","v":1142.4000000000001}]
["辅怪1",{"$f":"C30/C$3","v":0.5},{"$f":"J30","v":1000},{"$f":"F30/F$3","v":0.32984615384615401},null,{"$f":"(C$3-L29)/G30","v":32.984615384615402},{"$f":"G$3*G28","v":26},{"$f":"B30/D30","v":1.5158582089552199},null,{"$f":"F$3*(G30-G29)","v":1000},null,{"$f":"F30*G29","v":527.75384615384598},{"$f":"C$3-L28","v":329.84615384615398}]
[]
[{"$nulls":6},{"$f":"G24","v":1.3},null,{"$f":"SUM(I33:I34)","v":1400},{"$f":"SUM(J33:J34)","v":1200},null,{"$f":"SUM(L33:L34)","v":1491.75384615385},{"$f":"SUM(M33:M34)","v":508.24615384615402},{"$f":"SUM(L32:M32)","v":2000}]
["主怪",0.7,{"$f":"C$3*$B33","v":1400},0.64200000000000002,null,{"$f":"F$3*$D33","v":64.2},{"$f":"C33/F$3","v":14},{"$f":"B33/D33","v":1.09034267912773},{"$f":"G33*F$3","v":1400},null,null,{"$f":"F33*G33","v":898.8}]
["辅怪1",{"$f":"C34/C$3","v":0.6},{"$f":"J34","v":1200},{"$f":"F34/F$3","v":0.42353846153846098},null,{"$f":"(C$3-L33)/G34","v":42.353846153846099},{"$f":"G$3*G32","v":26},{"$f":"B34/D34","v":1.4166363966581901},null,{"$f":"F$3*(G34-G33)","v":1200},null,{"$f":"F34*G33","v":592.95384615384603},{"$f":"C$3-L32","v":508.24615384615402}]
[]
[{"$nulls":6},{"$f":"G24","v":1.3},null,{"$f":"SUM(I37:I38)","v":1200},{"$f":"SUM(J37:J38)","v":1400},null,{"$f":"SUM(L37:L38)","v":1282.33846153846},{"$f":"SUM(M37:M38)","v":717.66153846153804},{"$f":"SUM(L36:M36)","v":2000}]
["主怪",0.6,{"$f":"C$3*$B37","v":1200},0.55600000000000005,null,{"$f":"F$3*$D37","v":55.6},{"$f":"C37/F$3","v":12},{"$f":"B37/D37","v":1.07913669064748},{"$f":"G37*F$3","v":1200},null,null,{"$f":"F37*G37","v":667.2}]
["辅怪1",{"$f":"C38/C$3","v":0.7},{"$f":"J38","v":1400},{"$f":"F38/F$3","v":0.51261538461538503},null,{"$f":"(C$3-L37)/G38","v":51.2615384615385},{"$f":"G$3*G36","v":26},{"$f":"B38/D38","v":1.3655462184873901},null,{"$f":"F$3*(G38-G37)","v":1400},null,{"$f":"F38*G37","v":615.138461538461},{"$f":"C$3-L36","v":717.66153846153804}]