{"text_format":"2","workbook":"xlsx","n_sheets":6,"sheets":["主表","升级","功法","投产","投产详情","Sheet1"],"not_rendered":{"charts":0,"images":0,"macros":0,"external_links":2,"defined_names":1,"comments":0,"pivot_tables":0},"unopened":[],"bounds":{"document_bytes":16777216,"sheet_cells":100000,"run_cost":"one","rows_first":2000,"rows_last":500,"rows_between":2000,"halvings":0,"cell_chars":16384,"cell_head_chars":4096},"cells_cut":0,"cells_raw":0,"read":"whole","date_system":"1900"}

{"sheet":"主表","index":0,"n_rows":302,"n_cols":27,"rows_kept":302,"cut":false,"hidden":false,"merged":[]}
[null,null,null,0.15,{"$f":"D1*4/3","v":0.2},{"$f":"功法!G1+0.75","v":1.75},null,null,null,"主角倍率","血攻比",20,null,null,"怪物倍率",{"$nulls":5},"主角",null,null,null,"怪物",101]
["等级","等级强度","法宝数量","法宝强度","功法+法宝被动放大","生命放大","最终强度\n防御系数","前期功法修正",null,"生命","攻击","防御","护盾",null,"生命","防御","攻击","护盾",null,null,"生命","攻击","防御",null,{"$f":"VLOOKUP(Z1,[1]HeroModelConfig!$A:$L,10,FALSE)","v":100},{"$f":"VLOOKUP(Z1,[1]HeroModelConfig!$A:$L,9,FALSE)","v":100},{"$f":"VLOOKUP(Z1,[1]HeroModelConfig!$A:$L,11,FALSE)","v":50}]
[1,{"$f":"升级!C3","v":100},1,{"$f":"B3*D$1/3*C3","v":5},{"$f":"(VLOOKUP(INT(MAX(1,0.2*A3))*5,功法!B:E,4,FALSE)+(VLOOKUP(INT(MIN(60,MAX(1,0.2*A3+1)))*5,功法!B:E,4,FALSE)-VLOOKUP(INT(MAX(1,0.2*A3))*5,功法!B:E,4,FALSE))*MOD(A3,5)/5)*H3","v":0},{"$f":"F$1*$A3/300","v":0.00583333333333333},{"$f":"ROUND((B3+D3)*(1+E3),0)","v":105},0.01,null,{"$f":"B3/B$3*(1+F3)*L$1","v":20.1166666666667},{"$f":"B3/B$3","v":1},{"$f":"K3","v":1},{"$f":"IF(A3<160,0,升级!J3/升级!C$3)","v":0},null,{"$f":"G3/B$3*(1+F3)*L$1","v":21.1225},{"$f":"G3/B$3","v":1.05},{"$f":"P3","v":1.05},{"$f":"IF(A3<160,0,升级!J3/升级!C$3)","v":0},null,1,{"$f":"$B$3*J3","v":2011.66666666667},{"$f":"$B$3*K3","v":100},{"$f":"$B$3*L3*0.5","v":50},null,{"$f":"$B$3*O3*Y$2/100","v":2112.25},{"$f":"$B$3*P3*Z$2/100","v":105},52.5]
[2,{"$f":"升级!C4","v":102},1,{"$f":"D3","v":5},{"$f":"(VLOOKUP(INT(MAX(1,0.2*A4))*5,功法!B:E,4,FALSE)+(VLOOKUP(INT(MIN(60,MAX(1,0.2*A4+1)))*5,功法!B:E,4,FALSE)-VLOOKUP(INT(MAX(1,0.2*A4))*5,功法!B:E,4,FALSE))*MOD(A4,5)/5)*H4","v":0},{"$f":"F$1*$A4/300","v":0.0116666666666667},107,0.02,null,{"$f":"B4/B$3*(1+F4)*L$1","v":20.638},1.02,{"$f":"K4","v":1.02},{"$f":"IF(A4<160,0,升级!J4/升级!C$3)","v":0},null,{"$f":"G4/B$3*(1+F4)*L$1","v":21.6496666666667},1.07,{"$f":"P4","v":1.07},{"$f":"IF(A4<160,0,升级!J4/升级!C$3)","v":0},null,2,{"$f":"$B$3*J4","v":2063.8},{"$f":"$B$3*K4","v":102},{"$f":"$B$3*L4*0.5","v":51},null,{"$f":"$B$3*O4*Y$2/100","v":2164.96666666667},{"$f":"$B$3*P4*Z$2/100","v":107},{"$f":"$B$3*Q4*AA$2/100","v":53.5}]
[3,{"$f":"升级!C5","v":104},1,{"$f":"D4","v":5},{"$f":"(VLOOKUP(INT(MAX(1,0.2*A5))*5,功法!B:E,4,FALSE)+(VLOOKUP(INT(MIN(60,MAX(1,0.2*A5+1)))*5,功法!B:E,4,FALSE)-VLOOKUP(INT(MAX(1,0.2*A5))*5,功法!B:E,4,FALSE))*MOD(A5,5)/5)*H5","v":0},0.0175,109,0.03,null,21.164,1.04,1.04,{"$f":"IF(A5<160,0,升级!J5/升级!C$3)","v":0},null,22.1815,1.09,1.09,{"$f":"IF(A5<160,0,升级!J5/升级!C$3)","v":0},null,3,2116.4,104,52,null,2218.15,109,54.5]
[4,{"$f":"升级!C6","v":106},1,5,{"$f":"(VLOOKUP(INT(MAX(1,0.2*A6))*5,功法!B:E,4,FALSE)+(VLOOKUP(INT(MIN(60,MAX(1,0.2*A6+1)))*5,功法!B:E,4,FALSE)-VLOOKUP(INT(MAX(1,0.2*A6))*5,功法!B:E,4,FALSE))*MOD(A6,5)/5)*H6","v":0},0.0233333333333333,111,0.04,null,21.6946666666667,1.06,1.06,{"$f":"IF(A6<160,0,升级!J6/升级!C$3)","v":0},null,22.718,1.11,1.11,{"$f":"IF(A6<160,0,升级!J6/升级!C$3)","v":0},null,4,2169.46666666667,106,53,null,2271.8,111,55.5]
[5,{"$f":"升级!C7","v":108},1,5,{"$f":"(VLOOKUP(INT(MAX(1,0.2*A7))*5,功法!B:E,4,FALSE)+(VLOOKUP(INT(MIN(60,MAX(1,0.2*A7+1)))*5,功法!B:E,4,FALSE)-VLOOKUP(INT(MAX(1,0.2*A7))*5,功法!B:E,4,FALSE))*MOD(A7,5)/5)*H7","v":0},0.0291666666666667,113,0.05,null,22.23,1.08,1.08,{"$f":"IF(A7<160,0,升级!J7/升级!C$3)","v":0},null,23.2591666666667,1.13,1.13,{"$f":"IF(A7<160,0,升级!J7/升级!C$3)","v":0},null,5,2223,108,54,null,2325.91666666667,113,56.5]
[6,{"$f":"升级!C8","v":110},1,5,{"$f":"(VLOOKUP(INT(MAX(1,0.2*A8))*5,功法!B:E,4,FALSE)+(VLOOKUP(INT(MIN(60,MAX(1,0.2*A8+1)))*5,功法!B:E,4,FALSE)-VLOOKUP(INT(MAX(1,0.2*A8))*5,功法!B:E,4,FALSE))*MOD(A8,5)/5)*H8","v":0.0003638},0.035,115,0.06,null,22.77,1.1,1.1,{"$f":"IF(A8<160,0,升级!J8/升级!C$3)","v":0},null,23.805,1.15,1.15,{"$f":"IF(A8<160,0,升级!J8/升级!C$3)","v":0},null,6,2277,110,55,null,2380.5,115,57.5]
[7,{"$f":"升级!C9","v":112},1,5,{"$f":"(VLOOKUP(INT(MAX(1,0.2*A9))*5,功法!B:E,4,FALSE)+(VLOOKUP(INT(MIN(60,MAX(1,0.2*A9+1)))*5,功法!B:E,4,FALSE)-VLOOKUP(INT(MAX(1,0.2*A9))*5,功法!B:E,4,FALSE))*MOD(A9,5)/5)*H9","v":0.000848866666666666},0.0408333333333333,117,0.07,null,23.3146666666667,1.12,1.12,{"$f":"IF(A9<160,0,升级!J9/升级!C$3)","v":0},null,24.3555,1.17,1.17,{"$f":"IF(A9<160,0,升级!J9/升级!C$3)","v":0},null,7,2331.46666666667,112,56,null,2435.55,117,58.5]
[8,{"$f":"升级!C10","v":114},1,5,{"$f":"(VLOOKUP(INT(MAX(1,0.2*A10))*5,功法!B:E,4,FALSE)+(VLOOKUP(INT(MIN(60,MAX(1,0.2*A10+1)))*5,功法!B:E,4,FALSE)-VLOOKUP(INT(MAX(1,0.2*A10))*5,功法!B:E,4,FALSE))*MOD(A10,5)/5)*H10","v":0.0014552},0.0466666666666667,119,0.08,null,23.864,1.14,1.14,{"$f":"IF(A10<160,0,升级!J10/升级!C$3)","v":0},null,24.9106666666667,1.19,1.19,{"$f":"IF(A10<160,0,升级!J10/升级!C$3)","v":0},null,8,2386.4,114,57,null,2491.06666666667,119,59.5]
[9,{"$f":"升级!C11","v":116},1,5,{"$f":"(VLOOKUP(INT(MAX(1,0.2*A11))*5,功法!B:E,4,FALSE)+(VLOOKUP(INT(MIN(60,MAX(1,0.2*A11+1)))*5,功法!B:E,4,FALSE)-VLOOKUP(INT(MAX(1,0.2*A11))*5,功法!B:E,4,FALSE))*MOD(A11,5)/5)*H11","v":0.0021828},0.0525,121,0.09,null,24.418,1.16,1.16,{"$f":"IF(A11<160,0,升级!J11/升级!C$3)","v":0},null,25.4705,1.21,1.21,{"$f":"IF(A11<160,0,升级!J11/升级!C$3)","v":0},null,9,2441.8,116,58,null,2547.05,121,60.5]
[10,{"$f":"升级!C12","v":118},1,5,{"$f":"(VLOOKUP(INT(MAX(1,0.2*A12))*5,功法!B:E,4,FALSE)+(VLOOKUP(INT(MIN(60,MAX(1,0.2*A12+1)))*5,功法!B:E,4,FALSE)-VLOOKUP(INT(MAX(1,0.2*A12))*5,功法!B:E,4,FALSE))*MOD(A12,5)/5)*H12","v":0.00303166666666667},0.0583333333333333,123,0.1,null,24.9766666666667,1.18,1.18,{"$f":"IF(A12<160,0,升级!J12/升级!C$3)","v":0},null,26.035,1.23,1.23,{"$f":"IF(A12<160,0,升级!J12/升级!C$3)","v":0},null,10,2497.66666666667,118,59,null,2603.5,123,61.5]
[11,{"$f":"升级!C13","v":148},1,{"$f":"B13*D$1/3*C13","v":7.4},{"$f":"(VLOOKUP(INT(MAX(1,0.2*A13))*5,功法!B:E,4,FALSE)+(VLOOKUP(INT(MIN(60,MAX(1,0.2*A13+1)))*5,功法!B:E,4,FALSE)-VLOOKUP(INT(MAX(1,0.2*A13))*5,功法!B:E,4,FALSE))*MOD(A13,5)/5)*H13","v":0.0040018},0.0641666666666667,156,0.11,null,31.4993333333333,1.48,1.48,{"$f":"IF(A13<160,0,升级!J13/升级!C$3)","v":0},null,33.202,1.56,1.56,{"$f":"IF(A13<160,0,升级!J13/升级!C$3)","v":0},null,11,3149.93333333333,148,74,null,3320.2,156,78]
[12,{"$f":"升级!C14","v":150},1,{"$f":"D13","v":7.4},{"$f":"(VLOOKUP(INT(MAX(1,0.2*A14))*5,功法!B:E,4,FALSE)+(VLOOKUP(INT(MIN(60,MAX(1,0.2*A14+1)))*5,功法!B:E,4,FALSE)-VLOOKUP(INT(MAX(1,0.2*A14))*5,功法!B:E,4,FALSE))*MOD(A14,5)/5)*H14","v":0.0050932},0.07,158,0.12,null,32.1,1.5,1.5,{"$f":"IF(A14<160,0,升级!J14/升级!C$3)","v":0},null,33.812,1.58,1.58,{"$f":"IF(A14<160,0,升级!J14/升级!C$3)","v":0},null,12,3210,150,75,null,3381.2,158,79]
[13,{"$f":"升级!C15","v":154},1,{"$f":"D14","v":7.4},{"$f":"(VLOOKUP(INT(MAX(1,0.2*A15))*5,功法!B:E,4,FALSE)+(VLOOKUP(INT(MIN(60,MAX(1,0.2*A15+1)))*5,功法!B:E,4,FALSE)-VLOOKUP(INT(MAX(1,0.2*A15))*5,功法!B:E,4,FALSE))*MOD(A15,5)/5)*H15","v":0.00630586666666666},0.0758333333333333,162,0.13,null,33.1356666666667,1.54,1.54,{"$f":"IF(A15<160,0,升级!J15/升级!C$3)","v":0},null,34.857,1.62,1.62,{"$f":"IF(A15<160,0,升级!J15/升级!C$3)","v":0},null,13,3313.56666666667,154,77,null,3485.7,162,81]
[14,{"$f":"升级!C16","v":156},1,7.4,{"$f":"(VLOOKUP(INT(MAX(1,0.2*A16))*5,功法!B:E,4,FALSE)+(VLOOKUP(INT(MIN(60,MAX(1,0.2*A16+1)))*5,功法!B:E,4,FALSE)-VLOOKUP(INT(MAX(1,0.2*A16))*5,功法!B:E,4,FALSE))*MOD(A16,5)/5)*H16","v":0.0076398},0.0816666666666667,165,0.14,null,33.748,1.56,1.56,{"$f":"IF(A16<160,0,升级!J16/升级!C$3)","v":0},null,35.695,1.65,1.65,{"$f":"IF(A16<160,0,升级!J16/升级!C$3)","v":0},null,14,3374.8,156,78,null,3569.5,165,82.5]
[15,{"$f":"升级!C17","v":158},1,7.4,{"$f":"(VLOOKUP(INT(MAX(1,0.2*A17))*5,功法!B:E,4,FALSE)+(VLOOKUP(INT(MIN(60,MAX(1,0.2*A17+1)))*5,功法!B:E,4,FALSE)-VLOOKUP(INT(MAX(1,0.2*A17))*5,功法!B:E,4,FALSE))*MOD(A17,5)/5)*H17","v":0.009095},0.0875,167,0.15,null,34.365,1.58,1.58,{"$f":"IF(A17<160,0,升级!J17/升级!C$3)","v":0},null,36.3225,1.67,1.67,{"$f":"IF(A17<160,0,升级!J17/升级!C$3)","v":0},null,15,3436.5,158,79,null,3632.25,167,83.5]
[16,{"$f":"升级!C18","v":160},1,7.4,{"$f":"(VLOOKUP(INT(MAX(1,0.2*A18))*5,功法!B:E,4,FALSE)+(VLOOKUP(INT(MIN(60,MAX(1,0.2*A18+1)))*5,功法!B:E,4,FALSE)-VLOOKUP(INT(MAX(1,0.2*A18))*5,功法!B:E,4,FALSE))*MOD(A18,5)/5)*H18","v":0.0106714666666667},0.0933333333333333,169,0.16,null,34.9866666666667,1.6,1.6,{"$f":"IF(A18<160,0,升级!J18/升级!C$3)","v":0},null,36.9546666666667,1.69,1.69,{"$f":"IF(A18<160,0,升级!J18/升级!C$3)","v":0},null,16,3498.66666666667,160,80,null,3695.46666666667,169,84.5]
[17,{"$f":"升级!C19","v":162},1,7.4,{"$f":"(VLOOKUP(INT(MAX(1,0.2*A19))*5,功法!B:E,4,FALSE)+(VLOOKUP(INT(MIN(60,MAX(1,0.2*A19+1)))*5,功法!B:E,4,FALSE)-VLOOKUP(INT(MAX(1,0.2*A19))*5,功法!B:E,4,FALSE))*MOD(A19,5)/5)*H19","v":0.0123692},0.0991666666666667,171,0.17,null,35.613,1.62,1.62,{"$f":"IF(A19<160,0,升级!J19/升级!C$3)","v":0},null,37.5915,1.71,1.71,{"$f":"IF(A19<160,0,升级!J19/升级!C$3)","v":0},null,17,3561.3,162,81,null,3759.15,171,85.5]
[18,{"$f":"升级!C20","v":164},1,7.4,{"$f":"(VLOOKUP(INT(MAX(1,0.2*A20))*5,功法!B:E,4,FALSE)+(VLOOKUP(INT(MIN(60,MAX(1,0.2*A20+1)))*5,功法!B:E,4,FALSE)-VLOOKUP(INT(MAX(1,0.2*A20))*5,功法!B:E,4,FALSE))*MOD(A20,5)/5)*H20","v":0.0141882},0.105,174,0.18,null,36.244,1.64,1.64,{"$f":"IF(A20<160,0,升级!J20/升级!C$3)","v":0},null,38.454,1.74,1.74,{"$f":"IF(A20<160,0,升级!J20/升级!C$3)","v":0},null,18,3624.4,164,82,null,3845.4,174,87]
{"$rows_left_out":283}
{"sheet":"升级","index":1,"n_rows":302,"n_cols":18,"rows_kept":302,"cut":false,"hidden":false,"merged":[]}
[null,{"$f":"B302","v":2238115440},{"$nulls":11},{"$f":"SUBTOTAL(9,N3:N999)","v":5254}]
["等级","生命","攻击","防御","防御系数","涨幅",null,"神识上限","护盾百分比","护盾",{"$f":"D302","v":20346504},"标准免伤",0.5,"停留时长"]
[1,{"$f":"C3*20*(1+主表!F3)","v":2011.66666666667},{"$f":"D3*2","v":100},{"$f":"ROUND(E3*M$2,0)","v":50},100,null,null,1000,{"$nulls":5},1]
[2,{"$f":"C4*20*(1+主表!F4)","v":2063.8},{"$f":"D4*2","v":102},{"$f":"ROUND(MAX(D3+1,E4*M$2),0)","v":51},{"$f":"E3*(1+F4)","v":101.5},0.015,null,1000,{"$nulls":5},1,null,null,1]
[3,{"$f":"C5*20*(1+主表!F5)","v":2116.4},104,52,{"$f":"E4*(1+F5)","v":103.0225},{"$f":"F$4","v":0.015},null,1000,{"$nulls":5},1,null,null,3]
[4,{"$f":"C6*20*(1+主表!F6)","v":2169.46666666667},106,53,104.5678375,{"$f":"F$4","v":0.015},null,1000,{"$nulls":5},1,null,null,9]
[5,{"$f":"C7*20*(1+主表!F7)","v":2223},108,54,106.1363550625,{"$f":"F$4","v":0.015},null,1000,{"$nulls":5},1,null,null,27]
[6,{"$f":"C8*20*(1+主表!F8)","v":2277},110,55,107.728400388437,{"$f":"F$4","v":0.015},null,1000,{"$nulls":5},1]
[7,{"$f":"C9*20*(1+主表!F9)","v":2331.46666666667},112,56,109.344326394264,0.015,null,1000,{"$nulls":5},1]
[8,{"$f":"C10*20*(1+主表!F10)","v":2386.4},114,57,110.984491290178,0.015,null,1000,{"$nulls":5},1]
[9,{"$f":"C11*20*(1+主表!F11)","v":2441.8},116,58,112.649258659531,0.015,null,1000,{"$nulls":5},1]
[10,{"$f":"C12*20*(1+主表!F12)","v":2497.66666666667},118,59,114.338997539424,0.015,null,1000,{"$nulls":5},1]
[11,{"$f":"C13*20*(1+主表!F13)","v":3149.93333333333},148,74,148.640696801251,0.3,null,1000,{"$nulls":5},{"$f":"N3+1","v":2},null,null,446,{"$f":"(Q13+Q14)*(1+Q15)","v":1270.5}]
[12,{"$f":"C14*20*(1+主表!F14)","v":3210},150,75,150.870307253269,0.015,null,1000,{"$nulls":5},{"$f":"N4+1","v":2},null,null,280]
[13,{"$f":"C15*20*(1+主表!F15)","v":3313.56666666667},154,77,153.133361862068,0.015,null,1000,{"$nulls":5},2,null,null,0.75]
[14,{"$f":"C16*20*(1+主表!F16)","v":3374.8},156,78,155.430362289999,0.015,null,1000,{"$nulls":5},2]
[15,{"$f":"C17*20*(1+主表!F17)","v":3436.5},158,79,157.761817724349,0.015,null,1000,{"$nulls":5},2]
[16,{"$f":"C18*20*(1+主表!F18)","v":3498.66666666667},160,80,160.128244990215,0.015,null,1000,{"$nulls":5},2]
[17,{"$f":"C19*20*(1+主表!F19)","v":3561.3},162,81,162.530168665068,0.015,null,1000,{"$nulls":5},2]
[18,{"$f":"C20*20*(1+主表!F20)","v":3624.4},164,82,164.968121195044,0.015,null,1000,{"$nulls":5},2]
{"$rows_left_out":283}
{"sheet":"功法","index":2,"n_rows":61,"n_cols":19,"rows_kept":61,"cut":false,"hidden":false,"merged":[]}
["等级","需求修为等级","标准强度","星级","被动加成",null,1,2,null,null,"生命","攻击","防御","均值","金","水","木","火","土"]
[1,5,{"$f":"G1","v":1},1,{"$f":"VLOOKUP(INT(D2),J:N,5,FALSE)","v":0},null,null,null,"0星",1,{"$f":"[2]技能设计!C3","v":0},{"$f":"[2]技能设计!D3","v":0},{"$f":"[2]技能设计!E3","v":0},{"$f":"AVERAGE(K2:M2)/100","v":0},{"$f":"[2]技能设计!G3","v":0},{"$f":"[2]技能设计!H3","v":0},{"$f":"[2]技能设计!I3","v":0},{"$f":"[2]技能设计!J3","v":0},{"$f":"[2]技能设计!K3","v":0}]
[2,10,{"$f":"G$1+(H$1-G$1)*A2/59","v":1.01694915254237},1.085,{"$f":"VLOOKUP(INT(D3),J:N,5,FALSE)+(VLOOKUP(ROUNDUP(D3,0),J:N,5,FALSE)-VLOOKUP(INT(D3),J:N,5,FALSE))*(D3-INT(D3))","v":0.0303166666666667},null,null,null,"1星",2,{"$f":"[2]技能设计!C4","v":21},{"$f":"[2]技能设计!D4","v":62},{"$f":"[2]技能设计!E4","v":24},{"$f":"AVERAGE(K3:M3)/100","v":0.356666666666667},{"$f":"[2]技能设计!G4","v":5},{"$f":"[2]技能设计!H4","v":0},{"$f":"[2]技能设计!I4","v":5},{"$f":"[2]技能设计!J4","v":5},{"$f":"[2]技能设计!K4","v":0}]
[3,15,{"$f":"G$1+(H$1-G$1)*A3/59","v":1.03389830508475},1.17,{"$f":"VLOOKUP(INT(D4),J:N,5,FALSE)+(VLOOKUP(ROUNDUP(D4,0),J:N,5,FALSE)-VLOOKUP(INT(D4),J:N,5,FALSE))*(D4-INT(D4))","v":0.0606333333333333},null,null,null,"2星",3,{"$f":"[2]技能设计!C5","v":77},{"$f":"[2]技能设计!D5","v":139},{"$f":"[2]技能设计!E5","v":78},0.98,{"$f":"[2]技能设计!G5","v":5},{"$f":"[2]技能设计!H5","v":5},{"$f":"[2]技能设计!I5","v":10},{"$f":"[2]技能设计!J5","v":10},{"$f":"[2]技能设计!K5","v":5}]
[4,20,1.05084745762712,1.255,0.0909499999999999,null,null,null,"3星",4,{"$f":"[2]技能设计!C6","v":103},{"$f":"[2]技能设计!D6","v":211},{"$f":"[2]技能设计!E6","v":102},1.38666666666667,{"$f":"[2]技能设计!G6","v":10},{"$f":"[2]技能设计!H6","v":5},{"$f":"[2]技能设计!I6","v":10},{"$f":"[2]技能设计!J6","v":10},{"$f":"[2]技能设计!K6","v":5}]
[5,25,1.06779661016949,1.34,0.121266666666667,null,null,null,"4星",5,{"$f":"[2]技能设计!C7","v":159},{"$f":"[2]技能设计!D7","v":288},{"$f":"[2]技能设计!E7","v":151},1.99333333333333,{"$f":"[2]技能设计!G7","v":10},{"$f":"[2]技能设计!H7","v":10},{"$f":"[2]技能设计!I7","v":20},{"$f":"[2]技能设计!J7","v":20},{"$f":"[2]技能设计!K7","v":10}]
[6,30,1.08474576271186,1.425,0.151583333333333,null,null,null,"5星",6,{"$f":"[2]技能设计!C8","v":174},{"$f":"[2]技能设计!D8","v":308},{"$f":"[2]技能设计!E8","v":166},2.16,{"$f":"[2]技能设计!G8","v":10},{"$f":"[2]技能设计!H8","v":10},{"$f":"[2]技能设计!I8","v":20},{"$f":"[2]技能设计!J8","v":20},{"$f":"[2]技能设计!K8","v":10}]
[7,35,1.10169491525424,1.51,0.1819]
[8,40,1.11864406779661,1.595,0.212216666666667]
[9,45,1.13559322033898,1.68,0.242533333333333]
[10,50,1.15254237288136,1.765,0.27285]
[11,55,1.16949152542373,1.85,0.303166666666667]
[12,60,1.1864406779661,1.935,0.333483333333333]
[13,65,1.20338983050847,2.02,0.369133333333333]
[14,70,1.22033898305085,2.105,0.422116666666667]
[15,75,1.23728813559322,2.19,0.4751]
[16,80,1.25423728813559,2.275,0.528083333333333]
[17,85,1.27118644067797,2.36,0.581066666666667]
[18,90,1.28813559322034,2.445,0.63405]
[19,95,1.30508474576271,2.53,0.687033333333333]
{"$rows_left_out":42}
{"sheet":"投产","index":3,"n_rows":25,"n_cols":10,"rows_kept":25,"cut":false,"hidden":false,"merged":[]}
[null,"投产方式","频次","期望的独占奖励","期望的核心奖励","其他",null,null,"类型","说明"]
[null,"主线","一次性","特定功法/法宝",null,null,null,"灵石","资源","常规货币"]
[null,"支线","一次性",null,"必有的天材地宝",null,1,"修为","资源","主角提升境界所需资源"]
[null,"爬塔","一次性",null,null,null,2,"灵气","资源","功法升级资源"]
[{"$nulls":6},3,"灵韵","资源","法宝升级资源"]
[null,"神识释放","有限次数",null,"1：2：3=60：20：20"]
[{"$nulls":7},"功法碎片","材料","功法升星资源"]
[null,"挂机神识","重复",{"$nulls":4},"法宝碎片","材料","法宝升星资源"]
[null,"挂机道侣","重复",null,"灵韵","修为，低概率稀有道具",null,"天材地宝","材料","人物突破特定境界所需资源（选有和必有）"]
[null,"洞府打坐","重复",null,"20%修为",null,null,"好感度礼物","材料","道友提升好感度等级所需资源"]
["暂未实现","法宝练器","一次性",{"$nulls":4},"心情礼物","材料","道友改善心情所需资源"]
[]
[null,"活动？",{"$nulls":5},"神识丹","材料","恢复神识值"]
[null,"商店？",null,null,"选有的天材地宝\n高性价比的123符\n灵气",null,null,"妖丹","资源","稀有货币"]
[null,"广告？",{"$nulls":5},"妖王丹","资源","人民币代币"]
[]
[null,"功法来源？","本体只能一次性获得",{"$nulls":4},"天赋点数"]
[null,"法宝来源？"]
[]
[]
{"$rows_left_out":6}
{"sheet":"投产详情","index":4,"n_rows":17,"n_cols":10,"rows_kept":17,"cut":false,"hidden":false,"merged":[]}
["投产方式","频次",{"$nulls":6},"类型","说明"]
["主线","一次性",{"$nulls":5},"灵石","资源","常规货币"]
["支线","一次性",{"$nulls":5},"修为","资源","主角提升境界所需资源"]
["爬塔","一次性",{"$nulls":5},"灵气","资源","功法升级资源"]
[{"$nulls":7},"灵韵","资源","法宝升级资源"]
["神识释放","有限次数"]
[{"$nulls":7},"功法碎片","材料","功法升星资源"]
["挂机神识","重复",{"$nulls":5},"法宝碎片","材料","法宝升星资源"]
["挂机道侣","重复",{"$nulls":5},"天材地宝","材料","人物突破特定境界所需资源（选有和必有）"]
["洞府打坐","重复",{"$nulls":5},"好感度礼物","材料","道友提升好感度等级所需资源"]
["法宝练器","一次性",{"$nulls":5},"心情礼物","材料","道友改善心情所需资源"]
[]
["商店",{"$nulls":6},"神识丹","材料","恢复神识值"]
[{"$nulls":7},"妖丹","资源","稀有货币"]
[{"$nulls":7},"妖王丹","资源","人民币代币"]
[]
[{"$nulls":7},"天赋点数"]

{"sheet":"Sheet1","index":5,"n_rows":162,"n_cols":23,"rows_kept":162,"cut":false,"hidden":false,"merged":[]}
[null,null,"累计","累计","1d=12h",{"$nulls":7},{"$f":"SUM(M3:M5)","v":9.015},null,"每小时获取份数",null,10]
["等级","驻留(s)","驻留(m)","驻留(h)","驻留(d)",null,"天数","等级",null,null,null,"花费时间","获得时长","获取效率","获取份数"]
[1,60,{"$f":"SUM(B$3:B3)/60","v":1},{"$f":"C3/60","v":0.0166666666666667},{"$f":"D3/6","v":0.00277777777777778},null,1,60,null,null,"在线高效",0.5,{"$f":"L3*N3","v":3},6,{"$f":"Q$1*M3","v":30}]
[2,{"$f":"B3+INT(A4*0.1+1)*5","v":65},{"$f":"SUM(B$3:B4)/60","v":2.08333333333333},{"$f":"C4/60","v":0.0347222222222222},{"$f":"D4/6","v":0.00578703703703704},null,2,90,null,null,"在线标准",1,{"$f":"L4*N4","v":3},3,{"$f":"Q$1*M4","v":30}]
[3,{"$f":"B4+INT(A5*0.1+1)*5","v":70},{"$f":"SUM(B$3:B5)/60","v":3.25},0.0541666666666667,0.00902777777777778,null,3,120,null,null,"无限",{"$f":"24-L3-L4","v":22.5},3.015,0.134,30.15]
[4,75,{"$f":"SUM(B$3:B6)/60","v":4.5},0.075,0.0125,null,4,150]
[5,80,{"$f":"SUM(B$3:B7)/60","v":5.83333333333333},0.0972222222222222,0.0162037037037037,{"$nulls":5},"总","符","乾坤袋","洞府打坐","神识"]
[6,85,{"$f":"SUM(B$3:B8)/60","v":7.25},0.120833333333333,0.0201388888888889,{"$nulls":4},"经验",300,100,null,100,100]
[7,90,{"$f":"SUM(B$3:B9)/60","v":8.75},0.145833333333333,0.0243055555555556,{"$nulls":4},"其他",300,100,100,null,100]
[8,95,{"$f":"SUM(B$3:B10)/60","v":10.3333333333333},0.172222222222222,0.0287037037037037]
[9,100,{"$f":"SUM(B$3:B11)/60","v":12},0.2,0.0333333333333333,{"$nulls":14},{"$f":"2452-80","v":2372},{"$f":"4894-160","v":4734}]
[10,110,{"$f":"SUM(B$3:B12)/60","v":13.8333333333333},0.230555555555556,0.0384259259259259,{"$nulls":8},{"$f":"24*3600","v":86400},{"$nulls":5},2368,4726]
[11,120,{"$f":"SUM(B$3:B13)/60","v":15.8333333333333},0.263888888888889,0.0439814814814815,{"$nulls":14},2276,4542]
[12,130,{"$f":"SUM(B$3:B14)/60","v":18},0.3,0.05,{"$nulls":5},{"$f":"100/(24*3600)","v":0.00115740740740741},{"$nulls":9},4570]
[13,140,{"$f":"SUM(B$3:B15)/60","v":20.3333333333333},0.338888888888889,0.0564814814814815,{"$nulls":15},4537,null,{"$f":"1150*4","v":4600}]
[14,150,{"$f":"SUM(B$3:B16)/60","v":22.8333333333333},0.380555555555556,0.0634259259259259]
[15,160,{"$f":"SUM(B$3:B17)/60","v":25.5},0.425,0.0708333333333333]
[16,170,{"$f":"SUM(B$3:B18)/60","v":28.3333333333333},0.472222222222222,0.0787037037037037,{"$nulls":5},"总抽",120,"份数"]
[17,180,{"$f":"SUM(B$3:B19)/60","v":31.3333333333333},0.522222222222222,0.087037037037037]
[18,190,{"$f":"SUM(B$3:B20)/60","v":34.5},0.575,0.0958333333333333,{"$nulls":5},"高效",20]
{"$rows_left_out":142}