{"text_format":"2","workbook":"xlsx","n_sheets":2,"sheets":["HeroPowerUpConfig","HeroQiangDuAddConfig"],"not_rendered":{"charts":0,"images":0,"macros":0,"external_links":3,"defined_names":1,"comments":0,"pivot_tables":0},"unopened":[],"bounds":{"document_bytes":16777216,"sheet_cells":100000,"run_cost":"one","rows_first":2000,"rows_last":500,"rows_between":2000,"halvings":0,"cell_chars":16384,"cell_head_chars":4096},"cells_cut":0,"cells_raw":0,"read":"whole","date_system":"1900"}

{"sheet":"HeroPowerUpConfig","index":0,"n_rows":304,"n_cols":38,"rows_kept":304,"cut":false,"hidden":false,"merged":[]}
["ID","HeroLevel","jingjie1","jingjie2","jingjie3","jingjieLanIDs",{"$nulls":6},"levelUpExp","DujieLevelbattleID","DujieRateviaBattle","DujieMustItemIDs","DujieMustItemValues","DujieItemIDs","DujieItemValues","LeijieDamages","HPFactor","ATKFactor","DEFFactor","HudunFactor","defK","ShenshiMax","AutoXiuwei","FailureExpReduce","MaxActiveGongfaNum","MaxPassiveGongfaNum","MaxFabaoNum",{"$nulls":4},"MPFactor","DaoyouCount"]
["int","int","int","int","int","int[]",{"$nulls":6},"int","int","int","int[]","int[]","int[]","int[]","int[]","float","float","float","float","int","int","float","int","int","int","int",{"$nulls":4},"float","int"]
[{"$nulls":31},{"$f":"SUM(AF5:AF304)","v":1229974},{"$f":"AF3/60","v":20499.566666666698},{"$f":"AG3/60","v":341.65944444444398},{"$f":"AH3/12","v":28.471620370370399}]
["ID","玩家修为境界（等级）","大境界ID","中境界ID","小境界ID","境界语言表ID","境界名称1","境界名称2","境界名称3",null,null,null,"升级所需修为值\n（-1代表最大等级)","渡劫必须战斗ID","战斗增加渡劫几率","渡劫必需道具ID","渡劫必需道具数量","渡劫选有道具IDs","渡劫选有道具数量","雷劫伤害\n要填下限和上限","生命倍率","攻击倍率","防御倍率","护盾倍率","防御系数K","神识上限","每秒获得的修为值","雷劫失败扣除的当前等级修为百分比","主动功法可配置上限","被动功法可配置上限","法宝可配置上限","吐纳时长(s)","分钟","小时","天（每天12小时）","法力倍率","允许出现的最大挂机道友数量"]
[1,1,1,1,{"$f":"I5","v":1},{"$f":"_xlfn.TEXTJOIN(\";\",1,J5:L5)","v":"225;235;238"},"筑基期","前",1,225,235,238,{"$f":"[1]ResourceLevelConfig!$E5*10","v":1000},{"$f":"IF(I5=10,100004,-1)","v":-1},{"$f":"IF(N5=-1,-1,20)","v":-1},{"$f":"IF(I5=10,1002,-1)","v":-1},{"$f":"IF(P5=-1,-1,100)","v":-1},{"$f":"IF(I5=10,\"1001;1002;1004\",-1)","v":-1},{"$f":"IF(R5=-1,-1,\"100;200;300\")","v":-1},{"$f":"IF(G5=G6,0,CONCATENATE(80*ROUND(VLOOKUP(B5,[2]MonsterPowerUpConfig!$A:$I,9,FALSE),0),\";\",120*ROUND(VLOOKUP(B5,[2]MonsterPowerUpConfig!$A:$I,9,FALSE),0)))","v":0},{"$f":"[3]主表!J3","v":15.0875},{"$f":"[3]主表!K3","v":1},{"$f":"[3]主表!L3","v":1},{"$f":"[3]主表!M3","v":0},{"$f":"[3]主表!$G3","v":210},{"$f":"[3]升级!$H3","v":1000},{"$f":"MAX(1,ROUND(100/(24*3600)*VLOOKUP(B5,[1]ResourceLevelConfig!$A:$E,5,FALSE),2))","v":1},-1,2,0,1,{"$f":"ROUND(10^(B5*0.01+2.07),0)","v":120},null,{"$f":"50*W5","v":50},null,1,1,1]
[2,2,1,1,{"$f":"I6","v":2},{"$f":"_xlfn.TEXTJOIN(\";\",1,J6:L6)","v":"225;235;239"},"筑基期","前",2,225,235,239,{"$f":"[1]ResourceLevelConfig!$E6*10","v":1100},{"$f":"IF(I6=10,100004,-1)","v":-1},{"$f":"IF(N6=-1,-1,20)","v":-1},{"$f":"IF(I6=10,1002,-1)","v":-1},{"$f":"IF(P6=-1,-1,100)","v":-1},{"$f":"IF(I6=10,\"1001;1002;1004\",-1)","v":-1},{"$f":"IF(R6=-1,-1,\"100;200;300\")","v":-1},{"$f":"IF(G6=G7,0,CONCATENATE(80*ROUND(VLOOKUP(B6,[2]MonsterPowerUpConfig!$A:$I,9,FALSE),0),\";\",120*ROUND(VLOOKUP(B6,[2]MonsterPowerUpConfig!$A:$I,9,FALSE),0)))","v":0},{"$f":"[3]主表!J4","v":15.402625},{"$f":"[3]主表!K4","v":1.0149999999999999},{"$f":"[3]主表!L4","v":1.0149999999999999},{"$f":"[3]主表!M4","v":0},{"$f":"[3]主表!$G4","v":213},{"$f":"[3]升级!$H4","v":1000},{"$f":"MAX(1,ROUND(100/(24*3600)*VLOOKUP(B6,[1]ResourceLevelConfig!$A:$E,5,FALSE),2))","v":1},-1,{"$f":"AC5","v":2},{"$f":"AD5","v":0},1,{"$f":"MAX(AF5+10,ROUND(10^(B6*0.01+1.405),0))","v":130},null,50.749999999999993,null,1,1,2]
[3,3,1,1,3,"225;235;240","筑基期","前",3,225,235,240,{"$f":"[1]ResourceLevelConfig!$E7*10","v":1200},-1,-1,-1,-1,-1,-1,{"$f":"IF(G7=G8,0,CONCATENATE(80*ROUND(VLOOKUP(B7,[2]MonsterPowerUpConfig!$A:$I,9,FALSE),0),\";\",120*ROUND(VLOOKUP(B7,[2]MonsterPowerUpConfig!$A:$I,9,FALSE),0)))","v":0},{"$f":"[3]主表!J5","v":15.723809062499996},{"$f":"[3]主表!K5","v":1.0302249999999997},{"$f":"[3]主表!L5","v":1.0302249999999997},{"$f":"[3]主表!M5","v":0},{"$f":"[3]主表!$G5","v":216},{"$f":"[3]升级!$H5","v":1000},{"$f":"MAX(1,ROUND(100/(24*3600)*VLOOKUP(B7,[1]ResourceLevelConfig!$A:$E,5,FALSE),2))","v":1},-1,{"$f":"AC6","v":2},{"$f":"AD6","v":0},{"$f":"AE6","v":1},140,null,51.51124999999999,null,1,1,3]
[4,4,1,1,4,"225;235;241","筑基期","前",4,225,235,241,{"$f":"[1]ResourceLevelConfig!$E8*10","v":1300},-1,-1,-1,-1,-1,-1,{"$f":"IF(G8=G9,0,CONCATENATE(80*ROUND(VLOOKUP(B8,[2]MonsterPowerUpConfig!$A:$I,9,FALSE),0),\";\",120*ROUND(VLOOKUP(B8,[2]MonsterPowerUpConfig!$A:$I,9,FALSE),0)))","v":0},{"$f":"[3]主表!J6","v":16.051163056249994},{"$f":"[3]主表!K6","v":1.0456783749999996},{"$f":"[3]主表!L6","v":1.0456783749999996},{"$f":"[3]主表!M6","v":0},{"$f":"[3]主表!$G6","v":219},{"$f":"[3]升级!$H6","v":1000},{"$f":"MAX(1,ROUND(100/(24*3600)*VLOOKUP(B8,[1]ResourceLevelConfig!$A:$E,5,FALSE),2))","v":1},-1,2,0,1,150,null,52.283918749999984,null,1,1,4]
[5,5,1,1,5,"225;235;242","筑基期","前",5,225,235,242,{"$f":"[1]ResourceLevelConfig!$E9*10","v":1400},-1,-1,-1,-1,-1,-1,{"$f":"IF(G9=G10,0,CONCATENATE(80*ROUND(VLOOKUP(B9,[2]MonsterPowerUpConfig!$A:$I,9,FALSE),0),\";\",120*ROUND(VLOOKUP(B9,[2]MonsterPowerUpConfig!$A:$I,9,FALSE),0)))","v":0},{"$f":"[3]主表!J7","v":16.384799812773434},{"$f":"[3]主表!K7","v":1.0613635506249997},{"$f":"[3]主表!L7","v":1.0613635506249997},{"$f":"[3]主表!M7","v":0},{"$f":"[3]主表!$G7","v":222},{"$f":"[3]升级!$H7","v":1000},{"$f":"MAX(1,ROUND(100/(24*3600)*VLOOKUP(B9,[1]ResourceLevelConfig!$A:$E,5,FALSE),2))","v":1},-1,2,0,1,160,null,53.068177531249979,null,1,1,5]
[6,6,1,1,6,"225;235;243","筑基期","前",6,225,235,243,{"$f":"[1]ResourceLevelConfig!$E10*10","v":1500},-1,-1,-1,-1,-1,-1,{"$f":"IF(G10=G11,0,CONCATENATE(80*ROUND(VLOOKUP(B10,[2]MonsterPowerUpConfig!$A:$I,9,FALSE),0),\";\",120*ROUND(VLOOKUP(B10,[2]MonsterPowerUpConfig!$A:$I,9,FALSE),0)))","v":0},{"$f":"[3]主表!J8","v":16.724834160304912},{"$f":"[3]主表!K8","v":1.0772840038843745},{"$f":"[3]主表!L8","v":1.0772840038843745},{"$f":"[3]主表!M8","v":0},{"$f":"[3]主表!$G8","v":226},{"$f":"[3]升级!$H8","v":1000},{"$f":"MAX(1,ROUND(100/(24*3600)*VLOOKUP(B10,[1]ResourceLevelConfig!$A:$E,5,FALSE),2))","v":1},-1,2,0,1,170,null,53.864200194218725,null,1,1,6]
[7,7,1,1,7,"225;235;244","筑基期","前",7,225,235,244,{"$f":"[1]ResourceLevelConfig!$E11*10","v":1600},-1,-1,-1,-1,-1,-1,{"$f":"IF(G11=G12,0,CONCATENATE(80*ROUND(VLOOKUP(B11,[2]MonsterPowerUpConfig!$A:$I,9,FALSE),0),\";\",120*ROUND(VLOOKUP(B11,[2]MonsterPowerUpConfig!$A:$I,9,FALSE),0)))","v":0},{"$f":"[3]主表!J9","v":17.071382958304465},{"$f":"[3]主表!K9","v":1.0934432639426399},{"$f":"[3]主表!L9","v":1.0934432639426399},{"$f":"[3]主表!M9","v":0},{"$f":"[3]主表!$G9","v":229},{"$f":"[3]升级!$H9","v":1000},{"$f":"MAX(1,ROUND(100/(24*3600)*VLOOKUP(B11,[1]ResourceLevelConfig!$A:$E,5,FALSE),2))","v":1},-1,2,0,1,180,null,54.672163197131994,null,1,1,7]
[8,8,1,1,8,"225;235;245","筑基期","前",8,225,235,245,{"$f":"[1]ResourceLevelConfig!$E12*10","v":1700},-1,-1,-1,-1,-1,-1,{"$f":"IF(G12=G13,0,CONCATENATE(80*ROUND(VLOOKUP(B12,[2]MonsterPowerUpConfig!$A:$I,9,FALSE),0),\";\",120*ROUND(VLOOKUP(B12,[2]MonsterPowerUpConfig!$A:$I,9,FALSE),0)))","v":0},{"$f":"[3]主表!J10","v":17.424565132557941},{"$f":"[3]主表!K10","v":1.1098449129017796},{"$f":"[3]主表!L10","v":1.1098449129017796},{"$f":"[3]主表!M10","v":0},{"$f":"[3]主表!$G10","v":232},{"$f":"[3]升级!$H10","v":1000},{"$f":"MAX(1,ROUND(100/(24*3600)*VLOOKUP(B12,[1]ResourceLevelConfig!$A:$E,5,FALSE),2))","v":1},-1,2,0,1,190,null,55.492245645088978,null,1,1,8]
[9,9,1,1,9,"225;235;246","筑基期","前",9,225,235,246,{"$f":"[1]ResourceLevelConfig!$E13*10","v":1800},-1,-1,-1,-1,-1,-1,{"$f":"IF(G13=G14,0,CONCATENATE(80*ROUND(VLOOKUP(B13,[2]MonsterPowerUpConfig!$A:$I,9,FALSE),0),\";\",120*ROUND(VLOOKUP(B13,[2]MonsterPowerUpConfig!$A:$I,9,FALSE),0)))","v":0},{"$f":"[3]主表!J11","v":17.784501710873396},{"$f":"[3]主表!K11","v":1.1264925865953062},{"$f":"[3]主表!L11","v":1.1264925865953062},{"$f":"[3]主表!M11","v":0},{"$f":"[3]主表!$G11","v":236},{"$f":"[3]升级!$H11","v":1000},{"$f":"MAX(1,ROUND(100/(24*3600)*VLOOKUP(B13,[1]ResourceLevelConfig!$A:$E,5,FALSE),2))","v":1},-1,2,0,1,200,null,56.324629329765308,null,1,1,9]
[10,10,1,1,10,"225;235;247","筑基期","前",10,225,235,247,{"$f":"[1]ResourceLevelConfig!$E14*10","v":1900},100004,20,1301,1,1301,1,{"$f":"IF(G14=G15,0,CONCATENATE(80*ROUND(VLOOKUP(B14,[2]MonsterPowerUpConfig!$A:$I,9,FALSE),0),\";\",120*ROUND(VLOOKUP(B14,[2]MonsterPowerUpConfig!$A:$I,9,FALSE),0)))","v":0},{"$f":"[3]主表!J12","v":18.151315859383491},{"$f":"[3]主表!K12","v":1.1433899753942356},{"$f":"[3]主表!L12","v":1.1433899753942356},{"$f":"[3]主表!M12","v":0},{"$f":"[3]主表!$G12","v":239},{"$f":"[3]升级!$H12","v":1000},{"$f":"MAX(1,ROUND(100/(24*3600)*VLOOKUP(B14,[1]ResourceLevelConfig!$A:$E,5,FALSE),2))","v":1},20,2,0,1,210,null,57.16949876971178,null,1,1,10]
[11,11,1,2,1,"225;236;238","筑基期","中",1,225,236,238,{"$f":"[1]ResourceLevelConfig!$E15*10","v":2000},-1,-1,-1,-1,-1,-1,{"$f":"IF(G15=G16,0,CONCATENATE(80*ROUND(VLOOKUP(B15,[2]MonsterPowerUpConfig!$A:$I,9,FALSE),0),\";\",120*ROUND(VLOOKUP(B15,[2]MonsterPowerUpConfig!$A:$I,9,FALSE),0)))","v":0},{"$f":"[3]主表!J13","v":20.07649873045354},{"$f":"[3]主表!K13","v":1.2577289729336594},{"$f":"[3]主表!L13","v":1.2577289729336594},{"$f":"[3]主表!M13","v":0},{"$f":"[3]主表!$G13","v":265},{"$f":"[3]升级!$H13","v":1000},{"$f":"MAX(1,ROUND(100/(24*3600)*VLOOKUP(B15,[1]ResourceLevelConfig!$A:$E,5,FALSE),2))","v":1},-1,2,1,1,220,null,null,null,1,1,11]
[12,12,1,2,2,"225;236;239","筑基期","中",2,225,236,239,{"$f":"[1]ResourceLevelConfig!$E16*10","v":2100},-1,-1,-1,-1,-1,-1,{"$f":"IF(G16=G17,0,CONCATENATE(80*ROUND(VLOOKUP(B16,[2]MonsterPowerUpConfig!$A:$I,9,FALSE),0),\";\",120*ROUND(VLOOKUP(B16,[2]MonsterPowerUpConfig!$A:$I,9,FALSE),0)))","v":0},{"$f":"[3]主表!J14","v":20.489348265819007},{"$f":"[3]主表!K14","v":1.2765949075276639},{"$f":"[3]主表!L14","v":1.2765949075276639},{"$f":"[3]主表!M14","v":0},{"$f":"[3]主表!$G14","v":269},{"$f":"[3]升级!$H14","v":1000},{"$f":"MAX(1,ROUND(100/(24*3600)*VLOOKUP(B16,[1]ResourceLevelConfig!$A:$E,5,FALSE),2))","v":1},-1,{"$f":"AC15","v":2},{"$f":"AD15","v":1},1,230,null,null,null,1,1,12]
[13,13,1,2,3,"225;236;240","筑基期","中",3,225,236,240,{"$f":"[1]ResourceLevelConfig!$E17*10","v":2200},-1,-1,-1,-1,-1,-1,{"$f":"IF(G17=G18,0,CONCATENATE(80*ROUND(VLOOKUP(B17,[2]MonsterPowerUpConfig!$A:$I,9,FALSE),0),\";\",120*ROUND(VLOOKUP(B17,[2]MonsterPowerUpConfig!$A:$I,9,FALSE),0)))","v":0},{"$f":"[3]主表!J15","v":20.910066075031089},{"$f":"[3]主表!K15","v":1.2957438311405789},{"$f":"[3]主表!L15","v":1.2957438311405789},{"$f":"[3]主表!M15","v":0},{"$f":"[3]主表!$G15","v":273},{"$f":"[3]升级!$H15","v":1000},{"$f":"MAX(1,ROUND(100/(24*3600)*VLOOKUP(B17,[1]ResourceLevelConfig!$A:$E,5,FALSE),2))","v":1},-1,{"$f":"AC16","v":2},{"$f":"AD16","v":1},{"$f":"AE16","v":1},240,null,null,null,1,1,13]
[14,14,1,2,4,"225;236;241","筑基期","中",4,225,236,241,{"$f":"[1]ResourceLevelConfig!$E18*10","v":2300},-1,-1,-1,-1,-1,-1,{"$f":"IF(G18=G19,0,CONCATENATE(80*ROUND(VLOOKUP(B18,[2]MonsterPowerUpConfig!$A:$I,9,FALSE),0),\";\",120*ROUND(VLOOKUP(B18,[2]MonsterPowerUpConfig!$A:$I,9,FALSE),0)))","v":0},{"$f":"[3]主表!J16","v":21.338795315159736},{"$f":"[3]主表!K16","v":1.3151799886076876},{"$f":"[3]主表!L16","v":1.3151799886076876},{"$f":"[3]主表!M16","v":0},{"$f":"[3]主表!$G16","v":278},{"$f":"[3]升级!$H16","v":1000},{"$f":"MAX(1,ROUND(100/(24*3600)*VLOOKUP(B18,[1]ResourceLevelConfig!$A:$E,5,FALSE),2))","v":1},-1,2,1,1,250,null,null,null,1,1,14]
[15,15,1,2,5,"225;236;242","筑基期","中",5,225,236,242,{"$f":"[1]ResourceLevelConfig!$E19*10","v":2400},-1,-1,-1,-1,-1,-1,{"$f":"IF(G19=G20,0,CONCATENATE(80*ROUND(VLOOKUP(B19,[2]MonsterPowerUpConfig!$A:$I,9,FALSE),0),\";\",120*ROUND(VLOOKUP(B19,[2]MonsterPowerUpConfig!$A:$I,9,FALSE),0)))","v":0},{"$f":"[3]主表!J17","v":21.775681667625346},{"$f":"[3]主表!K17","v":1.334907688436803},{"$f":"[3]主表!L17","v":1.334907688436803},{"$f":"[3]主表!M17","v":0},{"$f":"[3]主表!$G17","v":282},{"$f":"[3]升级!$H17","v":1000},{"$f":"MAX(1,ROUND(100/(24*3600)*VLOOKUP(B19,[1]ResourceLevelConfig!$A:$E,5,FALSE),2))","v":1},-1,2,1,1,260,null,null,null,1,1,15]
[16,16,1,2,6,"225;236;243","筑基期","中",6,225,236,243,{"$f":"[1]ResourceLevelConfig!$E20*10","v":2500},-1,-1,-1,-1,-1,-1,{"$f":"IF(G20=G21,0,CONCATENATE(80*ROUND(VLOOKUP(B20,[2]MonsterPowerUpConfig!$A:$I,9,FALSE),0),\";\",120*ROUND(VLOOKUP(B20,[2]MonsterPowerUpConfig!$A:$I,9,FALSE),0)))","v":0},{"$f":"[3]主表!J18","v":22.220873381719016},{"$f":"[3]主表!K18","v":1.3549313037633548},{"$f":"[3]主表!L18","v":1.3549313037633548},{"$f":"[3]主表!M18","v":0},{"$f":"[3]主表!$G18","v":287},{"$f":"[3]升级!$H18","v":1000},{"$f":"MAX(1,ROUND(100/(24*3600)*VLOOKUP(B20,[1]ResourceLevelConfig!$A:$E,5,FALSE),2))","v":1},-1,2,1,1,270,null,null,null,1,1,16]
[17,17,1,2,7,"225;236;244","筑基期","中",7,225,236,244,{"$f":"[1]ResourceLevelConfig!$E21*10","v":2600},-1,-1,-1,-1,-1,-1,{"$f":"IF(G21=G22,0,CONCATENATE(80*ROUND(VLOOKUP(B21,[2]MonsterPowerUpConfig!$A:$I,9,FALSE),0),\";\",120*ROUND(VLOOKUP(B21,[2]MonsterPowerUpConfig!$A:$I,9,FALSE),0)))","v":0},{"$f":"[3]主表!J19","v":22.674521318860283},{"$f":"[3]主表!K19","v":1.3752552733198049},{"$f":"[3]主表!L19","v":1.3752552733198049},{"$f":"[3]主表!M19","v":0},{"$f":"[3]主表!$G19","v":291},{"$f":"[3]升级!$H19","v":1000},{"$f":"MAX(1,ROUND(100/(24*3600)*VLOOKUP(B21,[1]ResourceLevelConfig!$A:$E,5,FALSE),2))","v":1},-1,2,1,1,280,null,null,null,1,1,17]
[18,18,1,2,8,"225;236;245","筑基期","中",8,225,236,245,{"$f":"[1]ResourceLevelConfig!$E22*10","v":2700},-1,-1,-1,-1,-1,-1,{"$f":"IF(G22=G23,0,CONCATENATE(80*ROUND(VLOOKUP(B22,[2]MonsterPowerUpConfig!$A:$I,9,FALSE),0),\";\",120*ROUND(VLOOKUP(B22,[2]MonsterPowerUpConfig!$A:$I,9,FALSE),0)))","v":0},{"$f":"[3]主表!J20","v":23.1367789976049},{"$f":"[3]主表!K20","v":1.3958841024196018},{"$f":"[3]主表!L20","v":1.3958841024196018},{"$f":"[3]主表!M20","v":0},{"$f":"[3]主表!$G20","v":296},{"$f":"[3]升级!$H20","v":1000},{"$f":"MAX(1,ROUND(100/(24*3600)*VLOOKUP(B22,[1]ResourceLevelConfig!$A:$E,5,FALSE),2))","v":1},-1,2,1,1,290,null,null,null,1,1,18]
[19,19,1,2,9,"225;236;246","筑基期","中",9,225,236,246,{"$f":"[1]ResourceLevelConfig!$E23*10","v":2800},-1,-1,-1,-1,-1,-1,{"$f":"IF(G23=G24,0,CONCATENATE(80*ROUND(VLOOKUP(B23,[2]MonsterPowerUpConfig!$A:$I,9,FALSE),0),\";\",120*ROUND(VLOOKUP(B23,[2]MonsterPowerUpConfig!$A:$I,9,FALSE),0)))","v":0},{"$f":"[3]主表!J21","v":23.607802639415102},{"$f":"[3]主表!K21","v":1.4168223639558957},{"$f":"[3]主表!L21","v":1.4168223639558957},{"$f":"[3]主表!M21","v":0},{"$f":"[3]主表!$G21","v":301},{"$f":"[3]升级!$H21","v":1000},{"$f":"MAX(1,ROUND(100/(24*3600)*VLOOKUP(B23,[1]ResourceLevelConfig!$A:$E,5,FALSE),2))","v":1},-1,2,1,1,300,null,null,null,1,1,19]
[20,20,1,2,10,"225;236;247","筑基期","中",10,225,236,247,{"$f":"[1]ResourceLevelConfig!$E24*10","v":2900},100004,20,1301,1,"1301;1302","1;1",{"$f":"IF(G24=G25,0,CONCATENATE(80*ROUND(VLOOKUP(B24,[2]MonsterPowerUpConfig!$A:$I,9,FALSE),0),\";\",120*ROUND(VLOOKUP(B24,[2]MonsterPowerUpConfig!$A:$I,9,FALSE),0)))","v":0},{"$f":"[3]主表!J22","v":24.087751215205177},{"$f":"[3]主表!K22","v":1.438074699415234},{"$f":"[3]主表!L22","v":1.438074699415234},{"$f":"[3]主表!M22","v":0},{"$f":"[3]主表!$G22","v":306},{"$f":"[3]升级!$H22","v":1000},{"$f":"MAX(1,ROUND(100/(24*3600)*VLOOKUP(B24,[1]ResourceLevelConfig!$A:$E,5,FALSE),2))","v":1},20,2,1,1,310,null,null,null,1,1,20]
[21,21,1,3,1,"225;237;238","筑基期","后",1,225,237,238,{"$f":"[1]ResourceLevelConfig!$E25*10","v":3000},-1,-1,-1,-1,-1,-1,{"$f":"IF(G25=G26,0,CONCATENATE(80*ROUND(VLOOKUP(B25,[2]MonsterPowerUpConfig!$A:$I,9,FALSE),0),\";\",120*ROUND(VLOOKUP(B25,[2]MonsterPowerUpConfig!$A:$I,9,FALSE),0)))","v":0},{"$f":"[3]主表!J23","v":26.634941026544407},{"$f":"[3]主表!K23","v":1.5818821693567577},{"$f":"[3]主表!L23","v":1.5818821693567577},{"$f":"[3]主表!M23","v":0},{"$f":"[3]主表!$G23","v":355},{"$f":"[3]升级!$H23","v":1000},{"$f":"MAX(1,ROUND(100/(24*3600)*VLOOKUP(B25,[1]ResourceLevelConfig!$A:$E,5,FALSE),2))","v":1},-1,3,1,1,320,null,null,null,1,1,21]
[22,22,1,3,2,"225;237;239","筑基期","后",2,225,237,239,{"$f":"[1]ResourceLevelConfig!$E26*10","v":3100},-1,-1,-1,-1,-1,-1,{"$f":"IF(G26=G27,0,CONCATENATE(80*ROUND(VLOOKUP(B26,[2]MonsterPowerUpConfig!$A:$I,9,FALSE),0),\";\",120*ROUND(VLOOKUP(B26,[2]MonsterPowerUpConfig!$A:$I,9,FALSE),0)))","v":0},{"$f":"[3]主表!J24","v":27.174956052108559},{"$f":"[3]主表!K24","v":1.6056104018971089},{"$f":"[3]主表!L24","v":1.6056104018971089},{"$f":"[3]主表!M24","v":0},{"$f":"[3]主表!$G24","v":361},{"$f":"[3]升级!$H24","v":1000},{"$f":"MAX(1,ROUND(100/(24*3600)*VLOOKUP(B26,[1]ResourceLevelConfig!$A:$E,5,FALSE),2))","v":1},-1,{"$f":"AC25","v":3},{"$f":"AD25","v":1},{"$f":"AE25","v":1},330,null,null,null,1,1,22]
[23,23,1,3,3,"225;237;240","筑基期","后",3,225,237,240,{"$f":"[1]ResourceLevelConfig!$E27*10","v":3200},-1,-1,-1,-1,-1,-1,{"$f":"IF(G27=G28,0,CONCATENATE(80*ROUND(VLOOKUP(B27,[2]MonsterPowerUpConfig!$A:$I,9,FALSE),0),\";\",120*ROUND(VLOOKUP(B27,[2]MonsterPowerUpConfig!$A:$I,9,FALSE),0)))","v":0},{"$f":"[3]主表!J25","v":27.725178666708693},{"$f":"[3]主表!K25","v":1.6296945579255655},{"$f":"[3]主表!L25","v":1.6296945579255655},{"$f":"[3]主表!M25","v":0},{"$f":"[3]主表!$G25","v":367},{"$f":"[3]升级!$H25","v":1000},{"$f":"MAX(1,ROUND(100/(24*3600)*VLOOKUP(B27,[1]ResourceLevelConfig!$A:$E,5,FALSE),2))","v":1},-1,{"$f":"AC26","v":3},1,1,340,null,null,null,1,1,23]
[24,24,1,3,4,"225;237;241","筑基期","后",4,225,237,241,{"$f":"[1]ResourceLevelConfig!$E28*10","v":3300},-1,-1,-1,-1,-1,-1,{"$f":"IF(G28=G29,0,CONCATENATE(80*ROUND(VLOOKUP(B28,[2]MonsterPowerUpConfig!$A:$I,9,FALSE),0),\";\",120*ROUND(VLOOKUP(B28,[2]MonsterPowerUpConfig!$A:$I,9,FALSE),0)))","v":0},{"$f":"[3]主表!J26","v":28.285793594635081},{"$f":"[3]主表!K26","v":1.6541399762944489},{"$f":"[3]主表!L26","v":1.6541399762944489},{"$f":"[3]主表!M26","v":0},{"$f":"[3]主表!$G26","v":372},{"$f":"[3]升级!$H26","v":1000},{"$f":"MAX(1,ROUND(100/(24*3600)*VLOOKUP(B28,[1]ResourceLevelConfig!$A:$E,5,FALSE),2))","v":1},-1,3,1,1,350,null,null,null,1,1,24]
[25,25,1,3,5,"225;237;242","筑基期","后",5,225,237,242,{"$f":"[1]ResourceLevelConfig!$E29*10","v":3400},-1,-1,-1,-1,-1,-1,{"$f":"IF(G29=G30,0,CONCATENATE(80*ROUND(VLOOKUP(B29,[2]MonsterPowerUpConfig!$A:$I,9,FALSE),0),\";\",120*ROUND(VLOOKUP(B29,[2]MonsterPowerUpConfig!$A:$I,9,FALSE),0)))","v":0},{"$f":"[3]主表!J27","v":28.856988805199244},{"$f":"[3]主表!K27","v":1.6789520759388654},{"$f":"[3]主表!L27","v":1.6789520759388654},{"$f":"[3]主表!M27","v":0},{"$f":"[3]主表!$G27","v":379},{"$f":"[3]升级!$H27","v":1000},{"$f":"MAX(1,ROUND(100/(24*3600)*VLOOKUP(B29,[1]ResourceLevelConfig!$A:$E,5,FALSE),2))","v":1},-1,3,1,1,360,null,null,null,1,1,25]
[26,26,1,3,6,"225;237;243","筑基期","后",6,225,237,243,{"$f":"[1]ResourceLevelConfig!$E30*10","v":3500},-1,-1,-1,-1,-1,-1,{"$f":"IF(G30=G31,0,CONCATENATE(80*ROUND(VLOOKUP(B30,[2]MonsterPowerUpConfig!$A:$I,9,FALSE),0),\";\",120*ROUND(VLOOKUP(B30,[2]MonsterPowerUpConfig!$A:$I,9,FALSE),0)))","v":0},{"$f":"[3]主表!J28","v":29.438955568521564},{"$f":"[3]主表!K28","v":1.7041363570779482},{"$f":"[3]主表!L28","v":1.7041363570779482},{"$f":"[3]主表!M28","v":0},{"$f":"[3]主表!$G28","v":385},{"$f":"[3]升级!$H28","v":1000},{"$f":"MAX(1,ROUND(100/(24*3600)*VLOOKUP(B30,[1]ResourceLevelConfig!$A:$E,5,FALSE),2))","v":1},-1,3,1,1,370,null,null,null,1,1,26]
[27,27,1,3,7,"225;237;244","筑基期","后",7,225,237,244,{"$f":"[1]ResourceLevelConfig!$E31*10","v":3600},-1,-1,-1,-1,-1,-1,{"$f":"IF(G31=G32,0,CONCATENATE(80*ROUND(VLOOKUP(B31,[2]MonsterPowerUpConfig!$A:$I,9,FALSE),0),\";\",120*ROUND(VLOOKUP(B31,[2]MonsterPowerUpConfig!$A:$I,9,FALSE),0)))","v":0},{"$f":"[3]主表!J29","v":30.031888512262356},{"$f":"[3]主表!K29","v":1.7296984024341171},{"$f":"[3]主表!L29","v":1.7296984024341171},{"$f":"[3]主表!M29","v":0},{"$f":"[3]主表!$G29","v":391},{"$f":"[3]升级!$H29","v":1000},{"$f":"MAX(1,ROUND(100/(24*3600)*VLOOKUP(B31,[1]ResourceLevelConfig!$A:$E,5,FALSE),2))","v":1},-1,3,1,1,380,null,null,null,1,1,27]
[28,28,1,3,8,"225;237;245","筑基期","后",8,225,237,245,{"$f":"[1]ResourceLevelConfig!$E32*10","v":3700},-1,-1,-1,-1,-1,-1,{"$f":"IF(G32=G33,0,CONCATENATE(80*ROUND(VLOOKUP(B32,[2]MonsterPowerUpConfig!$A:$I,9,FALSE),0),\";\",120*ROUND(VLOOKUP(B32,[2]MonsterPowerUpConfig!$A:$I,9,FALSE),0)))","v":0},{"$f":"[3]主表!J30","v":30.635985679312469},{"$f":"[3]主表!K30","v":1.7556438784706287},{"$f":"[3]主表!L30","v":1.7556438784706287},{"$f":"[3]主表!M30","v":0},{"$f":"[3]主表!$G30","v":398},{"$f":"[3]升级!$H30","v":1000},{"$f":"MAX(1,ROUND(100/(24*3600)*VLOOKUP(B32,[1]ResourceLevelConfig!$A:$E,5,FALSE),2))","v":1},-1,3,1,1,390,null,null,null,1,1,28]
[29,29,1,3,9,"225;237;246","筑基期","后",9,225,237,246,{"$f":"[1]ResourceLevelConfig!$E33*10","v":3800},-1,-1,-1,-1,-1,-1,{"$f":"IF(G33=G34,0,CONCATENATE(80*ROUND(VLOOKUP(B33,[2]MonsterPowerUpConfig!$A:$I,9,FALSE),0),\";\",120*ROUND(VLOOKUP(B33,[2]MonsterPowerUpConfig!$A:$I,9,FALSE),0)))","v":0},{"$f":"[3]主表!J31","v":31.251448586458835},{"$f":"[3]主表!K31","v":1.7819785366476881},{"$f":"[3]主表!L31","v":1.7819785366476881},{"$f":"[3]主表!M31","v":0},{"$f":"[3]主表!$G31","v":404},{"$f":"[3]升级!$H31","v":1000},{"$f":"MAX(1,ROUND(100/(24*3600)*VLOOKUP(B33,[1]ResourceLevelConfig!$A:$E,5,FALSE),2))","v":1},-1,3,1,1,400,null,null,null,1,1,29]
[30,30,1,3,10,"225;237;247","筑基期","后",10,225,237,247,{"$f":"[1]ResourceLevelConfig!$E34*10","v":3900},100004,20,1301,1,"1301;1302;1303","1;1;1",{"$f":"IF(G34=G35,0,CONCATENATE(\"1;1\"))","v":"1;1"},{"$f":"[3]主表!J32","v":31.878482284041731},{"$f":"[3]主表!K32","v":1.8087082146974032},{"$f":"[3]主表!L32","v":1.8087082146974032},{"$f":"[3]主表!M32","v":0},{"$f":"[3]主表!$G32","v":411},{"$f":"[3]升级!$H32","v":1000},{"$f":"MAX(1,ROUND(100/(24*3600)*VLOOKUP(B34,[1]ResourceLevelConfig!$A:$E,5,FALSE),2))","v":1},50,3,1,1,410,null,null,null,1,1,30]
[31,31,2,4,1,"226;235;238","金丹期","前",1,226,235,238,{"$f":"[1]ResourceLevelConfig!$E35*10","v":4000},-1,-1,-1,-1,{"$f":"IF(I35=10,\"1001;1002;1004\",-1)","v":-1},{"$f":"IF(R35=-1,-1,\"100;200;300\")","v":-1},{"$f":"IF(G35=G36,0,CONCATENATE(\"1;1\"))","v":0},{"$f":"[3]主表!J33","v":48.055116379241611},{"$f":"[3]主表!K33","v":2.7130623220461048},{"$f":"[3]主表!L33","v":2.7130623220461048},{"$f":"[3]主表!M33","v":0},{"$f":"[3]主表!$G33","v":626},{"$f":"[3]升级!$H33","v":1100},{"$f":"MAX(1,ROUND(100/(24*3600)*VLOOKUP(B35,[1]ResourceLevelConfig!$A:$E,5,FALSE),2))","v":1},-1,3,2,1,420,null,null,null,1,1,31]
[32,32,2,4,2,"226;235;239","金丹期","前",2,226,235,239,{"$f":"[1]ResourceLevelConfig!$E36*10","v":4100},-1,-1,-1,-1,{"$f":"IF(I36=10,\"1001;1002;1004\",-1)","v":-1},-1,0,{"$f":"[3]主表!J34","v":49.016896972406983},{"$f":"[3]主表!K34","v":2.7537582568767958},{"$f":"[3]主表!L34","v":2.7537582568767958},{"$f":"[3]主表!M34","v":0},{"$f":"[3]主表!$G34","v":637},{"$f":"[3]升级!$H34","v":1100},{"$f":"MAX(1,ROUND(100/(24*3600)*VLOOKUP(B36,[1]ResourceLevelConfig!$A:$E,5,FALSE),2))","v":1},-1,{"$f":"AC35","v":3},{"$f":"AD35","v":2},{"$f":"AE35","v":1},430,null,null,null,1,1,32]
[33,33,2,4,3,"226;235;240","金丹期","前",3,226,235,240,{"$f":"[1]ResourceLevelConfig!$E37*10","v":4200},-1,-1,-1,-1,-1,-1,0,{"$f":"[3]主表!J35","v":49.996718582181927},{"$f":"[3]主表!K35","v":2.7950646307299474},{"$f":"[3]主表!L35","v":2.7950646307299474},{"$f":"[3]主表!M35","v":0},{"$f":"[3]主表!$G35","v":648},{"$f":"[3]升级!$H35","v":1100},{"$f":"MAX(1,ROUND(100/(24*3600)*VLOOKUP(B37,[1]ResourceLevelConfig!$A:$E,5,FALSE),2))","v":1},-1,{"$f":"AC36","v":3},2,1,440,null,null,null,1,1,33]
[34,34,2,4,4,"226;235;241","金丹期","前",4,226,235,241,{"$f":"[1]ResourceLevelConfig!$E38*10","v":4300},-1,-1,-1,-1,-1,-1,0,{"$f":"[3]主表!J36","v":50.994906038431346},{"$f":"[3]主表!K36","v":2.8369906001908962},{"$f":"[3]主表!L36","v":2.8369906001908962},{"$f":"[3]主表!M36","v":0},{"$f":"[3]主表!$G36","v":659},{"$f":"[3]升级!$H36","v":1100},{"$f":"MAX(1,ROUND(100/(24*3600)*VLOOKUP(B38,[1]ResourceLevelConfig!$A:$E,5,FALSE),2))","v":1},-1,3,2,1,450,null,null,null,1,1,34]
[35,35,2,4,5,"226;235;242","金丹期","前",5,226,235,242,{"$f":"[1]ResourceLevelConfig!$E39*10","v":4400},-1,-1,-1,-1,-1,-1,0,{"$f":"[3]主表!J37","v":52.011789856687301},{"$f":"[3]主表!K37","v":2.8795454591937597},{"$f":"[3]主表!L37","v":2.8795454591937597},{"$f":"[3]主表!M37","v":0},{"$f":"[3]主表!$G37","v":670},{"$f":"[3]升级!$H37","v":1100},{"$f":"MAX(1,ROUND(100/(24*3600)*VLOOKUP(B39,[1]ResourceLevelConfig!$A:$E,5,FALSE),2))","v":1},-1,3,2,1,460,null,null,null,1,1,35]
[36,36,2,4,6,"226;235;243","金丹期","前",6,226,235,243,{"$f":"[1]ResourceLevelConfig!$E40*10","v":4500},-1,-1,-1,-1,-1,-1,0,{"$f":"[3]主表!J38","v":53.04770633563222},{"$f":"[3]主表!K38","v":2.9227386410816654},{"$f":"[3]主表!L38","v":2.9227386410816654},{"$f":"[3]主表!M38","v":0},{"$f":"[3]主表!$G38","v":682},{"$f":"[3]升级!$H38","v":1100},{"$f":"MAX(1,ROUND(100/(24*3600)*VLOOKUP(B40,[1]ResourceLevelConfig!$A:$E,5,FALSE),2))","v":1},-1,3,2,1,470,null,null,null,1,1,36]
{"$rows_left_out":265}
{"sheet":"HeroQiangDuAddConfig","index":1,"n_rows":64,"n_cols":2,"rows_kept":64,"cut":false,"hidden":false,"merged":[]}
["ID","qiangDuZhi"]
["int","float"]
[]
["ID","玩家修为境界（等级）"]
[1,1]
[2,1.085]
[3,1.17]
[4,1.2549999999999999]
[5,1.34]
[6,1.425]
[7,1.51]
[8,1.595]
[9,1.68]
[10,1.7649999999999999]
[11,1.85]
[12,1.9350000000000001]
[13,2.02]
[14,2.105]
[15,2.19]
[16,2.2749999999999999]
[17,2.36]
[18,2.4449999999999998]
[19,2.5299999999999998]
[20,2.6150000000000002]
[21,2.7]
[22,2.7850000000000001]
[23,2.87]
[24,2.9550000000000001]
[25,3.04]
[26,3.125]
[27,3.21]
[28,3.2949999999999999]
[29,3.38]
[30,3.4649999999999999]
[31,3.55]
[32,3.6349999999999998]
[33,3.72]
[34,3.8050000000000002]
[35,3.89]
[36,3.9750000000000001]
{"$rows_left_out":24}