{"text_format":"2","workbook":"xlsx","n_sheets":2,"sheets":["TowerConfig","TowerInfoConfig"],"not_rendered":{"charts":0,"images":0,"macros":0,"external_links":2,"defined_names":2,"comments":0,"pivot_tables":0},"unopened":[],"bounds":{"document_bytes":16777216,"sheet_cells":100000,"run_cost":"one","rows_first":2000,"rows_last":500,"rows_between":2000,"halvings":0,"cell_chars":16384,"cell_head_chars":4096},"cells_cut":0,"cells_raw":0,"read":"whole","date_system":"1900"}

{"sheet":"TowerConfig","index":0,"n_rows":5,"n_cols":5,"rows_kept":5,"cut":false,"hidden":false,"merged":[]}
["ID","name",null,"massge","towerinfoIdGroup"]
["int","int",null,"int","int"]
[]
["modelID","塔名称",null,null,"塔的详情效果Id组"]
[1,null,"命运峰",null,1]

{"sheet":"TowerInfoConfig","index":1,"n_rows":104,"n_cols":21,"rows_kept":104,"cut":false,"hidden":false,"merged":[]}
["ID","groupId","level","name",null,"massge","towerType","typeValue","reward","unlockValue"]
["int","int","int","int",null,"int","int","int[]","int[]","int"]
[]
["modelID","id组","层",null,null,null,"1=战斗（levelbattleId）\n2=剧情（剧情事件ID）",null,"奖励","解锁值","道具1","道具2","数量1","数量2","等级",null,"组合1","组合2"]
[1,1,1,null,"第1层",null,1,2001,{"$f":"CONCATENATE(L5,\";\",K5)","v":"1402;1001"},null,1001,1402,{"$f":"ROUND(VLOOKUP(O5,[1]ResourceLevelConfig!$A:$C,3,FALSE)*0.01,0)*300","v":36300},{"$f":"IF(L5>1400,1,VLOOKUP(O5,[1]ResourceLevelConfig!$A:$E,L5-998,FALSE)*2)","v":1},20,null,{"$f":"_xlfn.TEXTJOIN(\";\",1,K5:L5)","v":"1001;1402"},{"$f":"_xlfn.TEXTJOIN(\";\",1,M5:N5)","v":"36300;1"},null,{"$f":"VLOOKUP(K5,[2]ItemConfig!$A:$C,3,FALSE)&\"×\"&M5","v":"灵石×36300"},{"$f":"VLOOKUP(L5,[2]ItemConfig!$A:$C,3,FALSE)&\"×\"&N5","v":"良品增元丹×1"}]
[2,1,2,null,"第2层",null,1,2002,{"$f":"CONCATENATE(L6,\";\",K6)","v":"1702;1001"},null,1001,1702,{"$f":"ROUND(VLOOKUP(O6,[1]ResourceLevelConfig!$A:$C,3,FALSE)*0.01,0)*300","v":37500},{"$f":"IF(L6>1400,1,VLOOKUP(O6,[1]ResourceLevelConfig!$A:$E,L6-998,FALSE)*2)","v":1},23,null,{"$f":"_xlfn.TEXTJOIN(\";\",1,K6:L6)","v":"1001;1702"},{"$f":"_xlfn.TEXTJOIN(\";\",1,M6:N6)","v":"37500;1"},null,{"$f":"VLOOKUP(K6,[2]ItemConfig!$A:$C,3,FALSE)&\"×\"&M6","v":"灵石×37500"},{"$f":"VLOOKUP(L6,[2]ItemConfig!$A:$C,3,FALSE)&\"×\"&N6","v":"归识还元丹×1"}]
[3,1,3,null,"第3层",null,1,2003,"21012;1001",null,1001,21012,{"$f":"ROUND(VLOOKUP(O7,[1]ResourceLevelConfig!$A:$C,3,FALSE)*0.01,0)*300","v":38400},{"$f":"IF(L7>1400,1,VLOOKUP(O7,[1]ResourceLevelConfig!$A:$E,L7-998,FALSE)*2)","v":1},26,null,"1001;21012","38400;1",null,{"$f":"VLOOKUP(K7,[2]ItemConfig!$A:$C,3,FALSE)&\"×\"&M7","v":"灵石×38400"},{"$f":"VLOOKUP(L7,[2]ItemConfig!$A:$C,3,FALSE)&\"×\"&N7","v":"紫色神识符×1"}]
[4,1,4,null,"第4层",null,1,2004,"1402;1001",null,1001,1402,{"$f":"ROUND(VLOOKUP(O8,[1]ResourceLevelConfig!$A:$C,3,FALSE)*0.01,0)*300","v":39600},{"$f":"IF(L8>1400,1,VLOOKUP(O8,[1]ResourceLevelConfig!$A:$E,L8-998,FALSE)*2)","v":1},29,null,"1001;1402","39600;1",null,{"$f":"VLOOKUP(K8,[2]ItemConfig!$A:$C,3,FALSE)&\"×\"&M8","v":"灵石×39600"},{"$f":"VLOOKUP(L8,[2]ItemConfig!$A:$C,3,FALSE)&\"×\"&N8","v":"良品增元丹×1"}]
[5,1,5,null,"第5层",null,1,2005,"1702;1001",null,1001,1702,{"$f":"ROUND(VLOOKUP(O9,[1]ResourceLevelConfig!$A:$C,3,FALSE)*0.01,0)*300","v":40800},{"$f":"IF(L9>1400,1,VLOOKUP(O9,[1]ResourceLevelConfig!$A:$E,L9-998,FALSE)*2)","v":1},32,null,"1001;1702","40800;1",null,{"$f":"VLOOKUP(K9,[2]ItemConfig!$A:$C,3,FALSE)&\"×\"&M9","v":"灵石×40800"},{"$f":"VLOOKUP(L9,[2]ItemConfig!$A:$C,3,FALSE)&\"×\"&N9","v":"归识还元丹×1"}]
[6,1,6,null,"第6层",null,1,2006,"21012;1001",null,1001,21012,{"$f":"ROUND(VLOOKUP(O10,[1]ResourceLevelConfig!$A:$C,3,FALSE)*0.01,0)*300","v":42300},{"$f":"IF(L10>1400,1,VLOOKUP(O10,[1]ResourceLevelConfig!$A:$E,L10-998,FALSE)*2)","v":1},35,null,"1001;21012","42300;1",null,{"$f":"VLOOKUP(K10,[2]ItemConfig!$A:$C,3,FALSE)&\"×\"&M10","v":"灵石×42300"},{"$f":"VLOOKUP(L10,[2]ItemConfig!$A:$C,3,FALSE)&\"×\"&N10","v":"紫色神识符×1"}]
[7,1,7,null,"第7层",null,1,2007,"1402;1001",null,1001,1402,{"$f":"ROUND(VLOOKUP(O11,[1]ResourceLevelConfig!$A:$C,3,FALSE)*0.01,0)*300","v":43500},{"$f":"IF(L11>1400,1,VLOOKUP(O11,[1]ResourceLevelConfig!$A:$E,L11-998,FALSE)*2)","v":1},38,null,"1001;1402","43500;1",null,{"$f":"VLOOKUP(K11,[2]ItemConfig!$A:$C,3,FALSE)&\"×\"&M11","v":"灵石×43500"},{"$f":"VLOOKUP(L11,[2]ItemConfig!$A:$C,3,FALSE)&\"×\"&N11","v":"良品增元丹×1"}]
[8,1,8,null,"第8层",null,1,2008,"1702;1001",null,1001,1702,{"$f":"ROUND(VLOOKUP(O12,[1]ResourceLevelConfig!$A:$C,3,FALSE)*0.01,0)*300","v":44700},{"$f":"IF(L12>1400,1,VLOOKUP(O12,[1]ResourceLevelConfig!$A:$E,L12-998,FALSE)*2)","v":1},41,null,"1001;1702","44700;1",null,{"$f":"VLOOKUP(K12,[2]ItemConfig!$A:$C,3,FALSE)&\"×\"&M12","v":"灵石×44700"},{"$f":"VLOOKUP(L12,[2]ItemConfig!$A:$C,3,FALSE)&\"×\"&N12","v":"归识还元丹×1"}]
[9,1,9,null,"第9层",null,1,2009,"21012;1001",null,1001,21012,{"$f":"ROUND(VLOOKUP(O13,[1]ResourceLevelConfig!$A:$C,3,FALSE)*0.01,0)*300","v":46200},{"$f":"IF(L13>1400,1,VLOOKUP(O13,[1]ResourceLevelConfig!$A:$E,L13-998,FALSE)*2)","v":1},44,null,"1001;21012","46200;1",null,{"$f":"VLOOKUP(K13,[2]ItemConfig!$A:$C,3,FALSE)&\"×\"&M13","v":"灵石×46200"},{"$f":"VLOOKUP(L13,[2]ItemConfig!$A:$C,3,FALSE)&\"×\"&N13","v":"紫色神识符×1"}]
[10,1,10,null,"第10层",null,1,2010,"1402;1001",null,1001,1402,{"$f":"ROUND(VLOOKUP(O14,[1]ResourceLevelConfig!$A:$C,3,FALSE)*0.01,0)*300","v":47700},{"$f":"IF(L14>1400,1,VLOOKUP(O14,[1]ResourceLevelConfig!$A:$E,L14-998,FALSE)*2)","v":1},47,null,"1001;1402","47700;1",null,{"$f":"VLOOKUP(K14,[2]ItemConfig!$A:$C,3,FALSE)&\"×\"&M14","v":"灵石×47700"},{"$f":"VLOOKUP(L14,[2]ItemConfig!$A:$C,3,FALSE)&\"×\"&N14","v":"良品增元丹×1"}]
[11,1,11,null,"第11层",null,1,2011,"1702;1001",null,1001,1702,{"$f":"ROUND(VLOOKUP(O15,[1]ResourceLevelConfig!$A:$C,3,FALSE)*0.01,0)*300","v":48900},{"$f":"IF(L15>1400,1,VLOOKUP(O15,[1]ResourceLevelConfig!$A:$E,L15-998,FALSE)*2)","v":1},50,null,"1001;1702","48900;1",null,{"$f":"VLOOKUP(K15,[2]ItemConfig!$A:$C,3,FALSE)&\"×\"&M15","v":"灵石×48900"},{"$f":"VLOOKUP(L15,[2]ItemConfig!$A:$C,3,FALSE)&\"×\"&N15","v":"归识还元丹×1"}]
[12,1,12,null,"第12层",null,1,2012,"21012;1001",null,1001,21012,{"$f":"ROUND(VLOOKUP(O16,[1]ResourceLevelConfig!$A:$C,3,FALSE)*0.01,0)*300","v":50400},{"$f":"IF(L16>1400,1,VLOOKUP(O16,[1]ResourceLevelConfig!$A:$E,L16-998,FALSE)*2)","v":1},53,null,"1001;21012","50400;1",null,{"$f":"VLOOKUP(K16,[2]ItemConfig!$A:$C,3,FALSE)&\"×\"&M16","v":"灵石×50400"},{"$f":"VLOOKUP(L16,[2]ItemConfig!$A:$C,3,FALSE)&\"×\"&N16","v":"紫色神识符×1"}]
[13,1,13,null,"第13层",null,1,2013,"1402;1001",null,1001,1402,{"$f":"ROUND(VLOOKUP(O17,[1]ResourceLevelConfig!$A:$C,3,FALSE)*0.01,0)*300","v":52200},{"$f":"IF(L17>1400,1,VLOOKUP(O17,[1]ResourceLevelConfig!$A:$E,L17-998,FALSE)*2)","v":1},56,null,"1001;1402","52200;1",null,{"$f":"VLOOKUP(K17,[2]ItemConfig!$A:$C,3,FALSE)&\"×\"&M17","v":"灵石×52200"},{"$f":"VLOOKUP(L17,[2]ItemConfig!$A:$C,3,FALSE)&\"×\"&N17","v":"良品增元丹×1"}]
[14,1,14,null,"第14层",null,1,2014,"1702;1001",null,1001,1702,{"$f":"ROUND(VLOOKUP(O18,[1]ResourceLevelConfig!$A:$C,3,FALSE)*0.01,0)*300","v":53700},{"$f":"IF(L18>1400,1,VLOOKUP(O18,[1]ResourceLevelConfig!$A:$E,L18-998,FALSE)*2)","v":1},59,null,"1001;1702","53700;1",null,{"$f":"VLOOKUP(K18,[2]ItemConfig!$A:$C,3,FALSE)&\"×\"&M18","v":"灵石×53700"},{"$f":"VLOOKUP(L18,[2]ItemConfig!$A:$C,3,FALSE)&\"×\"&N18","v":"归识还元丹×1"}]
[15,1,15,null,"第15层",null,1,2015,"21012;1001",null,1001,21012,{"$f":"ROUND(VLOOKUP(O19,[1]ResourceLevelConfig!$A:$C,3,FALSE)*0.01,0)*300","v":55200},{"$f":"IF(L19>1400,1,VLOOKUP(O19,[1]ResourceLevelConfig!$A:$E,L19-998,FALSE)*2)","v":1},62,null,"1001;21012","55200;1",null,{"$f":"VLOOKUP(K19,[2]ItemConfig!$A:$C,3,FALSE)&\"×\"&M19","v":"灵石×55200"},{"$f":"VLOOKUP(L19,[2]ItemConfig!$A:$C,3,FALSE)&\"×\"&N19","v":"紫色神识符×1"}]
[16,1,16,null,"第16层",null,1,2016,"1402;1001",null,1001,1402,{"$f":"ROUND(VLOOKUP(O20,[1]ResourceLevelConfig!$A:$C,3,FALSE)*0.01,0)*300","v":57000},{"$f":"IF(L20>1400,1,VLOOKUP(O20,[1]ResourceLevelConfig!$A:$E,L20-998,FALSE)*2)","v":1},65,null,"1001;1402","57000;1",null,{"$f":"VLOOKUP(K20,[2]ItemConfig!$A:$C,3,FALSE)&\"×\"&M20","v":"灵石×57000"},{"$f":"VLOOKUP(L20,[2]ItemConfig!$A:$C,3,FALSE)&\"×\"&N20","v":"良品增元丹×1"}]
[17,1,17,null,"第17层",null,1,2017,"1702;1001",null,1001,1702,{"$f":"ROUND(VLOOKUP(O21,[1]ResourceLevelConfig!$A:$C,3,FALSE)*0.01,0)*300","v":58800},{"$f":"IF(L21>1400,1,VLOOKUP(O21,[1]ResourceLevelConfig!$A:$E,L21-998,FALSE)*2)","v":1},68,null,"1001;1702","58800;1",null,{"$f":"VLOOKUP(K21,[2]ItemConfig!$A:$C,3,FALSE)&\"×\"&M21","v":"灵石×58800"},{"$f":"VLOOKUP(L21,[2]ItemConfig!$A:$C,3,FALSE)&\"×\"&N21","v":"归识还元丹×1"}]
[18,1,18,null,"第18层",null,1,2018,"21012;1001",null,1001,21012,{"$f":"ROUND(VLOOKUP(O22,[1]ResourceLevelConfig!$A:$C,3,FALSE)*0.01,0)*300","v":60600},{"$f":"IF(L22>1400,1,VLOOKUP(O22,[1]ResourceLevelConfig!$A:$E,L22-998,FALSE)*2)","v":1},71,null,"1001;21012","60600;1",null,{"$f":"VLOOKUP(K22,[2]ItemConfig!$A:$C,3,FALSE)&\"×\"&M22","v":"灵石×60600"},{"$f":"VLOOKUP(L22,[2]ItemConfig!$A:$C,3,FALSE)&\"×\"&N22","v":"紫色神识符×1"}]
[19,1,19,null,"第19层",null,1,2019,"1402;1001",null,1001,1402,{"$f":"ROUND(VLOOKUP(O23,[1]ResourceLevelConfig!$A:$C,3,FALSE)*0.01,0)*300","v":62400},{"$f":"IF(L23>1400,1,VLOOKUP(O23,[1]ResourceLevelConfig!$A:$E,L23-998,FALSE)*2)","v":1},74,null,"1001;1402","62400;1",null,{"$f":"VLOOKUP(K23,[2]ItemConfig!$A:$C,3,FALSE)&\"×\"&M23","v":"灵石×62400"},{"$f":"VLOOKUP(L23,[2]ItemConfig!$A:$C,3,FALSE)&\"×\"&N23","v":"良品增元丹×1"}]
[20,1,20,null,"第20层",null,1,2020,"1702;1001",null,1001,1702,{"$f":"ROUND(VLOOKUP(O24,[1]ResourceLevelConfig!$A:$C,3,FALSE)*0.01,0)*300","v":64200},{"$f":"IF(L24>1400,1,VLOOKUP(O24,[1]ResourceLevelConfig!$A:$E,L24-998,FALSE)*2)","v":1},77,null,"1001;1702","64200;1",null,{"$f":"VLOOKUP(K24,[2]ItemConfig!$A:$C,3,FALSE)&\"×\"&M24","v":"灵石×64200"},{"$f":"VLOOKUP(L24,[2]ItemConfig!$A:$C,3,FALSE)&\"×\"&N24","v":"归识还元丹×1"}]
[21,1,21,null,"第21层",null,1,2021,"21012;1001",null,1001,21012,{"$f":"ROUND(VLOOKUP(O25,[1]ResourceLevelConfig!$A:$C,3,FALSE)*0.01,0)*300","v":66300},{"$f":"IF(L25>1400,1,VLOOKUP(O25,[1]ResourceLevelConfig!$A:$E,L25-998,FALSE)*2)","v":1},80,null,"1001;21012","66300;1",null,{"$f":"VLOOKUP(K25,[2]ItemConfig!$A:$C,3,FALSE)&\"×\"&M25","v":"灵石×66300"},{"$f":"VLOOKUP(L25,[2]ItemConfig!$A:$C,3,FALSE)&\"×\"&N25","v":"紫色神识符×1"}]
[22,1,22,null,"第22层",null,1,2022,"1402;1001",null,1001,1402,{"$f":"ROUND(VLOOKUP(O26,[1]ResourceLevelConfig!$A:$C,3,FALSE)*0.01,0)*300","v":68100},{"$f":"IF(L26>1400,1,VLOOKUP(O26,[1]ResourceLevelConfig!$A:$E,L26-998,FALSE)*2)","v":1},83,null,"1001;1402","68100;1",null,{"$f":"VLOOKUP(K26,[2]ItemConfig!$A:$C,3,FALSE)&\"×\"&M26","v":"灵石×68100"},{"$f":"VLOOKUP(L26,[2]ItemConfig!$A:$C,3,FALSE)&\"×\"&N26","v":"良品增元丹×1"}]
[23,1,23,null,"第23层",null,1,2023,"1702;1001",null,1001,1702,{"$f":"ROUND(VLOOKUP(O27,[1]ResourceLevelConfig!$A:$C,3,FALSE)*0.01,0)*300","v":70200},{"$f":"IF(L27>1400,1,VLOOKUP(O27,[1]ResourceLevelConfig!$A:$E,L27-998,FALSE)*2)","v":1},86,null,"1001;1702","70200;1",null,{"$f":"VLOOKUP(K27,[2]ItemConfig!$A:$C,3,FALSE)&\"×\"&M27","v":"灵石×70200"},{"$f":"VLOOKUP(L27,[2]ItemConfig!$A:$C,3,FALSE)&\"×\"&N27","v":"归识还元丹×1"}]
[24,1,24,null,"第24层",null,1,2024,"21012;1001",null,1001,21012,{"$f":"ROUND(VLOOKUP(O28,[1]ResourceLevelConfig!$A:$C,3,FALSE)*0.01,0)*300","v":72600},{"$f":"IF(L28>1400,1,VLOOKUP(O28,[1]ResourceLevelConfig!$A:$E,L28-998,FALSE)*2)","v":1},89,null,"1001;21012","72600;1",null,{"$f":"VLOOKUP(K28,[2]ItemConfig!$A:$C,3,FALSE)&\"×\"&M28","v":"灵石×72600"},{"$f":"VLOOKUP(L28,[2]ItemConfig!$A:$C,3,FALSE)&\"×\"&N28","v":"紫色神识符×1"}]
[25,1,25,null,"第25层",null,1,2025,"1402;1001",null,1001,1402,{"$f":"ROUND(VLOOKUP(O29,[1]ResourceLevelConfig!$A:$C,3,FALSE)*0.01,0)*300","v":74700},{"$f":"IF(L29>1400,1,VLOOKUP(O29,[1]ResourceLevelConfig!$A:$E,L29-998,FALSE)*2)","v":1},92,null,"1001;1402","74700;1",null,{"$f":"VLOOKUP(K29,[2]ItemConfig!$A:$C,3,FALSE)&\"×\"&M29","v":"灵石×74700"},{"$f":"VLOOKUP(L29,[2]ItemConfig!$A:$C,3,FALSE)&\"×\"&N29","v":"良品增元丹×1"}]
[26,1,26,null,"第26层",null,1,2026,"1702;1001",null,1001,1702,{"$f":"ROUND(VLOOKUP(O30,[1]ResourceLevelConfig!$A:$C,3,FALSE)*0.01,0)*300","v":76800},{"$f":"IF(L30>1400,1,VLOOKUP(O30,[1]ResourceLevelConfig!$A:$E,L30-998,FALSE)*2)","v":1},95,null,"1001;1702","76800;1",null,{"$f":"VLOOKUP(K30,[2]ItemConfig!$A:$C,3,FALSE)&\"×\"&M30","v":"灵石×76800"},{"$f":"VLOOKUP(L30,[2]ItemConfig!$A:$C,3,FALSE)&\"×\"&N30","v":"归识还元丹×1"}]
[27,1,27,null,"第27层",null,1,2027,"21012;1001",null,1001,21012,{"$f":"ROUND(VLOOKUP(O31,[1]ResourceLevelConfig!$A:$C,3,FALSE)*0.01,0)*300","v":79200},{"$f":"IF(L31>1400,1,VLOOKUP(O31,[1]ResourceLevelConfig!$A:$E,L31-998,FALSE)*2)","v":1},98,null,"1001;21012","79200;1",null,{"$f":"VLOOKUP(K31,[2]ItemConfig!$A:$C,3,FALSE)&\"×\"&M31","v":"灵石×79200"},{"$f":"VLOOKUP(L31,[2]ItemConfig!$A:$C,3,FALSE)&\"×\"&N31","v":"紫色神识符×1"}]
[28,1,28,null,"第28层",null,1,2028,"1402;1001",null,1001,1402,{"$f":"ROUND(VLOOKUP(O32,[1]ResourceLevelConfig!$A:$C,3,FALSE)*0.01,0)*300","v":81600},{"$f":"IF(L32>1400,1,VLOOKUP(O32,[1]ResourceLevelConfig!$A:$E,L32-998,FALSE)*2)","v":1},101,null,"1001;1402","81600;1",null,{"$f":"VLOOKUP(K32,[2]ItemConfig!$A:$C,3,FALSE)&\"×\"&M32","v":"灵石×81600"},{"$f":"VLOOKUP(L32,[2]ItemConfig!$A:$C,3,FALSE)&\"×\"&N32","v":"良品增元丹×1"}]
[29,1,29,null,"第29层",null,1,2029,"1702;1001",null,1001,1702,{"$f":"ROUND(VLOOKUP(O33,[1]ResourceLevelConfig!$A:$C,3,FALSE)*0.01,0)*300","v":84300},{"$f":"IF(L33>1400,1,VLOOKUP(O33,[1]ResourceLevelConfig!$A:$E,L33-998,FALSE)*2)","v":1},104,null,"1001;1702","84300;1",null,{"$f":"VLOOKUP(K33,[2]ItemConfig!$A:$C,3,FALSE)&\"×\"&M33","v":"灵石×84300"},{"$f":"VLOOKUP(L33,[2]ItemConfig!$A:$C,3,FALSE)&\"×\"&N33","v":"归识还元丹×1"}]
[30,1,30,null,"第30层",null,1,2030,"21012;1001",null,1001,21012,{"$f":"ROUND(VLOOKUP(O34,[1]ResourceLevelConfig!$A:$C,3,FALSE)*0.01,0)*300","v":86700},{"$f":"IF(L34>1400,1,VLOOKUP(O34,[1]ResourceLevelConfig!$A:$E,L34-998,FALSE)*2)","v":1},107,null,"1001;21012","86700;1",null,{"$f":"VLOOKUP(K34,[2]ItemConfig!$A:$C,3,FALSE)&\"×\"&M34","v":"灵石×86700"},{"$f":"VLOOKUP(L34,[2]ItemConfig!$A:$C,3,FALSE)&\"×\"&N34","v":"紫色神识符×1"}]
[31,1,31,null,"第31层",null,1,2031,"1403;1001",null,1001,1403,{"$f":"ROUND(VLOOKUP(O35,[1]ResourceLevelConfig!$A:$C,3,FALSE)*0.01,0)*300","v":89400},{"$f":"IF(L35>1400,1,VLOOKUP(O35,[1]ResourceLevelConfig!$A:$E,L35-998,FALSE)*2)","v":1},110,null,"1001;1403","89400;1",null,{"$f":"VLOOKUP(K35,[2]ItemConfig!$A:$C,3,FALSE)&\"×\"&M35","v":"灵石×89400"},{"$f":"VLOOKUP(L35,[2]ItemConfig!$A:$C,3,FALSE)&\"×\"&N35","v":"上品增元丹×1"}]
[32,1,32,null,"第32层",null,1,2032,"1702;1001",null,1001,1702,{"$f":"ROUND(VLOOKUP(O36,[1]ResourceLevelConfig!$A:$C,3,FALSE)*0.01,0)*300","v":92100},{"$f":"IF(L36>1400,1,VLOOKUP(O36,[1]ResourceLevelConfig!$A:$E,L36-998,FALSE)*2)","v":1},113,null,"1001;1702","92100;1",null,{"$f":"VLOOKUP(K36,[2]ItemConfig!$A:$C,3,FALSE)&\"×\"&M36","v":"灵石×92100"},{"$f":"VLOOKUP(L36,[2]ItemConfig!$A:$C,3,FALSE)&\"×\"&N36","v":"归识还元丹×1"}]
[33,1,33,null,"第33层",null,1,2033,"21012;1001",null,1001,21012,{"$f":"ROUND(VLOOKUP(O37,[1]ResourceLevelConfig!$A:$C,3,FALSE)*0.01,0)*300","v":95100},{"$f":"IF(L37>1400,1,VLOOKUP(O37,[1]ResourceLevelConfig!$A:$E,L37-998,FALSE)*2)","v":1},116,null,"1001;21012","95100;1",null,{"$f":"VLOOKUP(K37,[2]ItemConfig!$A:$C,3,FALSE)&\"×\"&M37","v":"灵石×95100"},{"$f":"VLOOKUP(L37,[2]ItemConfig!$A:$C,3,FALSE)&\"×\"&N37","v":"紫色神识符×1"}]
[34,1,34,null,"第34层",null,1,2034,"1403;1001",null,1001,1403,{"$f":"ROUND(VLOOKUP(O38,[1]ResourceLevelConfig!$A:$C,3,FALSE)*0.01,0)*300","v":97800},{"$f":"IF(L38>1400,1,VLOOKUP(O38,[1]ResourceLevelConfig!$A:$E,L38-998,FALSE)*2)","v":1},119,null,"1001;1403","97800;1",null,{"$f":"VLOOKUP(K38,[2]ItemConfig!$A:$C,3,FALSE)&\"×\"&M38","v":"灵石×97800"},{"$f":"VLOOKUP(L38,[2]ItemConfig!$A:$C,3,FALSE)&\"×\"&N38","v":"上品增元丹×1"}]
[35,1,35,null,"第35层",null,1,2035,"1702;1001",null,1001,1702,{"$f":"ROUND(VLOOKUP(O39,[1]ResourceLevelConfig!$A:$C,3,FALSE)*0.01,0)*300","v":100800},{"$f":"IF(L39>1400,1,VLOOKUP(O39,[1]ResourceLevelConfig!$A:$E,L39-998,FALSE)*2)","v":1},122,null,"1001;1702","100800;1",null,{"$f":"VLOOKUP(K39,[2]ItemConfig!$A:$C,3,FALSE)&\"×\"&M39","v":"灵石×100800"},{"$f":"VLOOKUP(L39,[2]ItemConfig!$A:$C,3,FALSE)&\"×\"&N39","v":"归识还元丹×1"}]
[36,1,36,null,"第36层",null,1,2036,"21012;1001",null,1001,21012,{"$f":"ROUND(VLOOKUP(O40,[1]ResourceLevelConfig!$A:$C,3,FALSE)*0.01,0)*300","v":103800},{"$f":"IF(L40>1400,1,VLOOKUP(O40,[1]ResourceLevelConfig!$A:$E,L40-998,FALSE)*2)","v":1},125,null,"1001;21012","103800;1",null,{"$f":"VLOOKUP(K40,[2]ItemConfig!$A:$C,3,FALSE)&\"×\"&M40","v":"灵石×103800"},{"$f":"VLOOKUP(L40,[2]ItemConfig!$A:$C,3,FALSE)&\"×\"&N40","v":"紫色神识符×1"}]
[37,1,37,null,"第37层",null,1,2037,"1403;1001",null,1001,1403,{"$f":"ROUND(VLOOKUP(O41,[1]ResourceLevelConfig!$A:$C,3,FALSE)*0.01,0)*300","v":107100},{"$f":"IF(L41>1400,1,VLOOKUP(O41,[1]ResourceLevelConfig!$A:$E,L41-998,FALSE)*2)","v":1},128,null,"1001;1403","107100;1",null,{"$f":"VLOOKUP(K41,[2]ItemConfig!$A:$C,3,FALSE)&\"×\"&M41","v":"灵石×107100"},{"$f":"VLOOKUP(L41,[2]ItemConfig!$A:$C,3,FALSE)&\"×\"&N41","v":"上品增元丹×1"}]
[38,1,38,null,"第38层",null,1,2038,"1702;1001",null,1001,1702,{"$f":"ROUND(VLOOKUP(O42,[1]ResourceLevelConfig!$A:$C,3,FALSE)*0.01,0)*300","v":110400},{"$f":"IF(L42>1400,1,VLOOKUP(O42,[1]ResourceLevelConfig!$A:$E,L42-998,FALSE)*2)","v":1},131,null,"1001;1702","110400;1",null,{"$f":"VLOOKUP(K42,[2]ItemConfig!$A:$C,3,FALSE)&\"×\"&M42","v":"灵石×110400"},{"$f":"VLOOKUP(L42,[2]ItemConfig!$A:$C,3,FALSE)&\"×\"&N42","v":"归识还元丹×1"}]
[39,1,39,null,"第39层",null,1,2039,"21012;1001",null,1001,21012,{"$f":"ROUND(VLOOKUP(O43,[1]ResourceLevelConfig!$A:$C,3,FALSE)*0.01,0)*300","v":113700},{"$f":"IF(L43>1400,1,VLOOKUP(O43,[1]ResourceLevelConfig!$A:$E,L43-998,FALSE)*2)","v":1},134,null,"1001;21012","113700;1",null,{"$f":"VLOOKUP(K43,[2]ItemConfig!$A:$C,3,FALSE)&\"×\"&M43","v":"灵石×113700"},{"$f":"VLOOKUP(L43,[2]ItemConfig!$A:$C,3,FALSE)&\"×\"&N43","v":"紫色神识符×1"}]
[40,1,40,null,"第40层",null,1,2040,"1403;1001",null,1001,1403,{"$f":"ROUND(VLOOKUP(O44,[1]ResourceLevelConfig!$A:$C,3,FALSE)*0.01,0)*300","v":117300},{"$f":"IF(L44>1400,1,VLOOKUP(O44,[1]ResourceLevelConfig!$A:$E,L44-998,FALSE)*2)","v":1},137,null,"1001;1403","117300;1",null,{"$f":"VLOOKUP(K44,[2]ItemConfig!$A:$C,3,FALSE)&\"×\"&M44","v":"灵石×117300"},{"$f":"VLOOKUP(L44,[2]ItemConfig!$A:$C,3,FALSE)&\"×\"&N44","v":"上品增元丹×1"}]
[41,1,41,null,"第41层",null,1,2041,"1702;1001",null,1001,1702,{"$f":"ROUND(VLOOKUP(O45,[1]ResourceLevelConfig!$A:$C,3,FALSE)*0.01,0)*300","v":120900},{"$f":"IF(L45>1400,1,VLOOKUP(O45,[1]ResourceLevelConfig!$A:$E,L45-998,FALSE)*2)","v":1},140,null,"1001;1702","120900;1",null,{"$f":"VLOOKUP(K45,[2]ItemConfig!$A:$C,3,FALSE)&\"×\"&M45","v":"灵石×120900"},{"$f":"VLOOKUP(L45,[2]ItemConfig!$A:$C,3,FALSE)&\"×\"&N45","v":"归识还元丹×1"}]
[42,1,42,null,"第42层",null,1,2042,"21012;1001",null,1001,21012,{"$f":"ROUND(VLOOKUP(O46,[1]ResourceLevelConfig!$A:$C,3,FALSE)*0.01,0)*300","v":124500},{"$f":"IF(L46>1400,1,VLOOKUP(O46,[1]ResourceLevelConfig!$A:$E,L46-998,FALSE)*2)","v":1},143,null,"1001;21012","124500;1",null,{"$f":"VLOOKUP(K46,[2]ItemConfig!$A:$C,3,FALSE)&\"×\"&M46","v":"灵石×124500"},{"$f":"VLOOKUP(L46,[2]ItemConfig!$A:$C,3,FALSE)&\"×\"&N46","v":"紫色神识符×1"}]
[43,1,43,null,"第43层",null,1,2043,"1403;1001",null,1001,1403,{"$f":"ROUND(VLOOKUP(O47,[1]ResourceLevelConfig!$A:$C,3,FALSE)*0.01,0)*300","v":128400},{"$f":"IF(L47>1400,1,VLOOKUP(O47,[1]ResourceLevelConfig!$A:$E,L47-998,FALSE)*2)","v":1},146,null,"1001;1403","128400;1",null,{"$f":"VLOOKUP(K47,[2]ItemConfig!$A:$C,3,FALSE)&\"×\"&M47","v":"灵石×128400"},{"$f":"VLOOKUP(L47,[2]ItemConfig!$A:$C,3,FALSE)&\"×\"&N47","v":"上品增元丹×1"}]
[44,1,44,null,"第44层",null,1,2044,"1702;1001",null,1001,1702,{"$f":"ROUND(VLOOKUP(O48,[1]ResourceLevelConfig!$A:$C,3,FALSE)*0.01,0)*300","v":132300},{"$f":"IF(L48>1400,1,VLOOKUP(O48,[1]ResourceLevelConfig!$A:$E,L48-998,FALSE)*2)","v":1},149,null,"1001;1702","132300;1",null,{"$f":"VLOOKUP(K48,[2]ItemConfig!$A:$C,3,FALSE)&\"×\"&M48","v":"灵石×132300"},{"$f":"VLOOKUP(L48,[2]ItemConfig!$A:$C,3,FALSE)&\"×\"&N48","v":"归识还元丹×1"}]
[45,1,45,null,"第45层",null,1,2045,"21012;1001",null,1001,21012,{"$f":"ROUND(VLOOKUP(O49,[1]ResourceLevelConfig!$A:$C,3,FALSE)*0.01,0)*300","v":136200},{"$f":"IF(L49>1400,1,VLOOKUP(O49,[1]ResourceLevelConfig!$A:$E,L49-998,FALSE)*2)","v":1},152,null,"1001;21012","136200;1",null,{"$f":"VLOOKUP(K49,[2]ItemConfig!$A:$C,3,FALSE)&\"×\"&M49","v":"灵石×136200"},{"$f":"VLOOKUP(L49,[2]ItemConfig!$A:$C,3,FALSE)&\"×\"&N49","v":"紫色神识符×1"}]
[46,1,46,null,"第46层",null,1,2046,"1403;1001",null,1001,1403,{"$f":"ROUND(VLOOKUP(O50,[1]ResourceLevelConfig!$A:$C,3,FALSE)*0.01,0)*300","v":140400},{"$f":"IF(L50>1400,1,VLOOKUP(O50,[1]ResourceLevelConfig!$A:$E,L50-998,FALSE)*2)","v":1},155,null,"1001;1403","140400;1",null,{"$f":"VLOOKUP(K50,[2]ItemConfig!$A:$C,3,FALSE)&\"×\"&M50","v":"灵石×140400"},{"$f":"VLOOKUP(L50,[2]ItemConfig!$A:$C,3,FALSE)&\"×\"&N50","v":"上品增元丹×1"}]
[47,1,47,null,"第47层",null,1,2047,"1702;1001",null,1001,1702,{"$f":"ROUND(VLOOKUP(O51,[1]ResourceLevelConfig!$A:$C,3,FALSE)*0.01,0)*300","v":144600},{"$f":"IF(L51>1400,1,VLOOKUP(O51,[1]ResourceLevelConfig!$A:$E,L51-998,FALSE)*2)","v":1},158,null,"1001;1702","144600;1",null,{"$f":"VLOOKUP(K51,[2]ItemConfig!$A:$C,3,FALSE)&\"×\"&M51","v":"灵石×144600"},{"$f":"VLOOKUP(L51,[2]ItemConfig!$A:$C,3,FALSE)&\"×\"&N51","v":"归识还元丹×1"}]
[48,1,48,null,"第48层",null,1,2048,"21012;1001",null,1001,21012,{"$f":"ROUND(VLOOKUP(O52,[1]ResourceLevelConfig!$A:$C,3,FALSE)*0.01,0)*300","v":149100},{"$f":"IF(L52>1400,1,VLOOKUP(O52,[1]ResourceLevelConfig!$A:$E,L52-998,FALSE)*2)","v":1},161,null,"1001;21012","149100;1",null,{"$f":"VLOOKUP(K52,[2]ItemConfig!$A:$C,3,FALSE)&\"×\"&M52","v":"灵石×149100"},{"$f":"VLOOKUP(L52,[2]ItemConfig!$A:$C,3,FALSE)&\"×\"&N52","v":"紫色神识符×1"}]
[49,1,49,null,"第49层",null,1,2049,"1403;1001",null,1001,1403,{"$f":"ROUND(VLOOKUP(O53,[1]ResourceLevelConfig!$A:$C,3,FALSE)*0.01,0)*300","v":153600},{"$f":"IF(L53>1400,1,VLOOKUP(O53,[1]ResourceLevelConfig!$A:$E,L53-998,FALSE)*2)","v":1},164,null,"1001;1403","153600;1",null,{"$f":"VLOOKUP(K53,[2]ItemConfig!$A:$C,3,FALSE)&\"×\"&M53","v":"灵石×153600"},{"$f":"VLOOKUP(L53,[2]ItemConfig!$A:$C,3,FALSE)&\"×\"&N53","v":"上品增元丹×1"}]
[50,1,50,null,"第50层",null,1,2050,"1702;1001",null,1001,1702,{"$f":"ROUND(VLOOKUP(O54,[1]ResourceLevelConfig!$A:$C,3,FALSE)*0.01,0)*300","v":158400},{"$f":"IF(L54>1400,1,VLOOKUP(O54,[1]ResourceLevelConfig!$A:$E,L54-998,FALSE)*2)","v":1},167,null,"1001;1702","158400;1",null,{"$f":"VLOOKUP(K54,[2]ItemConfig!$A:$C,3,FALSE)&\"×\"&M54","v":"灵石×158400"},{"$f":"VLOOKUP(L54,[2]ItemConfig!$A:$C,3,FALSE)&\"×\"&N54","v":"归识还元丹×1"}]
[51,1,51,null,"第51层",null,1,2051,"21012;1001",null,1001,21012,{"$f":"ROUND(VLOOKUP(O55,[1]ResourceLevelConfig!$A:$C,3,FALSE)*0.01,0)*300","v":163200},{"$f":"IF(L55>1400,1,VLOOKUP(O55,[1]ResourceLevelConfig!$A:$E,L55-998,FALSE)*2)","v":1},170,null,"1001;21012","163200;1",null,{"$f":"VLOOKUP(K55,[2]ItemConfig!$A:$C,3,FALSE)&\"×\"&M55","v":"灵石×163200"},{"$f":"VLOOKUP(L55,[2]ItemConfig!$A:$C,3,FALSE)&\"×\"&N55","v":"紫色神识符×1"}]
[52,1,52,null,"第52层",null,1,2052,"1403;1001",null,1001,1403,{"$f":"ROUND(VLOOKUP(O56,[1]ResourceLevelConfig!$A:$C,3,FALSE)*0.01,0)*300","v":168000},{"$f":"IF(L56>1400,1,VLOOKUP(O56,[1]ResourceLevelConfig!$A:$E,L56-998,FALSE)*2)","v":1},173,null,"1001;1403","168000;1",null,{"$f":"VLOOKUP(K56,[2]ItemConfig!$A:$C,3,FALSE)&\"×\"&M56","v":"灵石×168000"},{"$f":"VLOOKUP(L56,[2]ItemConfig!$A:$C,3,FALSE)&\"×\"&N56","v":"上品增元丹×1"}]
[53,1,53,null,"第53层",null,1,2053,"1702;1001",null,1001,1702,{"$f":"ROUND(VLOOKUP(O57,[1]ResourceLevelConfig!$A:$C,3,FALSE)*0.01,0)*300","v":173100},{"$f":"IF(L57>1400,1,VLOOKUP(O57,[1]ResourceLevelConfig!$A:$E,L57-998,FALSE)*2)","v":1},176,null,"1001;1702","173100;1",null,{"$f":"VLOOKUP(K57,[2]ItemConfig!$A:$C,3,FALSE)&\"×\"&M57","v":"灵石×173100"},{"$f":"VLOOKUP(L57,[2]ItemConfig!$A:$C,3,FALSE)&\"×\"&N57","v":"归识还元丹×1"}]
[54,1,54,null,"第54层",null,1,2054,"21012;1001",null,1001,21012,{"$f":"ROUND(VLOOKUP(O58,[1]ResourceLevelConfig!$A:$C,3,FALSE)*0.01,0)*300","v":178500},{"$f":"IF(L58>1400,1,VLOOKUP(O58,[1]ResourceLevelConfig!$A:$E,L58-998,FALSE)*2)","v":1},179,null,"1001;21012","178500;1",null,{"$f":"VLOOKUP(K58,[2]ItemConfig!$A:$C,3,FALSE)&\"×\"&M58","v":"灵石×178500"},{"$f":"VLOOKUP(L58,[2]ItemConfig!$A:$C,3,FALSE)&\"×\"&N58","v":"紫色神识符×1"}]
[55,1,55,null,"第55层",null,1,2055,"1403;1001",null,1001,1403,{"$f":"ROUND(VLOOKUP(O59,[1]ResourceLevelConfig!$A:$C,3,FALSE)*0.01,0)*300","v":183900},{"$f":"IF(L59>1400,1,VLOOKUP(O59,[1]ResourceLevelConfig!$A:$E,L59-998,FALSE)*2)","v":1},182,null,"1001;1403","183900;1",null,{"$f":"VLOOKUP(K59,[2]ItemConfig!$A:$C,3,FALSE)&\"×\"&M59","v":"灵石×183900"},{"$f":"VLOOKUP(L59,[2]ItemConfig!$A:$C,3,FALSE)&\"×\"&N59","v":"上品增元丹×1"}]
[56,1,56,null,"第56层",null,1,2056,"1702;1001",null,1001,1702,{"$f":"ROUND(VLOOKUP(O60,[1]ResourceLevelConfig!$A:$C,3,FALSE)*0.01,0)*300","v":189600},{"$f":"IF(L60>1400,1,VLOOKUP(O60,[1]ResourceLevelConfig!$A:$E,L60-998,FALSE)*2)","v":1},185,null,"1001;1702","189600;1",null,{"$f":"VLOOKUP(K60,[2]ItemConfig!$A:$C,3,FALSE)&\"×\"&M60","v":"灵石×189600"},{"$f":"VLOOKUP(L60,[2]ItemConfig!$A:$C,3,FALSE)&\"×\"&N60","v":"归识还元丹×1"}]
{"$rows_left_out":44}