{"text_format":"2","workbook":"xlsx","n_sheets":2,"sheets":["FabaoConfig","FabaoPowerupConfig"],"not_rendered":{"charts":0,"images":0,"macros":0,"external_links":2,"defined_names":2,"comments":0,"pivot_tables":0},"unopened":[],"bounds":{"document_bytes":16777216,"sheet_cells":100000,"run_cost":"one","rows_first":2000,"rows_last":500,"rows_between":2000,"halvings":0,"cell_chars":16384,"cell_head_chars":4096},"cells_cut":0,"cells_raw":0,"read":"whole","date_system":"1900"}

{"sheet":"FabaoConfig","index":0,"n_rows":15,"n_cols":19,"rows_kept":15,"cut":false,"hidden":false,"merged":[]}
["ID","ItemID","name","Type","magicAttribute","model","fragmentID",null,"ShuxingIDs","ShuxingPara","SkillGroupID"]
["int","int","string","int","int","string","int",null,"int[]","int[]","int"]
[{"$nulls":15},"输入等级",10]
[null,"法宝对应道具ID","法宝名称","法宝类型\n1攻击型\n2防御型","法宝类型\n1=金\n2=木\n4=水\n8=火\n16=土","模型名称","法宝对应碎片道具ID","法宝默认星级","法宝基础属性类型","法宝基础属性倍率","法宝技能ID组","生命","防御","攻击",null,"生命","防御","攻击","品质"]
[10001,10001,"神龙鼎",1,1,"fb_3101",11001,1,{"$f":"_xlfn.TEXTJOIN(\";\",1,IF(L5=\"\",\"\",1),IF(M5=\"\",\"\",2),IF(N5=\"\",\"\",3))","v":"2;3"},{"$f":"_xlfn.TEXTJOIN(\";\",1,L5:N5)","v":"50;50"},3101,null,50,50,null,{"$f":"IF(L5=\"\",\"\",ROUND(VLOOKUP($Q$3,FabaoPowerupConfig!$A:$E,3,FALSE)*L5/100,0))","v":""},{"$f":"IF(M5=\"\",\"\",ROUND(VLOOKUP($Q$3,FabaoPowerupConfig!$A:$E,4,FALSE)*M5/100,0))","v":11},{"$f":"IF(N5=\"\",\"\",ROUND(VLOOKUP($Q$3,FabaoPowerupConfig!$A:$E,5,FALSE)*N5/100,0))","v":11},4]
[10002,10002,"噬空齿刃",1,1,"fb_wulonglun",11002,1,{"$f":"_xlfn.TEXTJOIN(\";\",1,IF(L6=\"\",\"\",1),IF(M6=\"\",\"\",2),IF(N6=\"\",\"\",3))","v":"1;3"},{"$f":"_xlfn.TEXTJOIN(\";\",1,L6:N6)","v":"50;50"},3102,50,null,50,null,{"$f":"IF(L6=\"\",\"\",ROUND(VLOOKUP($Q$3,FabaoPowerupConfig!$A:$E,3,FALSE)*L6/100,0))","v":198},{"$f":"IF(M6=\"\",\"\",ROUND(VLOOKUP($Q$3,FabaoPowerupConfig!$A:$E,4,FALSE)*M6/100,0))","v":""},{"$f":"IF(N6=\"\",\"\",ROUND(VLOOKUP($Q$3,FabaoPowerupConfig!$A:$E,5,FALSE)*N6/100,0))","v":11},5]
[10003,10003,"翡翠葫芦",1,2,"fb_feicuihulu",11003,1,"1;2","75;25",3201,75,25,null,null,{"$f":"IF(L7=\"\",\"\",ROUND(VLOOKUP($Q$3,FabaoPowerupConfig!$A:$E,3,FALSE)*L7/100,0))","v":298},{"$f":"IF(M7=\"\",\"\",ROUND(VLOOKUP($Q$3,FabaoPowerupConfig!$A:$E,4,FALSE)*M7/100,0))","v":5},{"$f":"IF(N7=\"\",\"\",ROUND(VLOOKUP($Q$3,FabaoPowerupConfig!$A:$E,5,FALSE)*N7/100,0))","v":""},4]
[10004,10004,"混沌珠",1,2,"fb_3202",11004,1,"1;3","25;75",3202,25,null,75,null,{"$f":"IF(L8=\"\",\"\",ROUND(VLOOKUP($Q$3,FabaoPowerupConfig!$A:$E,3,FALSE)*L8/100,0))","v":99},{"$f":"IF(M8=\"\",\"\",ROUND(VLOOKUP($Q$3,FabaoPowerupConfig!$A:$E,4,FALSE)*M8/100,0))","v":""},{"$f":"IF(N8=\"\",\"\",ROUND(VLOOKUP($Q$3,FabaoPowerupConfig!$A:$E,5,FALSE)*N8/100,0))","v":16},5]
[10005,10005,"绝脉瓶",1,2,"fb_3203",11005,1,"2;3","50;50",3203,null,50,50,null,{"$f":"IF(L9=\"\",\"\",ROUND(VLOOKUP($Q$3,FabaoPowerupConfig!$A:$E,3,FALSE)*L9/100,0))","v":""},{"$f":"IF(M9=\"\",\"\",ROUND(VLOOKUP($Q$3,FabaoPowerupConfig!$A:$E,4,FALSE)*M9/100,0))","v":11},{"$f":"IF(N9=\"\",\"\",ROUND(VLOOKUP($Q$3,FabaoPowerupConfig!$A:$E,5,FALSE)*N9/100,0))","v":11},5]
[10006,10006,"九幽镇魂瓶",1,4,"fb_BossPing",11006,1,"1;3","50;50",3301,50,null,50,null,{"$f":"IF(L10=\"\",\"\",ROUND(VLOOKUP($Q$3,FabaoPowerupConfig!$A:$E,3,FALSE)*L10/100,0))","v":198},{"$f":"IF(M10=\"\",\"\",ROUND(VLOOKUP($Q$3,FabaoPowerupConfig!$A:$E,4,FALSE)*M10/100,0))","v":""},{"$f":"IF(N10=\"\",\"\",ROUND(VLOOKUP($Q$3,FabaoPowerupConfig!$A:$E,5,FALSE)*N10/100,0))","v":11},4]
[10007,10007,"玉莲守心灯",1,4,"fb_3302",11007,1,"1;2","75;25",3302,75,25,null,null,{"$f":"IF(L11=\"\",\"\",ROUND(VLOOKUP($Q$3,FabaoPowerupConfig!$A:$E,3,FALSE)*L11/100,0))","v":298},{"$f":"IF(M11=\"\",\"\",ROUND(VLOOKUP($Q$3,FabaoPowerupConfig!$A:$E,4,FALSE)*M11/100,0))","v":5},{"$f":"IF(N11=\"\",\"\",ROUND(VLOOKUP($Q$3,FabaoPowerupConfig!$A:$E,5,FALSE)*N11/100,0))","v":""},5]
[10008,10008,"融灵塔",1,8,"fb_3401",11008,1,"2;3","75;25",3401,null,75,25,null,{"$f":"IF(L12=\"\",\"\",ROUND(VLOOKUP($Q$3,FabaoPowerupConfig!$A:$E,3,FALSE)*L12/100,0))","v":""},{"$f":"IF(M12=\"\",\"\",ROUND(VLOOKUP($Q$3,FabaoPowerupConfig!$A:$E,4,FALSE)*M12/100,0))","v":16},{"$f":"IF(N12=\"\",\"\",ROUND(VLOOKUP($Q$3,FabaoPowerupConfig!$A:$E,5,FALSE)*N12/100,0))","v":5},4]
[null,10009,"禁元珠",1,8,"fb_BossPing",11009,1,"","",3402,{"$nulls":4},{"$f":"IF(L13=\"\",\"\",ROUND(VLOOKUP($Q$3,FabaoPowerupConfig!$A:$E,3,FALSE)*L13/100,0))","v":""},{"$f":"IF(M13=\"\",\"\",ROUND(VLOOKUP($Q$3,FabaoPowerupConfig!$A:$E,4,FALSE)*M13/100,0))","v":""},{"$f":"IF(N13=\"\",\"\",ROUND(VLOOKUP($Q$3,FabaoPowerupConfig!$A:$E,5,FALSE)*N13/100,0))","v":""},5]
[10010,10010,"玄龟盾",1,16,"fb_xuanguidun",11010,1,"1;2","25;75",3501,25,75,null,null,{"$f":"IF(L14=\"\",\"\",ROUND(VLOOKUP($Q$3,FabaoPowerupConfig!$A:$E,3,FALSE)*L14/100,0))","v":99},{"$f":"IF(M14=\"\",\"\",ROUND(VLOOKUP($Q$3,FabaoPowerupConfig!$A:$E,4,FALSE)*M14/100,0))","v":16},{"$f":"IF(N14=\"\",\"\",ROUND(VLOOKUP($Q$3,FabaoPowerupConfig!$A:$E,5,FALSE)*N14/100,0))","v":""},4]
[null,10011,"天殇血刃剑",1,16,"fb_ding1",11011,1,"","",3502,{"$nulls":4},{"$f":"IF(L15=\"\",\"\",ROUND(VLOOKUP($Q$3,FabaoPowerupConfig!$A:$E,3,FALSE)*L15/100,0))","v":""},{"$f":"IF(M15=\"\",\"\",ROUND(VLOOKUP($Q$3,FabaoPowerupConfig!$A:$E,4,FALSE)*M15/100,0))","v":""},{"$f":"IF(N15=\"\",\"\",ROUND(VLOOKUP($Q$3,FabaoPowerupConfig!$A:$E,5,FALSE)*N15/100,0))","v":""},5]

{"sheet":"FabaoPowerupConfig","index":1,"n_rows":154,"n_cols":25,"rows_kept":154,"cut":false,"hidden":false,"merged":[]}
["ID","Power","HP","DEF","ATK",null,"NeedLv","PowerupItemIDs","PowerupItemCosts",{"$nulls":4},"PromotePieceNum","SkillLevel"]
["int","int","float","float","float",null,"int","int[]","int[]",{"$nulls":4},"int[]","int"]
[]
["ID序列","法宝的基础强度成长","法宝的生命标准成长1","法宝的防御标准成长2","法宝的攻击标准成长3","实力等级","升级所需修为等级","强化所需道具ID","强化所需道具数量","道具1","数量1","道具2","数量2","突破所需对应碎片数量\n索引0=quality1","对应的技能等级",1.08,"白色","绿色","蓝色","紫色","橙色"]
[1,100,{"$f":"ROUND(VLOOKUP(F5,[1]主表!$A:$B,2,FALSE)*[1]主表!$D$1*[1]升级!$AC$4*(1+VLOOKUP(F5,[1]主表!$A:$F,6,FALSE)),2)","v":159.13999999999999},{"$f":"ROUND(VLOOKUP(F5,[1]主表!$A:$B,2,FALSE)*[1]主表!$D$1*[1]升级!$Z$4,2)","v":15.2},{"$f":"ROUND(VLOOKUP(F5,[1]主表!$A:$B,2,FALSE)*[1]主表!$D$1*[1]升级!$W$4,2)","v":15.2},2,3,{"$f":"_xlfn.TEXTJOIN(\";\",1,J5,L5)","v":"1001;1006"},{"$f":"_xlfn.TEXTJOIN(\";\",1,K5,M5)","v":"20404;510"},1001,{"$f":"ROUND(40*VLOOKUP(G5,[2]ResourceLevelConfig!$A:$H,3,FALSE)/20,0)","v":20404},1006,{"$f":"ROUND(100*VLOOKUP(G5,[2]ResourceLevelConfig!$A:$H,8,FALSE)/20,0)","v":510},{"$f":"_xlfn.TEXTJOIN(\";\",1,Q5:U5)","v":"-1"},1,null,-1]
[2,{"$f":"ROUND(B5*P$4,0)","v":108},{"$f":"ROUND(VLOOKUP(F6,[1]主表!$A:$B,2,FALSE)*[1]主表!$D$1*[1]升级!$AC$4*(1+VLOOKUP(F6,[1]主表!$A:$F,6,FALSE)),2)","v":178.09},{"$f":"ROUND(VLOOKUP(F6,[1]主表!$A:$B,2,FALSE)*[1]主表!$D$1*[1]升级!$Z$4,2)","v":15.62},{"$f":"ROUND(VLOOKUP(F6,[1]主表!$A:$B,2,FALSE)*[1]主表!$D$1*[1]升级!$W$4,2)","v":15.62},4,5,{"$f":"_xlfn.TEXTJOIN(\";\",1,J6,L6)","v":"1001;1006"},{"$f":"_xlfn.TEXTJOIN(\";\",1,K6,M6)","v":"20818;520"},1001,{"$f":"ROUND(40*VLOOKUP(G6,[2]ResourceLevelConfig!$A:$H,3,FALSE)/20,0)","v":20818},1006,{"$f":"ROUND(100*VLOOKUP(G6,[2]ResourceLevelConfig!$A:$H,8,FALSE)/20,0)","v":520},"-1",1,null,-1]
[3,{"$f":"ROUND(B6*P$4,0)","v":117},{"$f":"ROUND(VLOOKUP(F7,[1]主表!$A:$B,2,FALSE)*[1]主表!$D$1*[1]升级!$AC$4*(1+VLOOKUP(F7,[1]主表!$A:$F,6,FALSE)),2)","v":197.96},{"$f":"ROUND(VLOOKUP(F7,[1]主表!$A:$B,2,FALSE)*[1]主表!$D$1*[1]升级!$Z$4,2)","v":16.04},{"$f":"ROUND(VLOOKUP(F7,[1]主表!$A:$B,2,FALSE)*[1]主表!$D$1*[1]升级!$W$4,2)","v":16.04},6,7,"1001;1006","21240;530",1001,{"$f":"ROUND(40*VLOOKUP(G7,[2]ResourceLevelConfig!$A:$H,3,FALSE)/20,0)","v":21240},1006,{"$f":"ROUND(100*VLOOKUP(G7,[2]ResourceLevelConfig!$A:$H,8,FALSE)/20,0)","v":530},"-1",1,null,-1,{"$nulls":6},1,1]
[4,126,{"$f":"ROUND(VLOOKUP(F8,[1]主表!$A:$B,2,FALSE)*[1]主表!$D$1*[1]升级!$AC$4*(1+VLOOKUP(F8,[1]主表!$A:$F,6,FALSE)),2)","v":218.77},{"$f":"ROUND(VLOOKUP(F8,[1]主表!$A:$B,2,FALSE)*[1]主表!$D$1*[1]升级!$Z$4,2)","v":16.48},{"$f":"ROUND(VLOOKUP(F8,[1]主表!$A:$B,2,FALSE)*[1]主表!$D$1*[1]升级!$W$4,2)","v":16.48},8,9,"1001;1006","21670;540",1001,{"$f":"ROUND(40*VLOOKUP(G8,[2]ResourceLevelConfig!$A:$H,3,FALSE)/20,0)","v":21670},1006,{"$f":"ROUND(100*VLOOKUP(G8,[2]ResourceLevelConfig!$A:$H,8,FALSE)/20,0)","v":540},"-1",1,null,-1,{"$nulls":6},2,6]
[5,136,{"$f":"ROUND(VLOOKUP(F9,[1]主表!$A:$B,2,FALSE)*[1]主表!$D$1*[1]升级!$AC$4*(1+VLOOKUP(F9,[1]主表!$A:$F,6,FALSE)),2)","v":240.56},{"$f":"ROUND(VLOOKUP(F9,[1]主表!$A:$B,2,FALSE)*[1]主表!$D$1*[1]升级!$Z$4,2)","v":16.920000000000002},{"$f":"ROUND(VLOOKUP(F9,[1]主表!$A:$B,2,FALSE)*[1]主表!$D$1*[1]升级!$W$4,2)","v":16.920000000000002},10,11,"1001;1006","22108;555",1001,{"$f":"ROUND(40*VLOOKUP(G9,[2]ResourceLevelConfig!$A:$H,3,FALSE)/20,0)","v":22108},1006,{"$f":"ROUND(100*VLOOKUP(G9,[2]ResourceLevelConfig!$A:$H,8,FALSE)/20,0)","v":555},"-1",1,null,-1,{"$nulls":6},3,10]
[6,147,{"$f":"ROUND(VLOOKUP(F10,[1]主表!$A:$B,2,FALSE)*[1]主表!$D$1*[1]升级!$AC$4*(1+VLOOKUP(F10,[1]主表!$A:$F,6,FALSE)),2)","v":285.86},{"$f":"ROUND(VLOOKUP(F10,[1]主表!$A:$B,2,FALSE)*[1]主表!$D$1*[1]升级!$Z$4,2)","v":18.87},{"$f":"ROUND(VLOOKUP(F10,[1]主表!$A:$B,2,FALSE)*[1]主表!$D$1*[1]升级!$W$4,2)","v":18.87},12,13,"1001;1006","22556;565",1001,{"$f":"ROUND(40*VLOOKUP(G10,[2]ResourceLevelConfig!$A:$H,3,FALSE)/20,0)","v":22556},1006,{"$f":"ROUND(100*VLOOKUP(G10,[2]ResourceLevelConfig!$A:$H,8,FALSE)/20,0)","v":565},"-1",1,null,-1,{"$nulls":6},4,15]
[7,159,{"$f":"ROUND(VLOOKUP(F11,[1]主表!$A:$B,2,FALSE)*[1]主表!$D$1*[1]升级!$AC$4*(1+VLOOKUP(F11,[1]主表!$A:$F,6,FALSE)),2)","v":311.77999999999997},{"$f":"ROUND(VLOOKUP(F11,[1]主表!$A:$B,2,FALSE)*[1]主表!$D$1*[1]升级!$Z$4,2)","v":19.38},{"$f":"ROUND(VLOOKUP(F11,[1]主表!$A:$B,2,FALSE)*[1]主表!$D$1*[1]升级!$W$4,2)","v":19.38},14,15,"1001;1006","23012;575",1001,{"$f":"ROUND(40*VLOOKUP(G11,[2]ResourceLevelConfig!$A:$H,3,FALSE)/20,0)","v":23012},1006,{"$f":"ROUND(100*VLOOKUP(G11,[2]ResourceLevelConfig!$A:$H,8,FALSE)/20,0)","v":575},"-1",1,null,-1,{"$nulls":6},5,20]
[8,172,{"$f":"ROUND(VLOOKUP(F12,[1]主表!$A:$B,2,FALSE)*[1]主表!$D$1*[1]升级!$AC$4*(1+VLOOKUP(F12,[1]主表!$A:$F,6,FALSE)),2)","v":338.9},{"$f":"ROUND(VLOOKUP(F12,[1]主表!$A:$B,2,FALSE)*[1]主表!$D$1*[1]升级!$Z$4,2)","v":19.91},{"$f":"ROUND(VLOOKUP(F12,[1]主表!$A:$B,2,FALSE)*[1]主表!$D$1*[1]升级!$W$4,2)","v":19.91},16,17,"1001;1006","23478;585",1001,{"$f":"ROUND(40*VLOOKUP(G12,[2]ResourceLevelConfig!$A:$H,3,FALSE)/20,0)","v":23478},1006,{"$f":"ROUND(100*VLOOKUP(G12,[2]ResourceLevelConfig!$A:$H,8,FALSE)/20,0)","v":585},"-1",1,null,-1,{"$nulls":6},6,25]
[9,186,{"$f":"ROUND(VLOOKUP(F13,[1]主表!$A:$B,2,FALSE)*[1]主表!$D$1*[1]升级!$AC$4*(1+VLOOKUP(F13,[1]主表!$A:$F,6,FALSE)),2)","v":367.27},{"$f":"ROUND(VLOOKUP(F13,[1]主表!$A:$B,2,FALSE)*[1]主表!$D$1*[1]升级!$Z$4,2)","v":20.45},{"$f":"ROUND(VLOOKUP(F13,[1]主表!$A:$B,2,FALSE)*[1]主表!$D$1*[1]升级!$W$4,2)","v":20.45},18,19,"1001;1006","23952;600",1001,{"$f":"ROUND(40*VLOOKUP(G13,[2]ResourceLevelConfig!$A:$H,3,FALSE)/20,0)","v":23952},1006,{"$f":"ROUND(100*VLOOKUP(G13,[2]ResourceLevelConfig!$A:$H,8,FALSE)/20,0)","v":600},"-1",1,null,-1]
[10,201,{"$f":"ROUND(VLOOKUP(F14,[1]主表!$A:$B,2,FALSE)*[1]主表!$D$1*[1]升级!$AC$4*(1+VLOOKUP(F14,[1]主表!$A:$F,6,FALSE)),2)","v":396.92},{"$f":"ROUND(VLOOKUP(F14,[1]主表!$A:$B,2,FALSE)*[1]主表!$D$1*[1]升级!$Z$4,2)","v":21.01},{"$f":"ROUND(VLOOKUP(F14,[1]主表!$A:$B,2,FALSE)*[1]主表!$D$1*[1]升级!$W$4,2)","v":21.01},20,21,"1001;1006","24438;610",1001,{"$f":"ROUND(40*VLOOKUP(G14,[2]ResourceLevelConfig!$A:$H,3,FALSE)/20,0)","v":24438},1006,{"$f":"ROUND(100*VLOOKUP(G14,[2]ResourceLevelConfig!$A:$H,8,FALSE)/20,0)","v":610},"-1",1,null,-1]
[11,217,{"$f":"ROUND(VLOOKUP(F15,[1]主表!$A:$B,2,FALSE)*[1]主表!$D$1*[1]升级!$AC$4*(1+VLOOKUP(F15,[1]主表!$A:$F,6,FALSE)),2)","v":464.44},{"$f":"ROUND(VLOOKUP(F15,[1]主表!$A:$B,2,FALSE)*[1]主表!$D$1*[1]升级!$Z$4,2)","v":23.42},{"$f":"ROUND(VLOOKUP(F15,[1]主表!$A:$B,2,FALSE)*[1]主表!$D$1*[1]升级!$W$4,2)","v":23.42},22,23,"1001;1006","24932;625",1001,{"$f":"ROUND(40*VLOOKUP(G15,[2]ResourceLevelConfig!$A:$H,3,FALSE)/20,0)","v":24932},1006,{"$f":"ROUND(100*VLOOKUP(G15,[2]ResourceLevelConfig!$A:$H,8,FALSE)/20,0)","v":625},"-1",1,null,-1]
[12,234,{"$f":"ROUND(VLOOKUP(F16,[1]主表!$A:$B,2,FALSE)*[1]主表!$D$1*[1]升级!$AC$4*(1+VLOOKUP(F16,[1]主表!$A:$F,6,FALSE)),2)","v":499.59},{"$f":"ROUND(VLOOKUP(F16,[1]主表!$A:$B,2,FALSE)*[1]主表!$D$1*[1]升级!$Z$4,2)","v":24.05},{"$f":"ROUND(VLOOKUP(F16,[1]主表!$A:$B,2,FALSE)*[1]主表!$D$1*[1]升级!$W$4,2)","v":24.05},24,25,"1001;1006","25436;635",1001,{"$f":"ROUND(40*VLOOKUP(G16,[2]ResourceLevelConfig!$A:$H,3,FALSE)/20,0)","v":25436},1006,{"$f":"ROUND(100*VLOOKUP(G16,[2]ResourceLevelConfig!$A:$H,8,FALSE)/20,0)","v":635},"-1",1,null,-1]
[13,253,{"$f":"ROUND(VLOOKUP(F17,[1]主表!$A:$B,2,FALSE)*[1]主表!$D$1*[1]升级!$AC$4*(1+VLOOKUP(F17,[1]主表!$A:$F,6,FALSE)),2)","v":536.30999999999995},{"$f":"ROUND(VLOOKUP(F17,[1]主表!$A:$B,2,FALSE)*[1]主表!$D$1*[1]升级!$Z$4,2)","v":24.71},{"$f":"ROUND(VLOOKUP(F17,[1]主表!$A:$B,2,FALSE)*[1]主表!$D$1*[1]升级!$W$4,2)","v":24.71},26,27,"1001;1006","25952;650",1001,{"$f":"ROUND(40*VLOOKUP(G17,[2]ResourceLevelConfig!$A:$H,3,FALSE)/20,0)","v":25952},1006,{"$f":"ROUND(100*VLOOKUP(G17,[2]ResourceLevelConfig!$A:$H,8,FALSE)/20,0)","v":650},"-1",1,null,-1]
[14,273,{"$f":"ROUND(VLOOKUP(F18,[1]主表!$A:$B,2,FALSE)*[1]主表!$D$1*[1]升级!$AC$4*(1+VLOOKUP(F18,[1]主表!$A:$F,6,FALSE)),2)","v":574.66},{"$f":"ROUND(VLOOKUP(F18,[1]主表!$A:$B,2,FALSE)*[1]主表!$D$1*[1]升级!$Z$4,2)","v":25.38},{"$f":"ROUND(VLOOKUP(F18,[1]主表!$A:$B,2,FALSE)*[1]主表!$D$1*[1]升级!$W$4,2)","v":25.38},28,29,"1001;1006","26476;660",1001,{"$f":"ROUND(40*VLOOKUP(G18,[2]ResourceLevelConfig!$A:$H,3,FALSE)/20,0)","v":26476},1006,{"$f":"ROUND(100*VLOOKUP(G18,[2]ResourceLevelConfig!$A:$H,8,FALSE)/20,0)","v":660},"-1",1,null,-1]
[15,295,{"$f":"ROUND(VLOOKUP(F19,[1]主表!$A:$B,2,FALSE)*[1]主表!$D$1*[1]升级!$AC$4*(1+VLOOKUP(F19,[1]主表!$A:$F,6,FALSE)),2)","v":614.69000000000005},{"$f":"ROUND(VLOOKUP(F19,[1]主表!$A:$B,2,FALSE)*[1]主表!$D$1*[1]升级!$Z$4,2)","v":26.07},{"$f":"ROUND(VLOOKUP(F19,[1]主表!$A:$B,2,FALSE)*[1]主表!$D$1*[1]升级!$W$4,2)","v":26.07},30,31,"1001;1006","27012;675",1001,{"$f":"ROUND(40*VLOOKUP(G19,[2]ResourceLevelConfig!$A:$H,3,FALSE)/20,0)","v":27012},1006,{"$f":"ROUND(100*VLOOKUP(G19,[2]ResourceLevelConfig!$A:$H,8,FALSE)/20,0)","v":675},"-1",1,null,-1]
[16,319,{"$f":"ROUND(VLOOKUP(F20,[1]主表!$A:$B,2,FALSE)*[1]主表!$D$1*[1]升级!$AC$4*(1+VLOOKUP(F20,[1]主表!$A:$F,6,FALSE)),2)","v":842.05},{"$f":"ROUND(VLOOKUP(F20,[1]主表!$A:$B,2,FALSE)*[1]主表!$D$1*[1]升级!$Z$4,2)","v":34.35},{"$f":"ROUND(VLOOKUP(F20,[1]主表!$A:$B,2,FALSE)*[1]主表!$D$1*[1]升级!$W$4,2)","v":34.35},32,33,"1001;1006","27560;690",1001,{"$f":"ROUND(40*VLOOKUP(G20,[2]ResourceLevelConfig!$A:$H,3,FALSE)/20,0)","v":27560},1006,{"$f":"ROUND(100*VLOOKUP(G20,[2]ResourceLevelConfig!$A:$H,8,FALSE)/20,0)","v":690},"-1",1,null,-1]
[17,345,{"$f":"ROUND(VLOOKUP(F21,[1]主表!$A:$B,2,FALSE)*[1]主表!$D$1*[1]升级!$AC$4*(1+VLOOKUP(F21,[1]主表!$A:$F,6,FALSE)),2)","v":897.99},{"$f":"ROUND(VLOOKUP(F21,[1]主表!$A:$B,2,FALSE)*[1]主表!$D$1*[1]升级!$Z$4,2)","v":35.28},{"$f":"ROUND(VLOOKUP(F21,[1]主表!$A:$B,2,FALSE)*[1]主表!$D$1*[1]升级!$W$4,2)","v":35.28},34,35,"1001;1006","28118;705",1001,{"$f":"ROUND(40*VLOOKUP(G21,[2]ResourceLevelConfig!$A:$H,3,FALSE)/20,0)","v":28118},1006,{"$f":"ROUND(100*VLOOKUP(G21,[2]ResourceLevelConfig!$A:$H,8,FALSE)/20,0)","v":705},"-1",1,null,-1]
[18,373,{"$f":"ROUND(VLOOKUP(F22,[1]主表!$A:$B,2,FALSE)*[1]主表!$D$1*[1]升级!$AC$4*(1+VLOOKUP(F22,[1]主表!$A:$F,6,FALSE)),2)","v":956.34},{"$f":"ROUND(VLOOKUP(F22,[1]主表!$A:$B,2,FALSE)*[1]主表!$D$1*[1]升级!$Z$4,2)","v":36.24},{"$f":"ROUND(VLOOKUP(F22,[1]主表!$A:$B,2,FALSE)*[1]主表!$D$1*[1]升级!$W$4,2)","v":36.24},36,37,"1001;1006","28686;715",1001,{"$f":"ROUND(40*VLOOKUP(G22,[2]ResourceLevelConfig!$A:$H,3,FALSE)/20,0)","v":28686},1006,{"$f":"ROUND(100*VLOOKUP(G22,[2]ResourceLevelConfig!$A:$H,8,FALSE)/20,0)","v":715},"-1",1,null,-1]
[19,403,{"$f":"ROUND(VLOOKUP(F23,[1]主表!$A:$B,2,FALSE)*[1]主表!$D$1*[1]升级!$AC$4*(1+VLOOKUP(F23,[1]主表!$A:$F,6,FALSE)),2)","v":1017.2},{"$f":"ROUND(VLOOKUP(F23,[1]主表!$A:$B,2,FALSE)*[1]主表!$D$1*[1]升级!$Z$4,2)","v":37.229999999999997},{"$f":"ROUND(VLOOKUP(F23,[1]主表!$A:$B,2,FALSE)*[1]主表!$D$1*[1]升级!$W$4,2)","v":37.229999999999997},38,39,"1001;1006","29268;730",1001,{"$f":"ROUND(40*VLOOKUP(G23,[2]ResourceLevelConfig!$A:$H,3,FALSE)/20,0)","v":29268},1006,{"$f":"ROUND(100*VLOOKUP(G23,[2]ResourceLevelConfig!$A:$H,8,FALSE)/20,0)","v":730},"-1",1,null,-1]
[20,435,{"$f":"ROUND(VLOOKUP(F24,[1]主表!$A:$B,2,FALSE)*[1]主表!$D$1*[1]升级!$AC$4*(1+VLOOKUP(F24,[1]主表!$A:$F,6,FALSE)),2)","v":1080.6600000000001},{"$f":"ROUND(VLOOKUP(F24,[1]主表!$A:$B,2,FALSE)*[1]主表!$D$1*[1]升级!$Z$4,2)","v":38.24},{"$f":"ROUND(VLOOKUP(F24,[1]主表!$A:$B,2,FALSE)*[1]主表!$D$1*[1]升级!$W$4,2)","v":38.24},40,41,"1001;1006","29860;745",1001,{"$f":"ROUND(40*VLOOKUP(G24,[2]ResourceLevelConfig!$A:$H,3,FALSE)/20,0)","v":29860},1006,{"$f":"ROUND(100*VLOOKUP(G24,[2]ResourceLevelConfig!$A:$H,8,FALSE)/20,0)","v":745},"-1",1,null,-1]
[21,470,{"$f":"ROUND(VLOOKUP(F25,[1]主表!$A:$B,2,FALSE)*[1]主表!$D$1*[1]升级!$AC$4*(1+VLOOKUP(F25,[1]主表!$A:$F,6,FALSE)),2)","v":1244.7},{"$f":"ROUND(VLOOKUP(F25,[1]主表!$A:$B,2,FALSE)*[1]主表!$D$1*[1]升级!$Z$4,2)","v":42.63},{"$f":"ROUND(VLOOKUP(F25,[1]主表!$A:$B,2,FALSE)*[1]主表!$D$1*[1]升级!$W$4,2)","v":42.63},42,43,"1001;1006","30464;760",1001,{"$f":"ROUND(40*VLOOKUP(G25,[2]ResourceLevelConfig!$A:$H,3,FALSE)/20,0)","v":30464},1006,{"$f":"ROUND(100*VLOOKUP(G25,[2]ResourceLevelConfig!$A:$H,8,FALSE)/20,0)","v":760},"-1",1,null,-1]
[22,508,{"$f":"ROUND(VLOOKUP(F26,[1]主表!$A:$B,2,FALSE)*[1]主表!$D$1*[1]升级!$AC$4*(1+VLOOKUP(F26,[1]主表!$A:$F,6,FALSE)),2)","v":1319.54},{"$f":"ROUND(VLOOKUP(F26,[1]主表!$A:$B,2,FALSE)*[1]主表!$D$1*[1]升级!$Z$4,2)","v":43.79},{"$f":"ROUND(VLOOKUP(F26,[1]主表!$A:$B,2,FALSE)*[1]主表!$D$1*[1]升级!$W$4,2)","v":43.79},44,45,"1001;1006","31080;775",1001,{"$f":"ROUND(40*VLOOKUP(G26,[2]ResourceLevelConfig!$A:$H,3,FALSE)/20,0)","v":31080},1006,{"$f":"ROUND(100*VLOOKUP(G26,[2]ResourceLevelConfig!$A:$H,8,FALSE)/20,0)","v":775},"-1",1,null,-1]
[23,549,{"$f":"ROUND(VLOOKUP(F27,[1]主表!$A:$B,2,FALSE)*[1]主表!$D$1*[1]升级!$AC$4*(1+VLOOKUP(F27,[1]主表!$A:$F,6,FALSE)),2)","v":1397.54},{"$f":"ROUND(VLOOKUP(F27,[1]主表!$A:$B,2,FALSE)*[1]主表!$D$1*[1]升级!$Z$4,2)","v":44.98},{"$f":"ROUND(VLOOKUP(F27,[1]主表!$A:$B,2,FALSE)*[1]主表!$D$1*[1]升级!$W$4,2)","v":44.98},46,47,"1001;1006","31710;795",1001,{"$f":"ROUND(40*VLOOKUP(G27,[2]ResourceLevelConfig!$A:$H,3,FALSE)/20,0)","v":31710},1006,{"$f":"ROUND(100*VLOOKUP(G27,[2]ResourceLevelConfig!$A:$H,8,FALSE)/20,0)","v":795},"-1",1,null,-1]
[24,593,{"$f":"ROUND(VLOOKUP(F28,[1]主表!$A:$B,2,FALSE)*[1]主表!$D$1*[1]升级!$AC$4*(1+VLOOKUP(F28,[1]主表!$A:$F,6,FALSE)),2)","v":1478.8},{"$f":"ROUND(VLOOKUP(F28,[1]主表!$A:$B,2,FALSE)*[1]主表!$D$1*[1]升级!$Z$4,2)","v":46.2},{"$f":"ROUND(VLOOKUP(F28,[1]主表!$A:$B,2,FALSE)*[1]主表!$D$1*[1]升级!$W$4,2)","v":46.2},48,49,"1001;1006","32352;810",1001,{"$f":"ROUND(40*VLOOKUP(G28,[2]ResourceLevelConfig!$A:$H,3,FALSE)/20,0)","v":32352},1006,{"$f":"ROUND(100*VLOOKUP(G28,[2]ResourceLevelConfig!$A:$H,8,FALSE)/20,0)","v":810},"-1",1,null,-1]
[25,640,{"$f":"ROUND(VLOOKUP(F29,[1]主表!$A:$B,2,FALSE)*[1]主表!$D$1*[1]升级!$AC$4*(1+VLOOKUP(F29,[1]主表!$A:$F,6,FALSE)),2)","v":1563.44},{"$f":"ROUND(VLOOKUP(F29,[1]主表!$A:$B,2,FALSE)*[1]主表!$D$1*[1]升级!$Z$4,2)","v":47.46},{"$f":"ROUND(VLOOKUP(F29,[1]主表!$A:$B,2,FALSE)*[1]主表!$D$1*[1]升级!$W$4,2)","v":47.46},50,51,"1001;1006","33006;825",1001,{"$f":"ROUND(40*VLOOKUP(G29,[2]ResourceLevelConfig!$A:$H,3,FALSE)/20,0)","v":33006},1006,{"$f":"ROUND(100*VLOOKUP(G29,[2]ResourceLevelConfig!$A:$H,8,FALSE)/20,0)","v":825},"-1",1,null,-1]
[26,691,{"$f":"ROUND(VLOOKUP(F30,[1]主表!$A:$B,2,FALSE)*[1]主表!$D$1*[1]升级!$AC$4*(1+VLOOKUP(F30,[1]主表!$A:$F,6,FALSE)),2)","v":1792.55},{"$f":"ROUND(VLOOKUP(F30,[1]主表!$A:$B,2,FALSE)*[1]主表!$D$1*[1]升级!$Z$4,2)","v":52.91},{"$f":"ROUND(VLOOKUP(F30,[1]主表!$A:$B,2,FALSE)*[1]主表!$D$1*[1]升级!$W$4,2)","v":52.91},52,53,"1001;1006","33674;840",1001,{"$f":"ROUND(40*VLOOKUP(G30,[2]ResourceLevelConfig!$A:$H,3,FALSE)/20,0)","v":33674},1006,{"$f":"ROUND(100*VLOOKUP(G30,[2]ResourceLevelConfig!$A:$H,8,FALSE)/20,0)","v":840},"-1",1,null,-1]
[27,746,{"$f":"ROUND(VLOOKUP(F31,[1]主表!$A:$B,2,FALSE)*[1]主表!$D$1*[1]升级!$AC$4*(1+VLOOKUP(F31,[1]主表!$A:$F,6,FALSE)),2)","v":1892.18},{"$f":"ROUND(VLOOKUP(F31,[1]主表!$A:$B,2,FALSE)*[1]主表!$D$1*[1]升级!$Z$4,2)","v":54.35},{"$f":"ROUND(VLOOKUP(F31,[1]主表!$A:$B,2,FALSE)*[1]主表!$D$1*[1]升级!$W$4,2)","v":54.35},54,55,"1001;1006","34356;860",1001,{"$f":"ROUND(40*VLOOKUP(G31,[2]ResourceLevelConfig!$A:$H,3,FALSE)/20,0)","v":34356},1006,{"$f":"ROUND(100*VLOOKUP(G31,[2]ResourceLevelConfig!$A:$H,8,FALSE)/20,0)","v":860},"-1",1,null,-1]
[28,806,{"$f":"ROUND(VLOOKUP(F32,[1]主表!$A:$B,2,FALSE)*[1]主表!$D$1*[1]升级!$AC$4*(1+VLOOKUP(F32,[1]主表!$A:$F,6,FALSE)),2)","v":1995.9},{"$f":"ROUND(VLOOKUP(F32,[1]主表!$A:$B,2,FALSE)*[1]主表!$D$1*[1]升级!$Z$4,2)","v":55.83},{"$f":"ROUND(VLOOKUP(F32,[1]主表!$A:$B,2,FALSE)*[1]主表!$D$1*[1]升级!$W$4,2)","v":55.83},56,57,"1001;1006","35052;875",1001,{"$f":"ROUND(40*VLOOKUP(G32,[2]ResourceLevelConfig!$A:$H,3,FALSE)/20,0)","v":35052},1006,{"$f":"ROUND(100*VLOOKUP(G32,[2]ResourceLevelConfig!$A:$H,8,FALSE)/20,0)","v":875},"-1",1,null,-1]
[29,870,{"$f":"ROUND(VLOOKUP(F33,[1]主表!$A:$B,2,FALSE)*[1]主表!$D$1*[1]升级!$AC$4*(1+VLOOKUP(F33,[1]主表!$A:$F,6,FALSE)),2)","v":2103.86},{"$f":"ROUND(VLOOKUP(F33,[1]主表!$A:$B,2,FALSE)*[1]主表!$D$1*[1]升级!$Z$4,2)","v":57.34},{"$f":"ROUND(VLOOKUP(F33,[1]主表!$A:$B,2,FALSE)*[1]主表!$D$1*[1]升级!$W$4,2)","v":57.34},58,59,"1001;1006","35760;895",1001,{"$f":"ROUND(40*VLOOKUP(G33,[2]ResourceLevelConfig!$A:$H,3,FALSE)/20,0)","v":35760},1006,{"$f":"ROUND(100*VLOOKUP(G33,[2]ResourceLevelConfig!$A:$H,8,FALSE)/20,0)","v":895},"-1",1,null,-1]
[30,940,{"$f":"ROUND(VLOOKUP(F34,[1]主表!$A:$B,2,FALSE)*[1]主表!$D$1*[1]升级!$AC$4*(1+VLOOKUP(F34,[1]主表!$A:$F,6,FALSE)),2)","v":2216.21},{"$f":"ROUND(VLOOKUP(F34,[1]主表!$A:$B,2,FALSE)*[1]主表!$D$1*[1]升级!$Z$4,2)","v":58.9},{"$f":"ROUND(VLOOKUP(F34,[1]主表!$A:$B,2,FALSE)*[1]主表!$D$1*[1]升级!$W$4,2)","v":58.9},60,61,"1001;1006","36484;910",1001,{"$f":"ROUND(40*VLOOKUP(G34,[2]ResourceLevelConfig!$A:$H,3,FALSE)/20,0)","v":36484},1006,{"$f":"ROUND(100*VLOOKUP(G34,[2]ResourceLevelConfig!$A:$H,8,FALSE)/20,0)","v":910},{"$f":"_xlfn.TEXTJOIN(\";\",1,Q34:U34)","v":"-1;0;30;30;30"},2,null,-1,0,{"$f":"[1]抽卡!$S$10","v":30},{"$f":"[1]抽卡!$S$11","v":30},{"$f":"[1]抽卡!$S$12","v":30}]
[31,1015,{"$f":"ROUND(VLOOKUP(F35,[1]主表!$A:$B,2,FALSE)*[1]主表!$D$1*[1]升级!$AC$4*(1+VLOOKUP(F35,[1]主表!$A:$F,6,FALSE)),2)","v":2992.65},{"$f":"ROUND(VLOOKUP(F35,[1]主表!$A:$B,2,FALSE)*[1]主表!$D$1*[1]升级!$Z$4,2)","v":77.61},{"$f":"ROUND(VLOOKUP(F35,[1]主表!$A:$B,2,FALSE)*[1]主表!$D$1*[1]升级!$W$4,2)","v":77.61},62,63,{"$f":"_xlfn.TEXTJOIN(\";\",1,J35,L35)","v":"1001;1006"},{"$f":"_xlfn.TEXTJOIN(\";\",1,K35,M35)","v":"37222;930"},1001,{"$f":"ROUND(40*VLOOKUP(G35,[2]ResourceLevelConfig!$A:$H,3,FALSE)/20,0)","v":37222},1006,{"$f":"ROUND(100*VLOOKUP(G35,[2]ResourceLevelConfig!$A:$H,8,FALSE)/20,0)","v":930},"-1",2,null,-1]
[32,{"$f":"ROUND(B35*P$4,0)","v":1096},{"$f":"ROUND(VLOOKUP(F36,[1]主表!$A:$B,2,FALSE)*[1]主表!$D$1*[1]升级!$AC$4*(1+VLOOKUP(F36,[1]主表!$A:$F,6,FALSE)),2)","v":3148.66},{"$f":"ROUND(VLOOKUP(F36,[1]主表!$A:$B,2,FALSE)*[1]主表!$D$1*[1]升级!$Z$4,2)","v":79.72},{"$f":"ROUND(VLOOKUP(F36,[1]主表!$A:$B,2,FALSE)*[1]主表!$D$1*[1]升级!$W$4,2)","v":79.72},64,65,"1001;1006","37976;950",1001,{"$f":"ROUND(40*VLOOKUP(G36,[2]ResourceLevelConfig!$A:$H,3,FALSE)/20,0)","v":37976},1006,{"$f":"ROUND(100*VLOOKUP(G36,[2]ResourceLevelConfig!$A:$H,8,FALSE)/20,0)","v":950},"-1",2,null,-1]
[33,1184,{"$f":"ROUND(VLOOKUP(F37,[1]主表!$A:$B,2,FALSE)*[1]主表!$D$1*[1]升级!$AC$4*(1+VLOOKUP(F37,[1]主表!$A:$F,6,FALSE)),2)","v":3310.94},{"$f":"ROUND(VLOOKUP(F37,[1]主表!$A:$B,2,FALSE)*[1]主表!$D$1*[1]升级!$Z$4,2)","v":81.88},{"$f":"ROUND(VLOOKUP(F37,[1]主表!$A:$B,2,FALSE)*[1]主表!$D$1*[1]升级!$W$4,2)","v":81.88},66,67,{"$f":"_xlfn.TEXTJOIN(\";\",1,J37,L37)","v":"1001;1006"},{"$f":"_xlfn.TEXTJOIN(\";\",1,K37,M37)","v":"38744;970"},1001,{"$f":"ROUND(40*VLOOKUP(G37,[2]ResourceLevelConfig!$A:$H,3,FALSE)/20,0)","v":38744},1006,{"$f":"ROUND(100*VLOOKUP(G37,[2]ResourceLevelConfig!$A:$H,8,FALSE)/20,0)","v":970},"-1",2,null,-1]
[34,1279,{"$f":"ROUND(VLOOKUP(F38,[1]主表!$A:$B,2,FALSE)*[1]主表!$D$1*[1]升级!$AC$4*(1+VLOOKUP(F38,[1]主表!$A:$F,6,FALSE)),2)","v":3479.72},{"$f":"ROUND(VLOOKUP(F38,[1]主表!$A:$B,2,FALSE)*[1]主表!$D$1*[1]升级!$Z$4,2)","v":84.11},{"$f":"ROUND(VLOOKUP(F38,[1]主表!$A:$B,2,FALSE)*[1]主表!$D$1*[1]升级!$W$4,2)","v":84.11},68,69,"1001;1006","39530;990",1001,{"$f":"ROUND(40*VLOOKUP(G38,[2]ResourceLevelConfig!$A:$H,3,FALSE)/20,0)","v":39530},1006,{"$f":"ROUND(100*VLOOKUP(G38,[2]ResourceLevelConfig!$A:$H,8,FALSE)/20,0)","v":990},"-1",2,null,-1]
[35,1381,{"$f":"ROUND(VLOOKUP(F39,[1]主表!$A:$B,2,FALSE)*[1]主表!$D$1*[1]升级!$AC$4*(1+VLOOKUP(F39,[1]主表!$A:$F,6,FALSE)),2)","v":3655.22},{"$f":"ROUND(VLOOKUP(F39,[1]主表!$A:$B,2,FALSE)*[1]主表!$D$1*[1]升级!$Z$4,2)","v":86.4},{"$f":"ROUND(VLOOKUP(F39,[1]主表!$A:$B,2,FALSE)*[1]主表!$D$1*[1]升级!$W$4,2)","v":86.4},70,71,"1001;1006","40330;1010",1001,{"$f":"ROUND(40*VLOOKUP(G39,[2]ResourceLevelConfig!$A:$H,3,FALSE)/20,0)","v":40330},1006,{"$f":"ROUND(100*VLOOKUP(G39,[2]ResourceLevelConfig!$A:$H,8,FALSE)/20,0)","v":1010},"-1",2,null,-1]
[36,1491,{"$f":"ROUND(VLOOKUP(F40,[1]主表!$A:$B,2,FALSE)*[1]主表!$D$1*[1]升级!$AC$4*(1+VLOOKUP(F40,[1]主表!$A:$F,6,FALSE)),2)","v":4165.2299999999996},{"$f":"ROUND(VLOOKUP(F40,[1]主表!$A:$B,2,FALSE)*[1]主表!$D$1*[1]升级!$Z$4,2)","v":96.32},{"$f":"ROUND(VLOOKUP(F40,[1]主表!$A:$B,2,FALSE)*[1]主表!$D$1*[1]升级!$W$4,2)","v":96.32},72,73,"1001;1006","41146;1030",1001,{"$f":"ROUND(40*VLOOKUP(G40,[2]ResourceLevelConfig!$A:$H,3,FALSE)/20,0)","v":41146},1006,{"$f":"ROUND(100*VLOOKUP(G40,[2]ResourceLevelConfig!$A:$H,8,FALSE)/20,0)","v":1030},"-1",2,null,-1]
{"$rows_left_out":114}