{"text_format":"2","workbook":"xlsx","n_sheets":6,"sheets":["EventConfig","EventLinkConfig","EventConditionConfig","条件类型查询","EventNPC","XianTuLogConfig"],"not_rendered":{"charts":0,"images":0,"macros":0,"external_links":0,"defined_names":2,"comments":0,"pivot_tables":0},"unopened":[],"bounds":{"document_bytes":16777216,"sheet_cells":100000,"run_cost":"one","rows_first":2000,"rows_last":500,"rows_between":2000,"halvings":0,"cell_chars":16384,"cell_head_chars":4096},"cells_cut":0,"cells_raw":0,"read":"whole","date_system":"1900"}

{"sheet":"EventConfig","index":0,"n_rows":41,"n_cols":32,"rows_kept":41,"cut":false,"hidden":false,"merged":[]}
["ID","EventLinksId","EventTriggerType","EventTag","EventType","Score","EventQuality",null,"PrizeIDs","PrizeNums","RelatedEvents","RefreshProbability","RefreshCount","placeID","XiantuID",null,"EventConditionId","EventValue","EventCount","EventName","Description"]
["int","int[]","int","int","int","int","int",null,"int[]","int[]","int[]","int","int","int","int",null,"int","int[]","int","int","int"]
[]
["ID","事件包含的ID","事件类型：\n1.通用事件\n2.挂机事件\n4.主线任务\n5.仙山探险\n99.无标记\n","tag\n1主线2支线\n3通用\n4地图通用\n5道友","1.正常触发\n2.直接结算","增加进度值","事件品质",null,"事件结局奖励","事件结局奖励数量","关联的事件Id","刷新的概率\n（100=100%）","最大刷新数量","属于哪张地图","仙途日志ID","触发条件","触发条件类型\n只能配处于什么状态和数值，不能配变化的数值","触发效果值","触发判定数量or次数","任务标题","任务详情界面的总描述","标题","整体描述","步骤1","步骤2","步骤3","步骤4","步骤5","步骤6","步骤7","步骤8","步骤9"]
[1,{"$f":"_xlfn.TEXTJOIN(\";\",1,X5:AF5)","v":"1001;1002;1003;1004;1005"},1,3,1,0,1,null,1001,10,{"$nulls":5},{"$f":"IF(Q5=\"\",\"\",VLOOKUP(Q5,条件类型查询!A:B,2,FALSE))","v":"境界判断"},3,5,null,174,1936,"受伤的狼","你发现一只奄奄一息的狼，决定上前一探究竟。",1001,1002,1003,1004,1005]
[2,{"$f":"_xlfn.TEXTJOIN(\";\",1,X6:AF6)","v":"1010;1011;1012;1013;1014;1015;1016"},1,3,1,0,1,null,1001,10,{"$nulls":5},{"$f":"IF(Q6=\"\",\"\",VLOOKUP(Q6,条件类型查询!A:B,2,FALSE))","v":""},null,null,null,175,1937,"鹬蚌相争","附近的小树林闹的不可开交，你决定去看看怎么回事。",1010,1011,1012,1013,1014,1015,1016]
[3,"1020;1021;1022;1023;1024;1025;1026",99,2,1,10,1,null,1001,10,{"$nulls":5},{"$f":"IF(Q7=\"\",\"\",VLOOKUP(Q7,条件类型查询!A:B,2,FALSE))","v":"拥有特定道具"},1,1004,1,176,1938,"鹬蚌相争2","附近的小树林闹的不可开交，你决定去看看怎么回事。",1020,1021,1022,1023,1024,1025,1026]
[null,"",{"$nulls":13},{"$f":"IF(Q8=\"\",\"\",VLOOKUP(Q8,条件类型查询!A:B,2,FALSE))","v":""}]
[4,"1030",1,1,2,0,1,null,1001,10,{"$nulls":5},{"$f":"IF(Q9=\"\",\"\",VLOOKUP(Q9,条件类型查询!A:B,2,FALSE))","v":"触发概率"},7,500,null,217,1939,"溅血背包","不远处有一个小红点，走近一看你发现是一个带血的背包。",1030]
[5,"1040",1,1,2,0,1,null,1001,10,{"$nulls":5},{"$f":"IF(Q10=\"\",\"\",VLOOKUP(Q10,条件类型查询!A:B,2,FALSE))","v":""},null,null,null,218,1940,"废弃矿山","底下一座矿山甚是磅礴雄伟，走，去看一看。",1040]
[6,"1050",1,1,2,0,1,null,1001,10,{"$nulls":5},{"$f":"IF(Q11=\"\",\"\",VLOOKUP(Q11,条件类型查询!A:B,2,FALSE))","v":""},null,null,null,219,1941,"吵架声","你被一男一女的吵架声吸引。",1050]
[7,"1060",1,1,2,0,1,null,1001,10,{"$nulls":5},{"$f":"IF(Q12=\"\",\"\",VLOOKUP(Q12,条件类型查询!A:B,2,FALSE))","v":""},null,null,null,220,1942,"一座道观","远处一座道观仙气缭绕，似有仙人在此。",1060]
[null,"",{"$nulls":13},{"$f":"IF(Q13=\"\",\"\",VLOOKUP(Q13,条件类型查询!A:B,2,FALSE))","v":""}]
[11,"10001",2,null,1,0,1,null,1001,10,{"$nulls":5},{"$f":"IF(Q14=\"\",\"\",VLOOKUP(Q14,条件类型查询!A:B,2,FALSE))","v":""},{"$nulls":5},"遇到怪物1-修为",null,10001]
[12,"10003",2,null,1,0,1,null,1001,10,{"$nulls":5},{"$f":"IF(Q15=\"\",\"\",VLOOKUP(Q15,条件类型查询!A:B,2,FALSE))","v":""},{"$nulls":5},"对话-功法灵气",null,10003]
[13,"10004",2,null,1,0,1,null,1001,10,{"$nulls":5},{"$f":"IF(Q16=\"\",\"\",VLOOKUP(Q16,条件类型查询!A:B,2,FALSE))","v":""},{"$nulls":5},"对话-法宝灵韵",null,10004]
[14,"10005",2,null,1,0,1,null,1001,10,{"$nulls":5},{"$f":"IF(Q17=\"\",\"\",VLOOKUP(Q17,条件类型查询!A:B,2,FALSE))","v":""},{"$nulls":5},"遇到怪物2-修为",null,10005]
[15,"10006",2,null,1,0,1,null,1001,10,{"$nulls":5},{"$f":"IF(Q18=\"\",\"\",VLOOKUP(Q18,条件类型查询!A:B,2,FALSE))","v":""},{"$nulls":5},"遇到怪物3-修为",null,10006]
[null,"",{"$nulls":13},{"$f":"IF(Q19=\"\",\"\",VLOOKUP(Q19,条件类型查询!A:B,2,FALSE))","v":""}]
[null,"",{"$nulls":13},{"$f":"IF(Q20=\"\",\"\",VLOOKUP(Q20,条件类型查询!A:B,2,FALSE))","v":""}]
[10001,"100001",4,1,1,10,1,null,1001,10,{"$nulls":5},{"$f":"IF(Q21=\"\",\"\",VLOOKUP(Q21,条件类型查询!A:B,2,FALSE))","v":""},null,null,null,1906,1914,"鲲鹏何在","    北冥有鱼，其名为鲲……不过北海遥远，何时能寻得鲲鹏的踪迹。\n    好在我的神识尚在，可探天地，再加上刚刚的风铃，或许能寻得前路线索。",100001]
[10002,"100002",4,1,1,10,1,null,1001,10,{"$nulls":5},{"$f":"IF(Q22=\"\",\"\",VLOOKUP(Q22,条件类型查询!A:B,2,FALSE))","v":""},null,null,null,1907,1915,"北海古径","神识探得北海方向，有一条古径，隐于云山之间。\n不过，古径深处妖气弥漫，有妖兽盘踞，需要破除后才能通过。\n鲲鹏的秘密，可能和这些妖兽有关。",100002]
[10003,"100003",4,1,1,10,1,null,1001,10,{"$nulls":5},{"$f":"IF(Q23=\"\",\"\",VLOOKUP(Q23,条件类型查询!A:B,2,FALSE))","v":""},null,null,null,1908,1916,"找到风灵珠","鲲鹏需要去南海最深处的天池，可缺少龙卷风，没有大风，大鹏无法飞起来",100003]
[10004,"100004",4,1,1,10,1,null,1001,10,{"$nulls":5},{"$f":"IF(Q24=\"\",\"\",VLOOKUP(Q24,条件类型查询!A:B,2,FALSE))","v":""},null,null,null,1909,1917,"找到风灵珠","需要达到境界",100004]
[]
[1001,{"$f":"_xlfn.TEXTJOIN(\";\",1,X26:AF26)","v":"1001;1002;1003;1004;1005"},99,4,1,10,1,null,1001,10,{"$nulls":9},1943,1944,"受伤的鸟","你发现一只奄奄一息的鸟，决定上前一探究竟。",1001,1002,1003,1004,1005]
[]
[20001,{"$f":"_xlfn.TEXTJOIN(\";\",1,X28:AF28)","v":"1001;1002;1003;1004;1005"},5,null,1,0,1,null,1001,10,{"$nulls":9},174,1936,"受伤的狼","你发现一只奄奄一息的狼，决定上前一探究竟。",1001,1002,1003,1004,1005]
[20002,{"$f":"_xlfn.TEXTJOIN(\";\",1,X29:AF29)","v":"1010;1011;1012;1013;1014;1015;1016"},5,null,1,0,1,null,1001,10,{"$nulls":5},{"$f":"IF(Q29=\"\",\"\",VLOOKUP(Q29,条件类型查询!A:B,2,FALSE))","v":""},null,null,null,175,1937,"鹬蚌相争","附近的小树林闹的不可开交，你决定去看看怎么回事。",1010,1011,1012,1013,1014,1015,1016]
[20003,"1001;1002;1003;1004;1005",5,null,1,0,1,null,1001,10,{"$nulls":9},1943,1944,"受伤的鸟","你发现一只奄奄一息的鸟，决定上前一探究竟。",1001,1002,1003,1004,1005]
[]
[9001,{"$f":"_xlfn.TEXTJOIN(\";\",1,X32:AF32)","v":"1001;1002;1003;1004;1005"},99,3,1,0,1,null,1001,10,{"$nulls":9},174,1936,"受伤的狼","你发现一只奄奄一息的狼，决定上前一探究竟。",1001,1002,1003,1004,1005]
[9002,{"$f":"_xlfn.TEXTJOIN(\";\",1,X33:AF33)","v":"1010;1011;1012;1013;1014;1015;1016"},99,3,1,0,1,null,1001,10,{"$nulls":5},{"$f":"IF(Q33=\"\",\"\",VLOOKUP(Q33,条件类型查询!A:B,2,FALSE))","v":""},null,null,null,175,1937,"鹬蚌相争","附近的小树林闹的不可开交，你决定去看看怎么回事。",1010,1011,1012,1013,1014,1015,1016]
[9003,"9003;9004;9005;9006;9007;9008",99,5,1,0,1,null,1001,10,{"$nulls":9},2035,2036,"幽谷剑鸣","你在闭关修炼时，感受到一股凌厉的剑意波动。深入探查，发现一名白衣剑修“清霜”盘坐于谷中，周围剑气环绕，正与一柄散发不祥气息的灵剑对峙。她似在参悟剑诀，却灵气不足，剑灵桀骜。",9003,9004,9005,9006,9007,9008]
[]
[]
[9025,"9025;9026",1,3,1,0,1,null,1001,10,{"$nulls":9},2067,2068,"惠子.没用的大葫芦","惠子种的葫芦没用，他非常生气"]
[]
[9014,9014,99,3,1,0,1,null,1001,10,9031,{"$nulls":8},2069,2070,"发现魔修","发现一群魔修，正在夺人钱财"]
[]
[9031,9031,99,3,1,0,1,null,1001,10,null,30,2,{"$nulls":6},2071,2072,"魔修","打败魔休"]

{"sheet":"EventLinkConfig","index":1,"n_rows":88,"n_cols":25,"rows_kept":88,"cut":false,"hidden":false,"merged":[]}
["ID","conciseEventMessage",null,"EventConditionMessage",null,"NPCID","LanID",null,"EventID",null,"ConditionId",null,"optionType","optionPara1","optionPara2",null,"PrizeIDs","PrizeNums","ResultType","ResultOptions"]
["int","int",null,"int",null,"int","int[]",null,"int",null,"int[]",null,"int","int[]","int[]",null,"int[]","int[]","int","int[]"]
[]
["条件ID","任务列表中的简洁描述","任务列表中的简洁描述","无任务目标时的补充文本","无任务目标时的补充文本","对话NPCID","对话","对话1","属于哪个事件","步骤","条件判断类型","条件判断内容","步骤类型\n1=提供选项\n2=进入战斗\n3=获得奖励\n4=扣除道具","事件常量1\n1=事件IDs\n2=战斗ID","事件常量2\n1=事件文本",null,"事件结局奖励","事件结局奖励数量","事件结束类型\n1：跳转步骤\n2：根据战斗结果跳转\n3.触发新事件","事件结局后提供的选项\n1.EventConditionId\n2.胜利id;失败id\n3.EventConfigId",null,"选择1","选择2"]
[100,216,{"$nulls":4},216,"你被怪物击败了，事件结束。"]
[]
[1001,177,null,null,null,2,177,"你遇到一只奄奄一息的野狼，从周围四散的血迹来看，想必它刚才经历了一场恶战。",{"$nulls":4},1,"1002;1003","198;199",{"$nulls":6},"趁它虚弱赶紧除掉它！","你不忍见它受苦，选择帮它减轻痛苦。"]
[1002,178,{"$nulls":4},178,"野狼用它最后一口气，朝你扑了过来！",{"$nulls":4},2,100001,{"$nulls":4},2,"1004;100"]
[1003,179,{"$nulls":4},179,"你抽出匕首准备了结它的生命，却发现怀中还躺着一只刚出生的狼崽。",{"$nulls":4},1,1005,200]
[1004,180,{"$nulls":4},180,"随着你的最后一击，野狼应声倒下，你罔顾它幽怨的眼神，从它怀中拿走了一些财物。",{"$nulls":4},3,null,null,null,1002,100]
[1005,181,{"$nulls":4},181,"母狼似乎懂你要做什么，眼神归于平静。你终结了她，决定收养这只小狼仔。",{"$nulls":4},3,null,null,null,1001,50]
[]
[1010,182,{"$nulls":4},182,"从不远处传来刀剑声，听起来双方已经精疲力尽了。",{"$nulls":4},1,"1011;1012","201;202",{"$nulls":6},"去看看","(需拥有法宝凝神珠）听起来都是鸡毛蒜皮的小摩擦，你选择祭出凝神珠化解他们的怨气。"]
[1011,183,{"$nulls":4},183,"你走进一看，原来是一伙山贼分赃不均内讧了起来。你看着旁边被砍的七零八落的轿子和这群山贼，选择怎么做呢：",{"$nulls":4},1,"1014;1015","203;204",{"$nulls":6},"你顿时杀心四起，决定杀了贼寇，救出轿中之人","盗贼们个个双眼杀的通红，你决定来个渔翁得利。"]
[1012,184,{"$nulls":4},"184;187","法宝现身，效果立竿见影，刀剑声逐渐消失，这个世界安静了。",{"$nulls":4},3,null,null,null,1001,10,{"$nulls":5},1,"1001;1"]
[1014,185,{"$nulls":4},185,"你怒斥贼寇的恶行，贼寇们被你激怒了，准备迎战！",{"$nulls":4},2,100002,{"$nulls":4},2,"1016;100",null,null,null,2,"4;150"]
[1015,186,{"$nulls":4},"186;189","你趁人不备顺走了轿内主人的包裹，任留轿内人痛苦的挣扎。",{"$nulls":4},3,null,null,null,1003,1000]
[1016,188,{"$nulls":4},188,"杀退贼寇，你上演了一出英雄救美的桥段。姑娘为了答谢你的救命之恩，将藏在贴身处的珍贵首饰赠与你作为定情信物。",{"$nulls":8},1001,200]
[]
[1020,190,{"$nulls":4},190,"从不远处传来刀剑声，听起来双方已经精疲力尽了。",{"$nulls":4},1,"1021;1022","201;202",{"$nulls":6},"去看看","使用法宝息事宁人"]
[1021,191,{"$nulls":4},191,"你走进一看，原来是一伙山贼抢了一名坐在官轿内的女子，因分赃不均内讧了起来。山贼二话不说就朝你冲了过来！",{"$nulls":4},2,100003,null,null,1002,100,2,"1026;100"]
[1022,192,{"$nulls":4},192,"法宝现身，效果立竿见影，刀剑声逐渐消失，这个世界安静了。",{"$nulls":4},4,null,null,null,1002,10,{"$nulls":5},1,"1001;1"]
[1024,193,{"$nulls":4},"193;196","你大声怒斥贼寇的恶行，贼首发现你了，准备迎战！",{"$nulls":4},2,100004,null,null,1004,100,2,"1016;100",null,null,null,2,"4;150"]
[1025,194,{"$nulls":4},"194;197","你趁人不备顺走了轿内主人的包裹，任留轿内人痛苦的挣扎。",{"$nulls":4},3,null,null,null,1002,1000]
[1026,207,{"$nulls":4},207,"你将山贼们打的落花流水，成功吸引了山贼头子的注意。",{"$nulls":4},1,"1024;1025","205;206",{"$nulls":6},"选择正面迎战山贼头领（困难）","你决定避开山贼头领的视线，来个渔翁得利。"]
[]
[1030,221,{"$nulls":4},221,"发现一个血迹斑斑的背包，好像刚刚发生了战斗，我翻翻背包...",{"$nulls":4},3,null,null,null,1002,10]
[]
[1040,222,{"$nulls":4},222,"啥也没有....除了钱",{"$nulls":4},3,null,null,null,1002,10]
[]
[1050,223,{"$nulls":4},223,"两夫妻在吵架，似乎为了一件大事..",{"$nulls":4},3,null,null,null,"1002;1001","10;20"]
[]
[1060,224,{"$nulls":4},224,"没有任何发现，但感觉空气很好....下次有空再来看看"]
[]
[]
[]
[10001,208,{"$nulls":4},208,"事件10001：一只[怪物1]袭击了你，准备迎战",{"$nulls":4},2,100001,{"$nulls":4},2,"10002;100"]
[10002,209,{"$nulls":4},209,"你击败了怪物，并从它身上吸取了一些修为",{"$nulls":4},3,null,null,null,1003,3000]
[]
[10003,210,{"$nulls":4},"210;211;1903","你偶遇一处仙气四溢无人生活的洞穴\n不知哪位高人在洞穴内壁留下绝世秘籍\n你仔细研读后，功法得到精进",{"$nulls":4},3,null,null,null,1005,500]
[]
[10004,212,{"$nulls":4},"212;213;214;215","你在飞行途中不慎滑倒\n原来是脚下有一块圆润的微微发光的石头\n你拾起来一看，原来它蕴含了丰富的法宝灵韵\n原本郁闷的心情，突然变的好了起来，哈哈~",{"$nulls":4},3,null,null,null,1006,500,null,null,null,1]
[]
[10005,1901,{"$nulls":4},1901,"事件10005：一只[怪物2]袭击了你，准备迎战",{"$nulls":4},2,100002,{"$nulls":4},2,"10002;100"]
[]
[10006,1902,{"$nulls":4},1902,"事件10006：一只[怪物3]袭击了你，准备迎战",{"$nulls":4},2,100003,{"$nulls":4},2,"10002;100"]
{"$rows_empty":12}
[9003,2036,{"$nulls":4},2036,"你在闭关修炼时，感受到一股凌厉的剑意波动。深入探查，发现一名白衣剑修“清霜”盘坐于谷中，周围剑气环绕，正与一柄散发不祥气息的灵剑对峙。她似在参悟剑诀，却灵气不足，剑灵桀骜。",{"$nulls":4},1,"9004;9006","2041;2042"]
[9004,2037,{"$nulls":4},2037,"你上前以剑意对抗剑灵",{"$nulls":4},2,100001,{"$nulls":4},2,"9005;100"]
[9005,2038,{"$nulls":4},2038,"成功压制剑灵，清霜赠你“霜华剑符”并结下道友之谊"]
[9006,2039,{"$nulls":4},2039,"你察觉谷中灵气匮乏，清霜剑意凝滞。神识探查得知，附近秘境可采集“玄冰花”"]
[9007,2040,{"$nulls":4},2040,"献上玄冰花，清霜炼化灵气突破瓶颈，赠你“玄霜剑意”",{"$nulls":4},4,{"$nulls":5},1,9007]
[9008,{"$nulls":11},3,null,null,null,1001,999]
[]
[]
[]
[9025,2074,null,2073,"和惠子交谈",null,2074,"惠子种的葫芦没用，他非常生气，需要打败魔休",{"$nulls":4},1,9026,2075]
[9026,{"$nulls":6},"选择后接新的事件",{"$nulls":10},3,9014,null,"接受任务"]
[]
[]
[9014,2070,null,null,"击杀魔休",{"$nulls":5},3]
[]
[]
[9031,2076,"出现Boss魔修",2077,"打败魔修",{"$nulls":7},2,100001]
[]
[{"$f":"I77*100+J77","v":1000101},2086,"使用风铃唤醒还未泯灭的神识",null,null,null,2083,"北冥有鱼，其名为鲲……",10001,{"$f":"IF(I77=I76,J76+1,1)","v":1},null,{"$f":"IF(K77=\"\",\"\",VLOOKUP(K77,EventConditionConfig!A:C,3,FALSE))","v":""},{"$nulls":6},1,{"$f":"A78","v":1000102}]
[{"$f":"I78*100+J78","v":1000102},2086,"使用风铃唤醒还未泯灭的神识",null,null,null,2084,"不过北海遥远，何时能寻得鲲鹏的踪迹。",10001,{"$f":"IF(I78=I77,J77+1,1)","v":2},null,{"$f":"IF(K78=\"\",\"\",VLOOKUP(K78,EventConditionConfig!A:C,3,FALSE))","v":""},{"$nulls":6},1,{"$f":"A79","v":1000103}]
[{"$f":"I79*100+J79","v":1000103},2086,"使用风铃唤醒还未泯灭的神识",null,null,null,2085,"好在我的神识尚在，可探天地，再加上刚刚的风铃，或许能寻得前路线索。",10001,3,null,{"$f":"IF(K79=\"\",\"\",VLOOKUP(K79,EventConditionConfig!A:C,3,FALSE))","v":""},{"$nulls":6},1,{"$f":"A80","v":1000104}]
[{"$f":"I80*100+J80","v":1000104},2086,"使用风铃唤醒还未泯灭的神识",{"$nulls":5},10001,4,5,{"$f":"IF(K80=\"\",\"\",VLOOKUP(K80,EventConditionConfig!A:C,3,FALSE))","v":"使用神识"},{"$nulls":6},3,10002]
[]
[{"$f":"I82*100+J82","v":1000201},2091,"前往妖兽盘踞的地方",null,null,null,2092,"神识发现有一条古径，隐于云山之间，不过似乎有妖兽盘踞。",10002,1,{"$nulls":8},1,{"$f":"A83","v":1000202}]
[{"$f":"I83*100+J83","v":1000202},2091,"前往妖兽盘踞的地方",null,null,null,2093,"没其他办法了，过去看看吧。",10002,2,{"$nulls":8},1,{"$f":"A84","v":1000203}]
[{"$f":"I84*100+J84","v":1000203},2091,"前往妖兽盘踞的地方",{"$nulls":5},10002,3,6,{"$f":"IF(K84=\"\",\"\",VLOOKUP(K84,EventConditionConfig!A:C,3,FALSE))","v":"继续飞行一段时间"},{"$nulls":6},3,10003]
[]
[1000301,2095,"蜩鸟和小麻雀对你的到来很好奇",null,null,null,2096,"应该就是这里了，似乎有古老的阵法挡住了去路",10003,1,{"$nulls":8},1,{"$f":"A88","v":1000303}]
[{"$f":"I87*100+J87","v":1000302},2095,"蜩鸟和小麻雀对你的到来很好奇",null,null,null,2096,"（结界门前，三只小鸟飞来，落在一旁古松上）",10003,2,{"$nulls":8},1,{"$f":"A89","v":0}]
[{"$f":"I88*100+J88","v":1000303},2095,"蜩鸟和小麻雀对你的到来很好奇",null,null,101,2096,"（拍翅）：“咦？又是妄图穿行北海之人？”",10003,{"$f":"IF(I88=I87,J87+1,1)","v":3},{"$nulls":8},1,{"$f":"A90","v":0}]

{"sheet":"EventConditionConfig","index":2,"n_rows":10,"n_cols":11,"rows_kept":10,"cut":false,"hidden":false,"merged":[]}
["ID","message",null,null,"Operation",null,"ConditionType","ConditionPara","finishCount"]
["int","int",null,null,"int",null,"int","int[]","int"]
[]
["ID","描述",null,null,"与0\n或1",null,"条件判断类型","条件判断值","条件完成次数or数量","提示","跳转"]
[1,2078,"拥有金币",{"$f":"CONCATENATE(C5,\"{0}/{1}\")","v":"拥有金币{0}/{1}"},null,null,1,1001,10]
[2,2079,"达到境界",{"$f":"CONCATENATE(C6,\"{0}/{1}\")","v":"达到境界{0}/{1}"},null,null,3,10,1]
[3,2080,"击杀魔休","击杀魔休{0}/{1}",null,null,5,100001,5]
[4,2081,"获得钻石","获得钻石{0}/{1}",null,null,6,1002,10]
[5,2082,"使用神识","使用神识{0}/{1}",null,null,8,null,1]
[6,2094,"继续飞行一段时间","继续飞行一段时间{0}/{1}",null,null,9,null,6]

{"sheet":"条件类型查询","index":3,"n_rows":9,"n_cols":7,"rows_kept":9,"cut":false,"hidden":false,"merged":[]}
["ID","条件判断类型","条件判断值","条件完成次数or数量","额外文本","不可用","是否可用于事件"]
[1,"拥有特定道具","道具ID","数量≥","检测背包道具",null,1]
[2,"灵根判定","哪个灵根","灵根值≥",null,1]
[3,"境界判断","境界id",null,null,null,1]
[5,"战斗胜利","战斗组ID","胜利次数≥"]
[6,"获得道具","道具的ID","数量≥","探测出事件才开始检测"]
[7,"触发概率","概率值 1000=100%",null,null,null,1]
[8,"使用神识",null,"数量≥"]
[9,"游戏在线多少时长（秒）",null,"时间≥（秒）",null,null,1]

{"sheet":"EventNPC","index":4,"n_rows":17,"n_cols":5,"rows_kept":17,"cut":false,"hidden":false,"merged":[]}
["ID","name","ID","DaoyouID"]
["int","int","int","int"]
[]
["ID","名字","半身像icon","道友ID","名称"]
[1,null,null,null,"玩家"]
[2,null,null,1,"道友1"]
[3,null,null,2,"道友2"]
[4,null,null,3,"道友3"]
[5,null,null,4,"道友4"]
[6,null,null,5,"道友5"]
[7,null,null,6,"道友6"]
[8,null,null,7,"道友7"]
[9,null,null,8,"道友8"]
[10,null,null,9,"道友9"]
[11,null,null,10,"道友10"]
[]
[101,null,null,null,"蜩鸟"]

{"sheet":"XianTuLogConfig","index":5,"n_rows":6,"n_cols":7,"rows_kept":6,"cut":false,"hidden":false,"merged":[]}
["ID","EventType","Title","Desc","BigMapID"]
["int","int","int","int","int"]
[]
["ID","1主线\n2事件","名称","描述","属于哪个章节"]
[1,1,2087,2089,null,"第一章.逍遥游","多次渡劫失败的你，误入“无何有之乡”，在这里受到了列子的指引，踏上了寻找七道心境的修仙之路。"]
[2,2,2088,2090,null,"无用的大葫芦","惠子种出了巨大葫芦，他觉得毫无用处，非常生气！"]