{"text_format":"2","workbook":"xlsx","n_sheets":7,"sheets":["语言配置表","LanguageChineseConfig","LanguageEnglishConfig","LanguageDEConfig","LanguageFRConfig","LanguageRUConfig","LanguageTHConfig"],"not_rendered":{"charts":0,"images":0,"macros":0,"external_links":0,"defined_names":2,"comments":0,"pivot_tables":0},"unopened":[],"bounds":{"document_bytes":16777216,"sheet_cells":100000,"run_cost":"one","rows_first":2000,"rows_last":500,"rows_between":2000,"halvings":0,"cell_chars":16384,"cell_head_chars":4096},"cells_cut":0,"cells_raw":0,"read":"whole","date_system":"1900"}

{"sheet":"语言配置表","index":0,"n_rows":33,"n_cols":7,"rows_kept":33,"cut":false,"hidden":false,"merged":[]}
["ID"]
["int","string"]
[{"$f":"SUBTOTAL(3,A5:A87059)","v":29}]
["序列","中文","英文描述","DE","FR","RU","TH"]
[1,"亚瑟·龙焰","Arthur Longyan"]
[2,"莱恩·天戟","Ryan Tianji"]
[3,"达米安·虎啸","Damian Huxiao"]
[4,"维克多·铁拳","Victor Tiequan"]
[5,"加雷斯·风暴","Gareth Fengbao"]
[6,"伊丽莎白·月影","Elizabeth Yueying"]
[7,"马修·星辰","Matthew Xingchen"]
[8,"卡特琳娜·霜语","Katrina Shuangyu"]
[9,"西蒙·玄光","Simon Xuanguang"]
[10,"艾琳娜·灵风","Elena Lingfeng"]
[11,"加百利·圣心","Gabriel Shengxin"]
[12,"索菲亚·慈恩","Sophia Cien"]
[13,"卢克·净魂","Luke Jinghun"]
[14,"安娜贝尔·光耀","Annabelle Guangyao"]
[15,"伊莎贝拉·恩典","Isabella Endian"]
[16,"莱恩·影踪","Liam Yingzong"]
[17,"艾米丽·翠羽","Emily Cuiyu"]
[18,"德里克·疾风","Derek Jifeng"]
[19,"维多利亚·夜刃","Victoria Yeren"]
[20,"诺亚·林踪","Noah Linzong"]
[21,"生命值"]
[22,"攻击力"]
[23,"防御力"]
[24,"攻击速度"]
[25,"暴击几率"]
[26,"暴击伤害"]
[27,"闪避几率"]
[28,"命中"]
[29,"吸血"]

{"sheet":"LanguageChineseConfig","index":1,"n_rows":192,"n_cols":2,"rows_kept":192,"cut":false,"hidden":false,"merged":[]}
["ID","txt"]
["int","string"]
[]
["ID","中文描述"]
[{"$f":"IF(语言配置表!A5=\"\",\"\",语言配置表!A5)","v":1},{"$f":"IF(语言配置表!A5=\"\",\"\",语言配置表!B5)","v":"亚瑟·龙焰"}]
[{"$f":"IF(语言配置表!A6=\"\",\"\",语言配置表!A6)","v":2},{"$f":"IF(语言配置表!A6=\"\",\"\",语言配置表!B6)","v":"莱恩·天戟"}]
[{"$f":"IF(语言配置表!A7=\"\",\"\",语言配置表!A7)","v":3},{"$f":"IF(语言配置表!A7=\"\",\"\",语言配置表!B7)","v":"达米安·虎啸"}]
[{"$f":"IF(语言配置表!A8=\"\",\"\",语言配置表!A8)","v":4},{"$f":"IF(语言配置表!A8=\"\",\"\",语言配置表!B8)","v":"维克多·铁拳"}]
[{"$f":"IF(语言配置表!A9=\"\",\"\",语言配置表!A9)","v":5},{"$f":"IF(语言配置表!A9=\"\",\"\",语言配置表!B9)","v":"加雷斯·风暴"}]
[{"$f":"IF(语言配置表!A10=\"\",\"\",语言配置表!A10)","v":6},{"$f":"IF(语言配置表!A10=\"\",\"\",语言配置表!B10)","v":"伊丽莎白·月影"}]
[{"$f":"IF(语言配置表!A11=\"\",\"\",语言配置表!A11)","v":7},{"$f":"IF(语言配置表!A11=\"\",\"\",语言配置表!B11)","v":"马修·星辰"}]
[{"$f":"IF(语言配置表!A12=\"\",\"\",语言配置表!A12)","v":8},{"$f":"IF(语言配置表!A12=\"\",\"\",语言配置表!B12)","v":"卡特琳娜·霜语"}]
[{"$f":"IF(语言配置表!A13=\"\",\"\",语言配置表!A13)","v":9},{"$f":"IF(语言配置表!A13=\"\",\"\",语言配置表!B13)","v":"西蒙·玄光"}]
[{"$f":"IF(语言配置表!A14=\"\",\"\",语言配置表!A14)","v":10},{"$f":"IF(语言配置表!A14=\"\",\"\",语言配置表!B14)","v":"艾琳娜·灵风"}]
[{"$f":"IF(语言配置表!A15=\"\",\"\",语言配置表!A15)","v":11},{"$f":"IF(语言配置表!A15=\"\",\"\",语言配置表!B15)","v":"加百利·圣心"}]
[{"$f":"IF(语言配置表!A16=\"\",\"\",语言配置表!A16)","v":12},{"$f":"IF(语言配置表!A16=\"\",\"\",语言配置表!B16)","v":"索菲亚·慈恩"}]
[{"$f":"IF(语言配置表!A17=\"\",\"\",语言配置表!A17)","v":13},{"$f":"IF(语言配置表!A17=\"\",\"\",语言配置表!B17)","v":"卢克·净魂"}]
[{"$f":"IF(语言配置表!A18=\"\",\"\",语言配置表!A18)","v":14},{"$f":"IF(语言配置表!A18=\"\",\"\",语言配置表!B18)","v":"安娜贝尔·光耀"}]
[{"$f":"IF(语言配置表!A19=\"\",\"\",语言配置表!A19)","v":15},{"$f":"IF(语言配置表!A19=\"\",\"\",语言配置表!B19)","v":"伊莎贝拉·恩典"}]
[{"$f":"IF(语言配置表!A20=\"\",\"\",语言配置表!A20)","v":16},{"$f":"IF(语言配置表!A20=\"\",\"\",语言配置表!B20)","v":"莱恩·影踪"}]
[{"$f":"IF(语言配置表!A21=\"\",\"\",语言配置表!A21)","v":17},{"$f":"IF(语言配置表!A21=\"\",\"\",语言配置表!B21)","v":"艾米丽·翠羽"}]
[{"$f":"IF(语言配置表!A22=\"\",\"\",语言配置表!A22)","v":18},{"$f":"IF(语言配置表!A22=\"\",\"\",语言配置表!B22)","v":"德里克·疾风"}]
[{"$f":"IF(语言配置表!A23=\"\",\"\",语言配置表!A23)","v":19},{"$f":"IF(语言配置表!A23=\"\",\"\",语言配置表!B23)","v":"维多利亚·夜刃"}]
[{"$f":"IF(语言配置表!A24=\"\",\"\",语言配置表!A24)","v":20},{"$f":"IF(语言配置表!A24=\"\",\"\",语言配置表!B24)","v":"诺亚·林踪"}]
[{"$f":"IF(语言配置表!A25=\"\",\"\",语言配置表!A25)","v":21},{"$f":"IF(语言配置表!A25=\"\",\"\",语言配置表!B25)","v":"生命值"}]
[{"$f":"IF(语言配置表!A26=\"\",\"\",语言配置表!A26)","v":22},{"$f":"IF(语言配置表!A26=\"\",\"\",语言配置表!B26)","v":"攻击力"}]
[{"$f":"IF(语言配置表!A27=\"\",\"\",语言配置表!A27)","v":23},{"$f":"IF(语言配置表!A27=\"\",\"\",语言配置表!B27)","v":"防御力"}]
[{"$f":"IF(语言配置表!A28=\"\",\"\",语言配置表!A28)","v":24},{"$f":"IF(语言配置表!A28=\"\",\"\",语言配置表!B28)","v":"攻击速度"}]
[{"$f":"IF(语言配置表!A29=\"\",\"\",语言配置表!A29)","v":25},{"$f":"IF(语言配置表!A29=\"\",\"\",语言配置表!B29)","v":"暴击几率"}]
[{"$f":"IF(语言配置表!A30=\"\",\"\",语言配置表!A30)","v":26},{"$f":"IF(语言配置表!A30=\"\",\"\",语言配置表!B30)","v":"暴击伤害"}]
[{"$f":"IF(语言配置表!A31=\"\",\"\",语言配置表!A31)","v":27},{"$f":"IF(语言配置表!A31=\"\",\"\",语言配置表!B31)","v":"闪避几率"}]
[{"$f":"IF(语言配置表!A32=\"\",\"\",语言配置表!A32)","v":28},{"$f":"IF(语言配置表!A32=\"\",\"\",语言配置表!B32)","v":"命中"}]
[{"$f":"IF(语言配置表!A33=\"\",\"\",语言配置表!A33)","v":29},{"$f":"IF(语言配置表!A33=\"\",\"\",语言配置表!B33)","v":"吸血"}]
[{"$f":"IF(语言配置表!A34=\"\",\"\",语言配置表!A34)","v":""},{"$f":"IF(语言配置表!A34=\"\",\"\",语言配置表!B34)","v":""}]
[{"$f":"IF(语言配置表!A35=\"\",\"\",语言配置表!A35)","v":""},{"$f":"IF(语言配置表!A35=\"\",\"\",语言配置表!B35)","v":""}]
[{"$f":"IF(语言配置表!A36=\"\",\"\",语言配置表!A36)","v":""},{"$f":"IF(语言配置表!A36=\"\",\"\",语言配置表!B36)","v":""}]
[{"$f":"IF(语言配置表!A37=\"\",\"\",语言配置表!A37)","v":""},{"$f":"IF(语言配置表!A37=\"\",\"\",语言配置表!B37)","v":""}]
[{"$f":"IF(语言配置表!A38=\"\",\"\",语言配置表!A38)","v":""},{"$f":"IF(语言配置表!A38=\"\",\"\",语言配置表!B38)","v":""}]
[{"$f":"IF(语言配置表!A39=\"\",\"\",语言配置表!A39)","v":""},{"$f":"IF(语言配置表!A39=\"\",\"\",语言配置表!B39)","v":""}]
[{"$f":"IF(语言配置表!A40=\"\",\"\",语言配置表!A40)","v":""},{"$f":"IF(语言配置表!A40=\"\",\"\",语言配置表!B40)","v":""}]
[{"$f":"IF(语言配置表!A41=\"\",\"\",语言配置表!A41)","v":""},{"$f":"IF(语言配置表!A41=\"\",\"\",语言配置表!B41)","v":""}]
[{"$f":"IF(语言配置表!A42=\"\",\"\",语言配置表!A42)","v":""},{"$f":"IF(语言配置表!A42=\"\",\"\",语言配置表!B42)","v":""}]
[{"$f":"IF(语言配置表!A43=\"\",\"\",语言配置表!A43)","v":""},{"$f":"IF(语言配置表!A43=\"\",\"\",语言配置表!B43)","v":""}]
[{"$f":"IF(语言配置表!A44=\"\",\"\",语言配置表!A44)","v":""},{"$f":"IF(语言配置表!A44=\"\",\"\",语言配置表!B44)","v":""}]
[{"$f":"IF(语言配置表!A45=\"\",\"\",语言配置表!A45)","v":""},{"$f":"IF(语言配置表!A45=\"\",\"\",语言配置表!B45)","v":""}]
[{"$f":"IF(语言配置表!A46=\"\",\"\",语言配置表!A46)","v":""},{"$f":"IF(语言配置表!A46=\"\",\"\",语言配置表!B46)","v":""}]
[{"$f":"IF(语言配置表!A47=\"\",\"\",语言配置表!A47)","v":""},{"$f":"IF(语言配置表!A47=\"\",\"\",语言配置表!B47)","v":""}]
[{"$f":"IF(语言配置表!A48=\"\",\"\",语言配置表!A48)","v":""},{"$f":"IF(语言配置表!A48=\"\",\"\",语言配置表!B48)","v":""}]
[{"$f":"IF(语言配置表!A49=\"\",\"\",语言配置表!A49)","v":""},{"$f":"IF(语言配置表!A49=\"\",\"\",语言配置表!B49)","v":""}]
[{"$f":"IF(语言配置表!A50=\"\",\"\",语言配置表!A50)","v":""},{"$f":"IF(语言配置表!A50=\"\",\"\",语言配置表!B50)","v":""}]
[{"$f":"IF(语言配置表!A51=\"\",\"\",语言配置表!A51)","v":""},{"$f":"IF(语言配置表!A51=\"\",\"\",语言配置表!B51)","v":""}]
[{"$f":"IF(语言配置表!A52=\"\",\"\",语言配置表!A52)","v":""},{"$f":"IF(语言配置表!A52=\"\",\"\",语言配置表!B52)","v":""}]
[{"$f":"IF(语言配置表!A53=\"\",\"\",语言配置表!A53)","v":""},{"$f":"IF(语言配置表!A53=\"\",\"\",语言配置表!B53)","v":""}]
[{"$f":"IF(语言配置表!A54=\"\",\"\",语言配置表!A54)","v":""},{"$f":"IF(语言配置表!A54=\"\",\"\",语言配置表!B54)","v":""}]
[{"$f":"IF(语言配置表!A55=\"\",\"\",语言配置表!A55)","v":""},{"$f":"IF(语言配置表!A55=\"\",\"\",语言配置表!B55)","v":""}]
[{"$f":"IF(语言配置表!A56=\"\",\"\",语言配置表!A56)","v":""},{"$f":"IF(语言配置表!A56=\"\",\"\",语言配置表!B56)","v":""}]
[{"$f":"IF(语言配置表!A57=\"\",\"\",语言配置表!A57)","v":""},{"$f":"IF(语言配置表!A57=\"\",\"\",语言配置表!B57)","v":""}]
[{"$f":"IF(语言配置表!A58=\"\",\"\",语言配置表!A58)","v":""},{"$f":"IF(语言配置表!A58=\"\",\"\",语言配置表!B58)","v":""}]
[{"$f":"IF(语言配置表!A59=\"\",\"\",语言配置表!A59)","v":""},{"$f":"IF(语言配置表!A59=\"\",\"\",语言配置表!B59)","v":""}]
[{"$f":"IF(语言配置表!A60=\"\",\"\",语言配置表!A60)","v":""},{"$f":"IF(语言配置表!A60=\"\",\"\",语言配置表!B60)","v":""}]
[{"$f":"IF(语言配置表!A61=\"\",\"\",语言配置表!A61)","v":""},{"$f":"IF(语言配置表!A61=\"\",\"\",语言配置表!B61)","v":""}]
[{"$f":"IF(语言配置表!A62=\"\",\"\",语言配置表!A62)","v":""},{"$f":"IF(语言配置表!A62=\"\",\"\",语言配置表!B62)","v":""}]
[{"$f":"IF(语言配置表!A63=\"\",\"\",语言配置表!A63)","v":""},{"$f":"IF(语言配置表!A63=\"\",\"\",语言配置表!B63)","v":""}]
[{"$f":"IF(语言配置表!A64=\"\",\"\",语言配置表!A64)","v":""},{"$f":"IF(语言配置表!A64=\"\",\"\",语言配置表!B64)","v":""}]
[{"$f":"IF(语言配置表!A65=\"\",\"\",语言配置表!A65)","v":""},{"$f":"IF(语言配置表!A65=\"\",\"\",语言配置表!B65)","v":""}]
[{"$f":"IF(语言配置表!A66=\"\",\"\",语言配置表!A66)","v":""},{"$f":"IF(语言配置表!A66=\"\",\"\",语言配置表!B66)","v":""}]
[{"$f":"IF(语言配置表!A67=\"\",\"\",语言配置表!A67)","v":""},{"$f":"IF(语言配置表!A67=\"\",\"\",语言配置表!B67)","v":""}]
[{"$f":"IF(语言配置表!A68=\"\",\"\",语言配置表!A68)","v":""},{"$f":"IF(语言配置表!A68=\"\",\"\",语言配置表!B68)","v":""}]
[{"$f":"IF(语言配置表!A69=\"\",\"\",语言配置表!A69)","v":""},{"$f":"IF(语言配置表!A69=\"\",\"\",语言配置表!B69)","v":""}]
[{"$f":"IF(语言配置表!A70=\"\",\"\",语言配置表!A70)","v":""},{"$f":"IF(语言配置表!A70=\"\",\"\",语言配置表!B70)","v":""}]
[{"$f":"IF(语言配置表!A71=\"\",\"\",语言配置表!A71)","v":""},{"$f":"IF(语言配置表!A71=\"\",\"\",语言配置表!B71)","v":""}]
[{"$f":"IF(语言配置表!A72=\"\",\"\",语言配置表!A72)","v":""},{"$f":"IF(语言配置表!A72=\"\",\"\",语言配置表!B72)","v":""}]
[{"$f":"IF(语言配置表!A73=\"\",\"\",语言配置表!A73)","v":""},{"$f":"IF(语言配置表!A73=\"\",\"\",语言配置表!B73)","v":""}]
[{"$f":"IF(语言配置表!A74=\"\",\"\",语言配置表!A74)","v":""},{"$f":"IF(语言配置表!A74=\"\",\"\",语言配置表!B74)","v":""}]
[{"$f":"IF(语言配置表!A75=\"\",\"\",语言配置表!A75)","v":""},{"$f":"IF(语言配置表!A75=\"\",\"\",语言配置表!B75)","v":""}]
[{"$f":"IF(语言配置表!A76=\"\",\"\",语言配置表!A76)","v":""},{"$f":"IF(语言配置表!A76=\"\",\"\",语言配置表!B76)","v":""}]
[{"$f":"IF(语言配置表!A77=\"\",\"\",语言配置表!A77)","v":""},{"$f":"IF(语言配置表!A77=\"\",\"\",语言配置表!B77)","v":""}]
[{"$f":"IF(语言配置表!A78=\"\",\"\",语言配置表!A78)","v":""},{"$f":"IF(语言配置表!A78=\"\",\"\",语言配置表!B78)","v":""}]
[{"$f":"IF(语言配置表!A79=\"\",\"\",语言配置表!A79)","v":""},{"$f":"IF(语言配置表!A79=\"\",\"\",语言配置表!B79)","v":""}]
[{"$f":"IF(语言配置表!A80=\"\",\"\",语言配置表!A80)","v":""},{"$f":"IF(语言配置表!A80=\"\",\"\",语言配置表!B80)","v":""}]
[{"$f":"IF(语言配置表!A81=\"\",\"\",语言配置表!A81)","v":""},{"$f":"IF(语言配置表!A81=\"\",\"\",语言配置表!B81)","v":""}]
[{"$f":"IF(语言配置表!A82=\"\",\"\",语言配置表!A82)","v":""},{"$f":"IF(语言配置表!A82=\"\",\"\",语言配置表!B82)","v":""}]
[{"$f":"IF(语言配置表!A83=\"\",\"\",语言配置表!A83)","v":""},{"$f":"IF(语言配置表!A83=\"\",\"\",语言配置表!B83)","v":""}]
[{"$f":"IF(语言配置表!A84=\"\",\"\",语言配置表!A84)","v":""},{"$f":"IF(语言配置表!A84=\"\",\"\",语言配置表!B84)","v":""}]
[{"$f":"IF(语言配置表!A85=\"\",\"\",语言配置表!A85)","v":""},{"$f":"IF(语言配置表!A85=\"\",\"\",语言配置表!B85)","v":""}]
[{"$f":"IF(语言配置表!A86=\"\",\"\",语言配置表!A86)","v":""},{"$f":"IF(语言配置表!A86=\"\",\"\",语言配置表!B86)","v":""}]
[{"$f":"IF(语言配置表!A87=\"\",\"\",语言配置表!A87)","v":""},{"$f":"IF(语言配置表!A87=\"\",\"\",语言配置表!B87)","v":""}]
[{"$f":"IF(语言配置表!A88=\"\",\"\",语言配置表!A88)","v":""},{"$f":"IF(语言配置表!A88=\"\",\"\",语言配置表!B88)","v":""}]
[{"$f":"IF(语言配置表!A89=\"\",\"\",语言配置表!A89)","v":""},{"$f":"IF(语言配置表!A89=\"\",\"\",语言配置表!B89)","v":""}]
[{"$f":"IF(语言配置表!A90=\"\",\"\",语言配置表!A90)","v":""},{"$f":"IF(语言配置表!A90=\"\",\"\",语言配置表!B90)","v":""}]
[{"$f":"IF(语言配置表!A91=\"\",\"\",语言配置表!A91)","v":""},{"$f":"IF(语言配置表!A91=\"\",\"\",语言配置表!B91)","v":""}]
[{"$f":"IF(语言配置表!A92=\"\",\"\",语言配置表!A92)","v":""},{"$f":"IF(语言配置表!A92=\"\",\"\",语言配置表!B92)","v":""}]
[{"$f":"IF(语言配置表!A93=\"\",\"\",语言配置表!A93)","v":""},{"$f":"IF(语言配置表!A93=\"\",\"\",语言配置表!B93)","v":""}]
[{"$f":"IF(语言配置表!A94=\"\",\"\",语言配置表!A94)","v":""},{"$f":"IF(语言配置表!A94=\"\",\"\",语言配置表!B94)","v":""}]
[{"$f":"IF(语言配置表!A95=\"\",\"\",语言配置表!A95)","v":""},{"$f":"IF(语言配置表!A95=\"\",\"\",语言配置表!B95)","v":""}]
[{"$f":"IF(语言配置表!A96=\"\",\"\",语言配置表!A96)","v":""},{"$f":"IF(语言配置表!A96=\"\",\"\",语言配置表!B96)","v":""}]
[{"$f":"IF(语言配置表!A97=\"\",\"\",语言配置表!A97)","v":""},{"$f":"IF(语言配置表!A97=\"\",\"\",语言配置表!B97)","v":""}]
[{"$f":"IF(语言配置表!A98=\"\",\"\",语言配置表!A98)","v":""},{"$f":"IF(语言配置表!A98=\"\",\"\",语言配置表!B98)","v":""}]
[{"$f":"IF(语言配置表!A99=\"\",\"\",语言配置表!A99)","v":""},{"$f":"IF(语言配置表!A99=\"\",\"\",语言配置表!B99)","v":""}]
[{"$f":"IF(语言配置表!A100=\"\",\"\",语言配置表!A100)","v":""},{"$f":"IF(语言配置表!A100=\"\",\"\",语言配置表!B100)","v":""}]
[{"$f":"IF(语言配置表!A101=\"\",\"\",语言配置表!A101)","v":""},{"$f":"IF(语言配置表!A101=\"\",\"\",语言配置表!B101)","v":""}]
[{"$f":"IF(语言配置表!A102=\"\",\"\",语言配置表!A102)","v":""},{"$f":"IF(语言配置表!A102=\"\",\"\",语言配置表!B102)","v":""}]
[{"$f":"IF(语言配置表!A103=\"\",\"\",语言配置表!A103)","v":""},{"$f":"IF(语言配置表!A103=\"\",\"\",语言配置表!B103)","v":""}]
[{"$f":"IF(语言配置表!A104=\"\",\"\",语言配置表!A104)","v":""},{"$f":"IF(语言配置表!A104=\"\",\"\",语言配置表!B104)","v":""}]
[{"$f":"IF(语言配置表!A105=\"\",\"\",语言配置表!A105)","v":""},{"$f":"IF(语言配置表!A105=\"\",\"\",语言配置表!B105)","v":""}]
[{"$f":"IF(语言配置表!A106=\"\",\"\",语言配置表!A106)","v":""},{"$f":"IF(语言配置表!A106=\"\",\"\",语言配置表!B106)","v":""}]
[{"$f":"IF(语言配置表!A107=\"\",\"\",语言配置表!A107)","v":""},{"$f":"IF(语言配置表!A107=\"\",\"\",语言配置表!B107)","v":""}]
[{"$f":"IF(语言配置表!A108=\"\",\"\",语言配置表!A108)","v":""},{"$f":"IF(语言配置表!A108=\"\",\"\",语言配置表!B108)","v":""}]
[{"$f":"IF(语言配置表!A109=\"\",\"\",语言配置表!A109)","v":""},{"$f":"IF(语言配置表!A109=\"\",\"\",语言配置表!B109)","v":""}]
[{"$f":"IF(语言配置表!A110=\"\",\"\",语言配置表!A110)","v":""},{"$f":"IF(语言配置表!A110=\"\",\"\",语言配置表!B110)","v":""}]
[{"$f":"IF(语言配置表!A111=\"\",\"\",语言配置表!A111)","v":""},{"$f":"IF(语言配置表!A111=\"\",\"\",语言配置表!B111)","v":""}]
[{"$f":"IF(语言配置表!A112=\"\",\"\",语言配置表!A112)","v":""},{"$f":"IF(语言配置表!A112=\"\",\"\",语言配置表!B112)","v":""}]
[{"$f":"IF(语言配置表!A113=\"\",\"\",语言配置表!A113)","v":""},{"$f":"IF(语言配置表!A113=\"\",\"\",语言配置表!B113)","v":""}]
[{"$f":"IF(语言配置表!A114=\"\",\"\",语言配置表!A114)","v":""},{"$f":"IF(语言配置表!A114=\"\",\"\",语言配置表!B114)","v":""}]
[{"$f":"IF(语言配置表!A115=\"\",\"\",语言配置表!A115)","v":""},{"$f":"IF(语言配置表!A115=\"\",\"\",语言配置表!B115)","v":""}]
[{"$f":"IF(语言配置表!A116=\"\",\"\",语言配置表!A116)","v":""},{"$f":"IF(语言配置表!A116=\"\",\"\",语言配置表!B116)","v":""}]
[{"$f":"IF(语言配置表!A117=\"\",\"\",语言配置表!A117)","v":""},{"$f":"IF(语言配置表!A117=\"\",\"\",语言配置表!B117)","v":""}]
[{"$f":"IF(语言配置表!A118=\"\",\"\",语言配置表!A118)","v":""},{"$f":"IF(语言配置表!A118=\"\",\"\",语言配置表!B118)","v":""}]
[{"$f":"IF(语言配置表!A119=\"\",\"\",语言配置表!A119)","v":""},{"$f":"IF(语言配置表!A119=\"\",\"\",语言配置表!B119)","v":""}]
[{"$f":"IF(语言配置表!A120=\"\",\"\",语言配置表!A120)","v":""},{"$f":"IF(语言配置表!A120=\"\",\"\",语言配置表!B120)","v":""}]
[{"$f":"IF(语言配置表!A121=\"\",\"\",语言配置表!A121)","v":""},{"$f":"IF(语言配置表!A121=\"\",\"\",语言配置表!B121)","v":""}]
[{"$f":"IF(语言配置表!A122=\"\",\"\",语言配置表!A122)","v":""},{"$f":"IF(语言配置表!A122=\"\",\"\",语言配置表!B122)","v":""}]
[{"$f":"IF(语言配置表!A123=\"\",\"\",语言配置表!A123)","v":""},{"$f":"IF(语言配置表!A123=\"\",\"\",语言配置表!B123)","v":""}]
[{"$f":"IF(语言配置表!A124=\"\",\"\",语言配置表!A124)","v":""},{"$f":"IF(语言配置表!A124=\"\",\"\",语言配置表!B124)","v":""}]
[{"$f":"IF(语言配置表!A125=\"\",\"\",语言配置表!A125)","v":""},{"$f":"IF(语言配置表!A125=\"\",\"\",语言配置表!B125)","v":""}]
[{"$f":"IF(语言配置表!A126=\"\",\"\",语言配置表!A126)","v":""},{"$f":"IF(语言配置表!A126=\"\",\"\",语言配置表!B126)","v":""}]
[{"$f":"IF(语言配置表!A127=\"\",\"\",语言配置表!A127)","v":""},{"$f":"IF(语言配置表!A127=\"\",\"\",语言配置表!B127)","v":""}]
[{"$f":"IF(语言配置表!A128=\"\",\"\",语言配置表!A128)","v":""},{"$f":"IF(语言配置表!A128=\"\",\"\",语言配置表!B128)","v":""}]
[{"$f":"IF(语言配置表!A129=\"\",\"\",语言配置表!A129)","v":""},{"$f":"IF(语言配置表!A129=\"\",\"\",语言配置表!B129)","v":""}]
[{"$f":"IF(语言配置表!A130=\"\",\"\",语言配置表!A130)","v":""},{"$f":"IF(语言配置表!A130=\"\",\"\",语言配置表!B130)","v":""}]
[{"$f":"IF(语言配置表!A131=\"\",\"\",语言配置表!A131)","v":""},{"$f":"IF(语言配置表!A131=\"\",\"\",语言配置表!B131)","v":""}]
[{"$f":"IF(语言配置表!A132=\"\",\"\",语言配置表!A132)","v":""},{"$f":"IF(语言配置表!A132=\"\",\"\",语言配置表!B132)","v":""}]
[{"$f":"IF(语言配置表!A133=\"\",\"\",语言配置表!A133)","v":""},{"$f":"IF(语言配置表!A133=\"\",\"\",语言配置表!B133)","v":""}]
[{"$f":"IF(语言配置表!A134=\"\",\"\",语言配置表!A134)","v":""},{"$f":"IF(语言配置表!A134=\"\",\"\",语言配置表!B134)","v":""}]
[{"$f":"IF(语言配置表!A135=\"\",\"\",语言配置表!A135)","v":""},{"$f":"IF(语言配置表!A135=\"\",\"\",语言配置表!B135)","v":""}]
[{"$f":"IF(语言配置表!A136=\"\",\"\",语言配置表!A136)","v":""},{"$f":"IF(语言配置表!A136=\"\",\"\",语言配置表!B136)","v":""}]
[{"$f":"IF(语言配置表!A137=\"\",\"\",语言配置表!A137)","v":""},{"$f":"IF(语言配置表!A137=\"\",\"\",语言配置表!B137)","v":""}]
[{"$f":"IF(语言配置表!A138=\"\",\"\",语言配置表!A138)","v":""},{"$f":"IF(语言配置表!A138=\"\",\"\",语言配置表!B138)","v":""}]
[{"$f":"IF(语言配置表!A139=\"\",\"\",语言配置表!A139)","v":""},{"$f":"IF(语言配置表!A139=\"\",\"\",语言配置表!B139)","v":""}]
[{"$f":"IF(语言配置表!A140=\"\",\"\",语言配置表!A140)","v":""},{"$f":"IF(语言配置表!A140=\"\",\"\",语言配置表!B140)","v":""}]
[{"$f":"IF(语言配置表!A141=\"\",\"\",语言配置表!A141)","v":""},{"$f":"IF(语言配置表!A141=\"\",\"\",语言配置表!B141)","v":""}]
[{"$f":"IF(语言配置表!A142=\"\",\"\",语言配置表!A142)","v":""},{"$f":"IF(语言配置表!A142=\"\",\"\",语言配置表!B142)","v":""}]
[{"$f":"IF(语言配置表!A143=\"\",\"\",语言配置表!A143)","v":""},{"$f":"IF(语言配置表!A143=\"\",\"\",语言配置表!B143)","v":""}]
[{"$f":"IF(语言配置表!A144=\"\",\"\",语言配置表!A144)","v":""},{"$f":"IF(语言配置表!A144=\"\",\"\",语言配置表!B144)","v":""}]
[{"$f":"IF(语言配置表!A145=\"\",\"\",语言配置表!A145)","v":""},{"$f":"IF(语言配置表!A145=\"\",\"\",语言配置表!B145)","v":""}]
[{"$f":"IF(语言配置表!A146=\"\",\"\",语言配置表!A146)","v":""},{"$f":"IF(语言配置表!A146=\"\",\"\",语言配置表!B146)","v":""}]
[{"$f":"IF(语言配置表!A147=\"\",\"\",语言配置表!A147)","v":""},{"$f":"IF(语言配置表!A147=\"\",\"\",语言配置表!B147)","v":""}]
[{"$f":"IF(语言配置表!A148=\"\",\"\",语言配置表!A148)","v":""},{"$f":"IF(语言配置表!A148=\"\",\"\",语言配置表!B148)","v":""}]
[{"$f":"IF(语言配置表!A149=\"\",\"\",语言配置表!A149)","v":""},{"$f":"IF(语言配置表!A149=\"\",\"\",语言配置表!B149)","v":""}]
[{"$f":"IF(语言配置表!A150=\"\",\"\",语言配置表!A150)","v":""},{"$f":"IF(语言配置表!A150=\"\",\"\",语言配置表!B150)","v":""}]
[{"$f":"IF(语言配置表!A151=\"\",\"\",语言配置表!A151)","v":""},{"$f":"IF(语言配置表!A151=\"\",\"\",语言配置表!B151)","v":""}]
[{"$f":"IF(语言配置表!A152=\"\",\"\",语言配置表!A152)","v":""},{"$f":"IF(语言配置表!A152=\"\",\"\",语言配置表!B152)","v":""}]
[{"$f":"IF(语言配置表!A153=\"\",\"\",语言配置表!A153)","v":""},{"$f":"IF(语言配置表!A153=\"\",\"\",语言配置表!B153)","v":""}]
[{"$f":"IF(语言配置表!A154=\"\",\"\",语言配置表!A154)","v":""},{"$f":"IF(语言配置表!A154=\"\",\"\",语言配置表!B154)","v":""}]
[{"$f":"IF(语言配置表!A155=\"\",\"\",语言配置表!A155)","v":""},{"$f":"IF(语言配置表!A155=\"\",\"\",语言配置表!B155)","v":""}]
[{"$f":"IF(语言配置表!A156=\"\",\"\",语言配置表!A156)","v":""},{"$f":"IF(语言配置表!A156=\"\",\"\",语言配置表!B156)","v":""}]
[{"$f":"IF(语言配置表!A157=\"\",\"\",语言配置表!A157)","v":""},{"$f":"IF(语言配置表!A157=\"\",\"\",语言配置表!B157)","v":""}]
[{"$f":"IF(语言配置表!A158=\"\",\"\",语言配置表!A158)","v":""},{"$f":"IF(语言配置表!A158=\"\",\"\",语言配置表!B158)","v":""}]
[{"$f":"IF(语言配置表!A159=\"\",\"\",语言配置表!A159)","v":""},{"$f":"IF(语言配置表!A159=\"\",\"\",语言配置表!B159)","v":""}]
[{"$f":"IF(语言配置表!A160=\"\",\"\",语言配置表!A160)","v":""},{"$f":"IF(语言配置表!A160=\"\",\"\",语言配置表!B160)","v":""}]
[{"$f":"IF(语言配置表!A161=\"\",\"\",语言配置表!A161)","v":""},{"$f":"IF(语言配置表!A161=\"\",\"\",语言配置表!B161)","v":""}]
[{"$f":"IF(语言配置表!A162=\"\",\"\",语言配置表!A162)","v":""},{"$f":"IF(语言配置表!A162=\"\",\"\",语言配置表!B162)","v":""}]
[{"$f":"IF(语言配置表!A163=\"\",\"\",语言配置表!A163)","v":""},{"$f":"IF(语言配置表!A163=\"\",\"\",语言配置表!B163)","v":""}]
[{"$f":"IF(语言配置表!A164=\"\",\"\",语言配置表!A164)","v":""},{"$f":"IF(语言配置表!A164=\"\",\"\",语言配置表!B164)","v":""}]
[{"$f":"IF(语言配置表!A165=\"\",\"\",语言配置表!A165)","v":""},{"$f":"IF(语言配置表!A165=\"\",\"\",语言配置表!B165)","v":""}]
[{"$f":"IF(语言配置表!A166=\"\",\"\",语言配置表!A166)","v":""},{"$f":"IF(语言配置表!A166=\"\",\"\",语言配置表!B166)","v":""}]
[{"$f":"IF(语言配置表!A167=\"\",\"\",语言配置表!A167)","v":""},{"$f":"IF(语言配置表!A167=\"\",\"\",语言配置表!B167)","v":""}]
[{"$f":"IF(语言配置表!A168=\"\",\"\",语言配置表!A168)","v":""},{"$f":"IF(语言配置表!A168=\"\",\"\",语言配置表!B168)","v":""}]
[{"$f":"IF(语言配置表!A169=\"\",\"\",语言配置表!A169)","v":""},{"$f":"IF(语言配置表!A169=\"\",\"\",语言配置表!B169)","v":""}]
[{"$f":"IF(语言配置表!A170=\"\",\"\",语言配置表!A170)","v":""},{"$f":"IF(语言配置表!A170=\"\",\"\",语言配置表!B170)","v":""}]
[{"$f":"IF(语言配置表!A171=\"\",\"\",语言配置表!A171)","v":""},{"$f":"IF(语言配置表!A171=\"\",\"\",语言配置表!B171)","v":""}]
[{"$f":"IF(语言配置表!A172=\"\",\"\",语言配置表!A172)","v":""},{"$f":"IF(语言配置表!A172=\"\",\"\",语言配置表!B172)","v":""}]
[{"$f":"IF(语言配置表!A173=\"\",\"\",语言配置表!A173)","v":""},{"$f":"IF(语言配置表!A173=\"\",\"\",语言配置表!B173)","v":""}]
[{"$f":"IF(语言配置表!A174=\"\",\"\",语言配置表!A174)","v":""},{"$f":"IF(语言配置表!A174=\"\",\"\",语言配置表!B174)","v":""}]
[{"$f":"IF(语言配置表!A175=\"\",\"\",语言配置表!A175)","v":""},{"$f":"IF(语言配置表!A175=\"\",\"\",语言配置表!B175)","v":""}]
[{"$f":"IF(语言配置表!A176=\"\",\"\",语言配置表!A176)","v":""},{"$f":"IF(语言配置表!A176=\"\",\"\",语言配置表!B176)","v":""}]
[{"$f":"IF(语言配置表!A177=\"\",\"\",语言配置表!A177)","v":""},{"$f":"IF(语言配置表!A177=\"\",\"\",语言配置表!B177)","v":""}]
[{"$f":"IF(语言配置表!A178=\"\",\"\",语言配置表!A178)","v":""},{"$f":"IF(语言配置表!A178=\"\",\"\",语言配置表!B178)","v":""}]
[{"$f":"IF(语言配置表!A179=\"\",\"\",语言配置表!A179)","v":""},{"$f":"IF(语言配置表!A179=\"\",\"\",语言配置表!B179)","v":""}]
[{"$f":"IF(语言配置表!A180=\"\",\"\",语言配置表!A180)","v":""},{"$f":"IF(语言配置表!A180=\"\",\"\",语言配置表!B180)","v":""}]
[{"$f":"IF(语言配置表!A181=\"\",\"\",语言配置表!A181)","v":""},{"$f":"IF(语言配置表!A181=\"\",\"\",语言配置表!B181)","v":""}]
[{"$f":"IF(语言配置表!A182=\"\",\"\",语言配置表!A182)","v":""},{"$f":"IF(语言配置表!A182=\"\",\"\",语言配置表!B182)","v":""}]
[{"$f":"IF(语言配置表!A183=\"\",\"\",语言配置表!A183)","v":""},{"$f":"IF(语言配置表!A183=\"\",\"\",语言配置表!B183)","v":""}]
[{"$f":"IF(语言配置表!A184=\"\",\"\",语言配置表!A184)","v":""},{"$f":"IF(语言配置表!A184=\"\",\"\",语言配置表!B184)","v":""}]
[{"$f":"IF(语言配置表!A185=\"\",\"\",语言配置表!A185)","v":""},{"$f":"IF(语言配置表!A185=\"\",\"\",语言配置表!B185)","v":""}]
[{"$f":"IF(语言配置表!A186=\"\",\"\",语言配置表!A186)","v":""},{"$f":"IF(语言配置表!A186=\"\",\"\",语言配置表!B186)","v":""}]
[{"$f":"IF(语言配置表!A187=\"\",\"\",语言配置表!A187)","v":""},{"$f":"IF(语言配置表!A187=\"\",\"\",语言配置表!B187)","v":""}]
[{"$f":"IF(语言配置表!A188=\"\",\"\",语言配置表!A188)","v":""},{"$f":"IF(语言配置表!A188=\"\",\"\",语言配置表!B188)","v":""}]
[{"$f":"IF(语言配置表!A189=\"\",\"\",语言配置表!A189)","v":""},{"$f":"IF(语言配置表!A189=\"\",\"\",语言配置表!B189)","v":""}]
[{"$f":"IF(语言配置表!A190=\"\",\"\",语言配置表!A190)","v":""},{"$f":"IF(语言配置表!A190=\"\",\"\",语言配置表!B190)","v":""}]
[{"$f":"IF(语言配置表!A191=\"\",\"\",语言配置表!A191)","v":""},{"$f":"IF(语言配置表!A191=\"\",\"\",语言配置表!B191)","v":""}]
[{"$f":"IF(语言配置表!A192=\"\",\"\",语言配置表!A192)","v":""},{"$f":"IF(语言配置表!A192=\"\",\"\",语言配置表!B192)","v":""}]

{"sheet":"LanguageEnglishConfig","index":2,"n_rows":214,"n_cols":2,"rows_kept":214,"cut":false,"hidden":false,"merged":[]}
["ID","txt"]
["int","string"]
[]
["ID","英文描述"]
[{"$f":"IF(语言配置表!A5=\"\",\"\",语言配置表!A5)","v":1},{"$f":"IF(语言配置表!A5=\"\",\"\",语言配置表!C5)","v":"Arthur Longyan"}]
[{"$f":"IF(语言配置表!A6=\"\",\"\",语言配置表!A6)","v":2},{"$f":"IF(语言配置表!A6=\"\",\"\",语言配置表!C6)","v":"Ryan Tianji"}]
[{"$f":"IF(语言配置表!A7=\"\",\"\",语言配置表!A7)","v":3},{"$f":"IF(语言配置表!A7=\"\",\"\",语言配置表!C7)","v":"Damian Huxiao"}]
[{"$f":"IF(语言配置表!A8=\"\",\"\",语言配置表!A8)","v":4},{"$f":"IF(语言配置表!A8=\"\",\"\",语言配置表!C8)","v":"Victor Tiequan"}]
[{"$f":"IF(语言配置表!A9=\"\",\"\",语言配置表!A9)","v":5},{"$f":"IF(语言配置表!A9=\"\",\"\",语言配置表!C9)","v":"Gareth Fengbao"}]
[{"$f":"IF(语言配置表!A10=\"\",\"\",语言配置表!A10)","v":6},{"$f":"IF(语言配置表!A10=\"\",\"\",语言配置表!C10)","v":"Elizabeth Yueying"}]
[{"$f":"IF(语言配置表!A11=\"\",\"\",语言配置表!A11)","v":7},{"$f":"IF(语言配置表!A11=\"\",\"\",语言配置表!C11)","v":"Matthew Xingchen"}]
[{"$f":"IF(语言配置表!A12=\"\",\"\",语言配置表!A12)","v":8},{"$f":"IF(语言配置表!A12=\"\",\"\",语言配置表!C12)","v":"Katrina Shuangyu"}]
[{"$f":"IF(语言配置表!A13=\"\",\"\",语言配置表!A13)","v":9},{"$f":"IF(语言配置表!A13=\"\",\"\",语言配置表!C13)","v":"Simon Xuanguang"}]
[{"$f":"IF(语言配置表!A14=\"\",\"\",语言配置表!A14)","v":10},{"$f":"IF(语言配置表!A14=\"\",\"\",语言配置表!C14)","v":"Elena Lingfeng"}]
[{"$f":"IF(语言配置表!A15=\"\",\"\",语言配置表!A15)","v":11},{"$f":"IF(语言配置表!A15=\"\",\"\",语言配置表!C15)","v":"Gabriel Shengxin"}]
[{"$f":"IF(语言配置表!A16=\"\",\"\",语言配置表!A16)","v":12},{"$f":"IF(语言配置表!A16=\"\",\"\",语言配置表!C16)","v":"Sophia Cien"}]
[{"$f":"IF(语言配置表!A17=\"\",\"\",语言配置表!A17)","v":13},{"$f":"IF(语言配置表!A17=\"\",\"\",语言配置表!C17)","v":"Luke Jinghun"}]
[{"$f":"IF(语言配置表!A18=\"\",\"\",语言配置表!A18)","v":14},{"$f":"IF(语言配置表!A18=\"\",\"\",语言配置表!C18)","v":"Annabelle Guangyao"}]
[{"$f":"IF(语言配置表!A19=\"\",\"\",语言配置表!A19)","v":15},{"$f":"IF(语言配置表!A19=\"\",\"\",语言配置表!C19)","v":"Isabella Endian"}]
[{"$f":"IF(语言配置表!A20=\"\",\"\",语言配置表!A20)","v":16},{"$f":"IF(语言配置表!A20=\"\",\"\",语言配置表!C20)","v":"Liam Yingzong"}]
[{"$f":"IF(语言配置表!A21=\"\",\"\",语言配置表!A21)","v":17},{"$f":"IF(语言配置表!A21=\"\",\"\",语言配置表!C21)","v":"Emily Cuiyu"}]
[{"$f":"IF(语言配置表!A22=\"\",\"\",语言配置表!A22)","v":18},{"$f":"IF(语言配置表!A22=\"\",\"\",语言配置表!C22)","v":"Derek Jifeng"}]
[{"$f":"IF(语言配置表!A23=\"\",\"\",语言配置表!A23)","v":19},{"$f":"IF(语言配置表!A23=\"\",\"\",语言配置表!C23)","v":"Victoria Yeren"}]
[{"$f":"IF(语言配置表!A24=\"\",\"\",语言配置表!A24)","v":20},{"$f":"IF(语言配置表!A24=\"\",\"\",语言配置表!C24)","v":"Noah Linzong"}]
[{"$f":"IF(语言配置表!A25=\"\",\"\",语言配置表!A25)","v":21},{"$f":"IF(语言配置表!A25=\"\",\"\",语言配置表!C25)","v":0}]
[{"$f":"IF(语言配置表!A26=\"\",\"\",语言配置表!A26)","v":22},{"$f":"IF(语言配置表!A26=\"\",\"\",语言配置表!C26)","v":0}]
[{"$f":"IF(语言配置表!A27=\"\",\"\",语言配置表!A27)","v":23},{"$f":"IF(语言配置表!A27=\"\",\"\",语言配置表!C27)","v":0}]
[{"$f":"IF(语言配置表!A28=\"\",\"\",语言配置表!A28)","v":24},{"$f":"IF(语言配置表!A28=\"\",\"\",语言配置表!C28)","v":0}]
[{"$f":"IF(语言配置表!A29=\"\",\"\",语言配置表!A29)","v":25},{"$f":"IF(语言配置表!A29=\"\",\"\",语言配置表!C29)","v":0}]
[{"$f":"IF(语言配置表!A30=\"\",\"\",语言配置表!A30)","v":26},{"$f":"IF(语言配置表!A30=\"\",\"\",语言配置表!C30)","v":0}]
[{"$f":"IF(语言配置表!A31=\"\",\"\",语言配置表!A31)","v":27},{"$f":"IF(语言配置表!A31=\"\",\"\",语言配置表!C31)","v":0}]
[{"$f":"IF(语言配置表!A32=\"\",\"\",语言配置表!A32)","v":28},{"$f":"IF(语言配置表!A32=\"\",\"\",语言配置表!C32)","v":0}]
[{"$f":"IF(语言配置表!A33=\"\",\"\",语言配置表!A33)","v":29},{"$f":"IF(语言配置表!A33=\"\",\"\",语言配置表!C33)","v":0}]
[{"$f":"IF(语言配置表!A34=\"\",\"\",语言配置表!A34)","v":""},{"$f":"IF(语言配置表!A34=\"\",\"\",语言配置表!C34)","v":""}]
[{"$f":"IF(语言配置表!A35=\"\",\"\",语言配置表!A35)","v":""},{"$f":"IF(语言配置表!A35=\"\",\"\",语言配置表!C35)","v":""}]
[{"$f":"IF(语言配置表!A36=\"\",\"\",语言配置表!A36)","v":""},{"$f":"IF(语言配置表!A36=\"\",\"\",语言配置表!C36)","v":""}]
[{"$f":"IF(语言配置表!A37=\"\",\"\",语言配置表!A37)","v":""},{"$f":"IF(语言配置表!A37=\"\",\"\",语言配置表!C37)","v":""}]
[{"$f":"IF(语言配置表!A38=\"\",\"\",语言配置表!A38)","v":""},{"$f":"IF(语言配置表!A38=\"\",\"\",语言配置表!C38)","v":""}]
[{"$f":"IF(语言配置表!A39=\"\",\"\",语言配置表!A39)","v":""},{"$f":"IF(语言配置表!A39=\"\",\"\",语言配置表!C39)","v":""}]
[{"$f":"IF(语言配置表!A40=\"\",\"\",语言配置表!A40)","v":""},{"$f":"IF(语言配置表!A40=\"\",\"\",语言配置表!C40)","v":""}]
[{"$f":"IF(语言配置表!A41=\"\",\"\",语言配置表!A41)","v":""},{"$f":"IF(语言配置表!A41=\"\",\"\",语言配置表!C41)","v":""}]
[{"$f":"IF(语言配置表!A42=\"\",\"\",语言配置表!A42)","v":""},{"$f":"IF(语言配置表!A42=\"\",\"\",语言配置表!C42)","v":""}]
[{"$f":"IF(语言配置表!A43=\"\",\"\",语言配置表!A43)","v":""},{"$f":"IF(语言配置表!A43=\"\",\"\",语言配置表!C43)","v":""}]
[{"$f":"IF(语言配置表!A44=\"\",\"\",语言配置表!A44)","v":""},{"$f":"IF(语言配置表!A44=\"\",\"\",语言配置表!C44)","v":""}]
[{"$f":"IF(语言配置表!A45=\"\",\"\",语言配置表!A45)","v":""},{"$f":"IF(语言配置表!A45=\"\",\"\",语言配置表!C45)","v":""}]
[{"$f":"IF(语言配置表!A46=\"\",\"\",语言配置表!A46)","v":""},{"$f":"IF(语言配置表!A46=\"\",\"\",语言配置表!C46)","v":""}]
[{"$f":"IF(语言配置表!A47=\"\",\"\",语言配置表!A47)","v":""},{"$f":"IF(语言配置表!A47=\"\",\"\",语言配置表!C47)","v":""}]
[{"$f":"IF(语言配置表!A48=\"\",\"\",语言配置表!A48)","v":""},{"$f":"IF(语言配置表!A48=\"\",\"\",语言配置表!C48)","v":""}]
[{"$f":"IF(语言配置表!A49=\"\",\"\",语言配置表!A49)","v":""},{"$f":"IF(语言配置表!A49=\"\",\"\",语言配置表!C49)","v":""}]
[{"$f":"IF(语言配置表!A50=\"\",\"\",语言配置表!A50)","v":""},{"$f":"IF(语言配置表!A50=\"\",\"\",语言配置表!C50)","v":""}]
[{"$f":"IF(语言配置表!A51=\"\",\"\",语言配置表!A51)","v":""},{"$f":"IF(语言配置表!A51=\"\",\"\",语言配置表!C51)","v":""}]
[{"$f":"IF(语言配置表!A52=\"\",\"\",语言配置表!A52)","v":""},{"$f":"IF(语言配置表!A52=\"\",\"\",语言配置表!C52)","v":""}]
[{"$f":"IF(语言配置表!A53=\"\",\"\",语言配置表!A53)","v":""},{"$f":"IF(语言配置表!A53=\"\",\"\",语言配置表!C53)","v":""}]
[{"$f":"IF(语言配置表!A54=\"\",\"\",语言配置表!A54)","v":""},{"$f":"IF(语言配置表!A54=\"\",\"\",语言配置表!C54)","v":""}]
[{"$f":"IF(语言配置表!A55=\"\",\"\",语言配置表!A55)","v":""},{"$f":"IF(语言配置表!A55=\"\",\"\",语言配置表!C55)","v":""}]
[{"$f":"IF(语言配置表!A56=\"\",\"\",语言配置表!A56)","v":""},{"$f":"IF(语言配置表!A56=\"\",\"\",语言配置表!C56)","v":""}]
[{"$f":"IF(语言配置表!A57=\"\",\"\",语言配置表!A57)","v":""},{"$f":"IF(语言配置表!A57=\"\",\"\",语言配置表!C57)","v":""}]
[{"$f":"IF(语言配置表!A58=\"\",\"\",语言配置表!A58)","v":""},{"$f":"IF(语言配置表!A58=\"\",\"\",语言配置表!C58)","v":""}]
[{"$f":"IF(语言配置表!A59=\"\",\"\",语言配置表!A59)","v":""},{"$f":"IF(语言配置表!A59=\"\",\"\",语言配置表!C59)","v":""}]
[{"$f":"IF(语言配置表!A60=\"\",\"\",语言配置表!A60)","v":""},{"$f":"IF(语言配置表!A60=\"\",\"\",语言配置表!C60)","v":""}]
[{"$f":"IF(语言配置表!A61=\"\",\"\",语言配置表!A61)","v":""},{"$f":"IF(语言配置表!A61=\"\",\"\",语言配置表!C61)","v":""}]
[{"$f":"IF(语言配置表!A62=\"\",\"\",语言配置表!A62)","v":""},{"$f":"IF(语言配置表!A62=\"\",\"\",语言配置表!C62)","v":""}]
[{"$f":"IF(语言配置表!A63=\"\",\"\",语言配置表!A63)","v":""},{"$f":"IF(语言配置表!A63=\"\",\"\",语言配置表!C63)","v":""}]
[{"$f":"IF(语言配置表!A64=\"\",\"\",语言配置表!A64)","v":""},{"$f":"IF(语言配置表!A64=\"\",\"\",语言配置表!C64)","v":""}]
[{"$f":"IF(语言配置表!A65=\"\",\"\",语言配置表!A65)","v":""},{"$f":"IF(语言配置表!A65=\"\",\"\",语言配置表!C65)","v":""}]
[{"$f":"IF(语言配置表!A66=\"\",\"\",语言配置表!A66)","v":""},{"$f":"IF(语言配置表!A66=\"\",\"\",语言配置表!C66)","v":""}]
[{"$f":"IF(语言配置表!A67=\"\",\"\",语言配置表!A67)","v":""},{"$f":"IF(语言配置表!A67=\"\",\"\",语言配置表!C67)","v":""}]
[{"$f":"IF(语言配置表!A68=\"\",\"\",语言配置表!A68)","v":""},{"$f":"IF(语言配置表!A68=\"\",\"\",语言配置表!C68)","v":""}]
[{"$f":"IF(语言配置表!A69=\"\",\"\",语言配置表!A69)","v":""},{"$f":"IF(语言配置表!A69=\"\",\"\",语言配置表!C69)","v":""}]
[{"$f":"IF(语言配置表!A70=\"\",\"\",语言配置表!A70)","v":""},{"$f":"IF(语言配置表!A70=\"\",\"\",语言配置表!C70)","v":""}]
[{"$f":"IF(语言配置表!A71=\"\",\"\",语言配置表!A71)","v":""},{"$f":"IF(语言配置表!A71=\"\",\"\",语言配置表!C71)","v":""}]
[{"$f":"IF(语言配置表!A72=\"\",\"\",语言配置表!A72)","v":""},{"$f":"IF(语言配置表!A72=\"\",\"\",语言配置表!C72)","v":""}]
[{"$f":"IF(语言配置表!A73=\"\",\"\",语言配置表!A73)","v":""},{"$f":"IF(语言配置表!A73=\"\",\"\",语言配置表!C73)","v":""}]
[{"$f":"IF(语言配置表!A74=\"\",\"\",语言配置表!A74)","v":""},{"$f":"IF(语言配置表!A74=\"\",\"\",语言配置表!C74)","v":""}]
[{"$f":"IF(语言配置表!A75=\"\",\"\",语言配置表!A75)","v":""},{"$f":"IF(语言配置表!A75=\"\",\"\",语言配置表!C75)","v":""}]
[{"$f":"IF(语言配置表!A76=\"\",\"\",语言配置表!A76)","v":""},{"$f":"IF(语言配置表!A76=\"\",\"\",语言配置表!C76)","v":""}]
[{"$f":"IF(语言配置表!A77=\"\",\"\",语言配置表!A77)","v":""},{"$f":"IF(语言配置表!A77=\"\",\"\",语言配置表!C77)","v":""}]
[{"$f":"IF(语言配置表!A78=\"\",\"\",语言配置表!A78)","v":""},{"$f":"IF(语言配置表!A78=\"\",\"\",语言配置表!C78)","v":""}]
[{"$f":"IF(语言配置表!A79=\"\",\"\",语言配置表!A79)","v":""},{"$f":"IF(语言配置表!A79=\"\",\"\",语言配置表!C79)","v":""}]
[{"$f":"IF(语言配置表!A80=\"\",\"\",语言配置表!A80)","v":""},{"$f":"IF(语言配置表!A80=\"\",\"\",语言配置表!C80)","v":""}]
[{"$f":"IF(语言配置表!A81=\"\",\"\",语言配置表!A81)","v":""},{"$f":"IF(语言配置表!A81=\"\",\"\",语言配置表!C81)","v":""}]
[{"$f":"IF(语言配置表!A82=\"\",\"\",语言配置表!A82)","v":""},{"$f":"IF(语言配置表!A82=\"\",\"\",语言配置表!C82)","v":""}]
[{"$f":"IF(语言配置表!A83=\"\",\"\",语言配置表!A83)","v":""},{"$f":"IF(语言配置表!A83=\"\",\"\",语言配置表!C83)","v":""}]
[{"$f":"IF(语言配置表!A84=\"\",\"\",语言配置表!A84)","v":""},{"$f":"IF(语言配置表!A84=\"\",\"\",语言配置表!C84)","v":""}]
[{"$f":"IF(语言配置表!A85=\"\",\"\",语言配置表!A85)","v":""},{"$f":"IF(语言配置表!A85=\"\",\"\",语言配置表!C85)","v":""}]
[{"$f":"IF(语言配置表!A86=\"\",\"\",语言配置表!A86)","v":""},{"$f":"IF(语言配置表!A86=\"\",\"\",语言配置表!C86)","v":""}]
[{"$f":"IF(语言配置表!A87=\"\",\"\",语言配置表!A87)","v":""},{"$f":"IF(语言配置表!A87=\"\",\"\",语言配置表!C87)","v":""}]
[{"$f":"IF(语言配置表!A88=\"\",\"\",语言配置表!A88)","v":""},{"$f":"IF(语言配置表!A88=\"\",\"\",语言配置表!C88)","v":""}]
[{"$f":"IF(语言配置表!A89=\"\",\"\",语言配置表!A89)","v":""},{"$f":"IF(语言配置表!A89=\"\",\"\",语言配置表!C89)","v":""}]
[{"$f":"IF(语言配置表!A90=\"\",\"\",语言配置表!A90)","v":""},{"$f":"IF(语言配置表!A90=\"\",\"\",语言配置表!C90)","v":""}]
[{"$f":"IF(语言配置表!A91=\"\",\"\",语言配置表!A91)","v":""},{"$f":"IF(语言配置表!A91=\"\",\"\",语言配置表!C91)","v":""}]
[{"$f":"IF(语言配置表!A92=\"\",\"\",语言配置表!A92)","v":""},{"$f":"IF(语言配置表!A92=\"\",\"\",语言配置表!C92)","v":""}]
[{"$f":"IF(语言配置表!A93=\"\",\"\",语言配置表!A93)","v":""},{"$f":"IF(语言配置表!A93=\"\",\"\",语言配置表!C93)","v":""}]
[{"$f":"IF(语言配置表!A94=\"\",\"\",语言配置表!A94)","v":""},{"$f":"IF(语言配置表!A94=\"\",\"\",语言配置表!C94)","v":""}]
[{"$f":"IF(语言配置表!A95=\"\",\"\",语言配置表!A95)","v":""},{"$f":"IF(语言配置表!A95=\"\",\"\",语言配置表!C95)","v":""}]
[{"$f":"IF(语言配置表!A96=\"\",\"\",语言配置表!A96)","v":""},{"$f":"IF(语言配置表!A96=\"\",\"\",语言配置表!C96)","v":""}]
[{"$f":"IF(语言配置表!A97=\"\",\"\",语言配置表!A97)","v":""},{"$f":"IF(语言配置表!A97=\"\",\"\",语言配置表!C97)","v":""}]
[{"$f":"IF(语言配置表!A98=\"\",\"\",语言配置表!A98)","v":""},{"$f":"IF(语言配置表!A98=\"\",\"\",语言配置表!C98)","v":""}]
[{"$f":"IF(语言配置表!A99=\"\",\"\",语言配置表!A99)","v":""},{"$f":"IF(语言配置表!A99=\"\",\"\",语言配置表!C99)","v":""}]
[{"$f":"IF(语言配置表!A100=\"\",\"\",语言配置表!A100)","v":""},{"$f":"IF(语言配置表!A100=\"\",\"\",语言配置表!C100)","v":""}]
[{"$f":"IF(语言配置表!A101=\"\",\"\",语言配置表!A101)","v":""},{"$f":"IF(语言配置表!A101=\"\",\"\",语言配置表!C101)","v":""}]
[{"$f":"IF(语言配置表!A102=\"\",\"\",语言配置表!A102)","v":""},{"$f":"IF(语言配置表!A102=\"\",\"\",语言配置表!C102)","v":""}]
[{"$f":"IF(语言配置表!A103=\"\",\"\",语言配置表!A103)","v":""},{"$f":"IF(语言配置表!A103=\"\",\"\",语言配置表!C103)","v":""}]
[{"$f":"IF(语言配置表!A104=\"\",\"\",语言配置表!A104)","v":""},{"$f":"IF(语言配置表!A104=\"\",\"\",语言配置表!C104)","v":""}]
[{"$f":"IF(语言配置表!A105=\"\",\"\",语言配置表!A105)","v":""},{"$f":"IF(语言配置表!A105=\"\",\"\",语言配置表!C105)","v":""}]
[{"$f":"IF(语言配置表!A106=\"\",\"\",语言配置表!A106)","v":""},{"$f":"IF(语言配置表!A106=\"\",\"\",语言配置表!C106)","v":""}]
[{"$f":"IF(语言配置表!A107=\"\",\"\",语言配置表!A107)","v":""},{"$f":"IF(语言配置表!A107=\"\",\"\",语言配置表!C107)","v":""}]
[{"$f":"IF(语言配置表!A108=\"\",\"\",语言配置表!A108)","v":""},{"$f":"IF(语言配置表!A108=\"\",\"\",语言配置表!C108)","v":""}]
[{"$f":"IF(语言配置表!A109=\"\",\"\",语言配置表!A109)","v":""},{"$f":"IF(语言配置表!A109=\"\",\"\",语言配置表!C109)","v":""}]
[{"$f":"IF(语言配置表!A110=\"\",\"\",语言配置表!A110)","v":""},{"$f":"IF(语言配置表!A110=\"\",\"\",语言配置表!C110)","v":""}]
[{"$f":"IF(语言配置表!A111=\"\",\"\",语言配置表!A111)","v":""},{"$f":"IF(语言配置表!A111=\"\",\"\",语言配置表!C111)","v":""}]
[{"$f":"IF(语言配置表!A112=\"\",\"\",语言配置表!A112)","v":""},{"$f":"IF(语言配置表!A112=\"\",\"\",语言配置表!C112)","v":""}]
[{"$f":"IF(语言配置表!A113=\"\",\"\",语言配置表!A113)","v":""},{"$f":"IF(语言配置表!A113=\"\",\"\",语言配置表!C113)","v":""}]
[{"$f":"IF(语言配置表!A114=\"\",\"\",语言配置表!A114)","v":""},{"$f":"IF(语言配置表!A114=\"\",\"\",语言配置表!C114)","v":""}]
[{"$f":"IF(语言配置表!A115=\"\",\"\",语言配置表!A115)","v":""},{"$f":"IF(语言配置表!A115=\"\",\"\",语言配置表!C115)","v":""}]
[{"$f":"IF(语言配置表!A116=\"\",\"\",语言配置表!A116)","v":""},{"$f":"IF(语言配置表!A116=\"\",\"\",语言配置表!C116)","v":""}]
[{"$f":"IF(语言配置表!A117=\"\",\"\",语言配置表!A117)","v":""},{"$f":"IF(语言配置表!A117=\"\",\"\",语言配置表!C117)","v":""}]
[{"$f":"IF(语言配置表!A118=\"\",\"\",语言配置表!A118)","v":""},{"$f":"IF(语言配置表!A118=\"\",\"\",语言配置表!C118)","v":""}]
[{"$f":"IF(语言配置表!A119=\"\",\"\",语言配置表!A119)","v":""},{"$f":"IF(语言配置表!A119=\"\",\"\",语言配置表!C119)","v":""}]
[{"$f":"IF(语言配置表!A120=\"\",\"\",语言配置表!A120)","v":""},{"$f":"IF(语言配置表!A120=\"\",\"\",语言配置表!C120)","v":""}]
[{"$f":"IF(语言配置表!A121=\"\",\"\",语言配置表!A121)","v":""},{"$f":"IF(语言配置表!A121=\"\",\"\",语言配置表!C121)","v":""}]
[{"$f":"IF(语言配置表!A122=\"\",\"\",语言配置表!A122)","v":""},{"$f":"IF(语言配置表!A122=\"\",\"\",语言配置表!C122)","v":""}]
[{"$f":"IF(语言配置表!A123=\"\",\"\",语言配置表!A123)","v":""},{"$f":"IF(语言配置表!A123=\"\",\"\",语言配置表!C123)","v":""}]
[{"$f":"IF(语言配置表!A124=\"\",\"\",语言配置表!A124)","v":""},{"$f":"IF(语言配置表!A124=\"\",\"\",语言配置表!C124)","v":""}]
[{"$f":"IF(语言配置表!A125=\"\",\"\",语言配置表!A125)","v":""},{"$f":"IF(语言配置表!A125=\"\",\"\",语言配置表!C125)","v":""}]
[{"$f":"IF(语言配置表!A126=\"\",\"\",语言配置表!A126)","v":""},{"$f":"IF(语言配置表!A126=\"\",\"\",语言配置表!C126)","v":""}]
[{"$f":"IF(语言配置表!A127=\"\",\"\",语言配置表!A127)","v":""},{"$f":"IF(语言配置表!A127=\"\",\"\",语言配置表!C127)","v":""}]
[{"$f":"IF(语言配置表!A128=\"\",\"\",语言配置表!A128)","v":""},{"$f":"IF(语言配置表!A128=\"\",\"\",语言配置表!C128)","v":""}]
[{"$f":"IF(语言配置表!A129=\"\",\"\",语言配置表!A129)","v":""},{"$f":"IF(语言配置表!A129=\"\",\"\",语言配置表!C129)","v":""}]
[{"$f":"IF(语言配置表!A130=\"\",\"\",语言配置表!A130)","v":""},{"$f":"IF(语言配置表!A130=\"\",\"\",语言配置表!C130)","v":""}]
[{"$f":"IF(语言配置表!A131=\"\",\"\",语言配置表!A131)","v":""},{"$f":"IF(语言配置表!A131=\"\",\"\",语言配置表!C131)","v":""}]
[{"$f":"IF(语言配置表!A132=\"\",\"\",语言配置表!A132)","v":""},{"$f":"IF(语言配置表!A132=\"\",\"\",语言配置表!C132)","v":""}]
[{"$f":"IF(语言配置表!A133=\"\",\"\",语言配置表!A133)","v":""},{"$f":"IF(语言配置表!A133=\"\",\"\",语言配置表!C133)","v":""}]
[{"$f":"IF(语言配置表!A134=\"\",\"\",语言配置表!A134)","v":""},{"$f":"IF(语言配置表!A134=\"\",\"\",语言配置表!C134)","v":""}]
[{"$f":"IF(语言配置表!A135=\"\",\"\",语言配置表!A135)","v":""},{"$f":"IF(语言配置表!A135=\"\",\"\",语言配置表!C135)","v":""}]
[{"$f":"IF(语言配置表!A136=\"\",\"\",语言配置表!A136)","v":""},{"$f":"IF(语言配置表!A136=\"\",\"\",语言配置表!C136)","v":""}]
[{"$f":"IF(语言配置表!A137=\"\",\"\",语言配置表!A137)","v":""},{"$f":"IF(语言配置表!A137=\"\",\"\",语言配置表!C137)","v":""}]
[{"$f":"IF(语言配置表!A138=\"\",\"\",语言配置表!A138)","v":""},{"$f":"IF(语言配置表!A138=\"\",\"\",语言配置表!C138)","v":""}]
[{"$f":"IF(语言配置表!A139=\"\",\"\",语言配置表!A139)","v":""},{"$f":"IF(语言配置表!A139=\"\",\"\",语言配置表!C139)","v":""}]
[{"$f":"IF(语言配置表!A140=\"\",\"\",语言配置表!A140)","v":""},{"$f":"IF(语言配置表!A140=\"\",\"\",语言配置表!C140)","v":""}]
[{"$f":"IF(语言配置表!A141=\"\",\"\",语言配置表!A141)","v":""},{"$f":"IF(语言配置表!A141=\"\",\"\",语言配置表!C141)","v":""}]
[{"$f":"IF(语言配置表!A142=\"\",\"\",语言配置表!A142)","v":""},{"$f":"IF(语言配置表!A142=\"\",\"\",语言配置表!C142)","v":""}]
[{"$f":"IF(语言配置表!A143=\"\",\"\",语言配置表!A143)","v":""},{"$f":"IF(语言配置表!A143=\"\",\"\",语言配置表!C143)","v":""}]
[{"$f":"IF(语言配置表!A144=\"\",\"\",语言配置表!A144)","v":""},{"$f":"IF(语言配置表!A144=\"\",\"\",语言配置表!C144)","v":""}]
[{"$f":"IF(语言配置表!A145=\"\",\"\",语言配置表!A145)","v":""},{"$f":"IF(语言配置表!A145=\"\",\"\",语言配置表!C145)","v":""}]
[{"$f":"IF(语言配置表!A146=\"\",\"\",语言配置表!A146)","v":""},{"$f":"IF(语言配置表!A146=\"\",\"\",语言配置表!C146)","v":""}]
[{"$f":"IF(语言配置表!A147=\"\",\"\",语言配置表!A147)","v":""},{"$f":"IF(语言配置表!A147=\"\",\"\",语言配置表!C147)","v":""}]
[{"$f":"IF(语言配置表!A148=\"\",\"\",语言配置表!A148)","v":""},{"$f":"IF(语言配置表!A148=\"\",\"\",语言配置表!C148)","v":""}]
[{"$f":"IF(语言配置表!A149=\"\",\"\",语言配置表!A149)","v":""},{"$f":"IF(语言配置表!A149=\"\",\"\",语言配置表!C149)","v":""}]
[{"$f":"IF(语言配置表!A150=\"\",\"\",语言配置表!A150)","v":""},{"$f":"IF(语言配置表!A150=\"\",\"\",语言配置表!C150)","v":""}]
[{"$f":"IF(语言配置表!A151=\"\",\"\",语言配置表!A151)","v":""},{"$f":"IF(语言配置表!A151=\"\",\"\",语言配置表!C151)","v":""}]
[{"$f":"IF(语言配置表!A152=\"\",\"\",语言配置表!A152)","v":""},{"$f":"IF(语言配置表!A152=\"\",\"\",语言配置表!C152)","v":""}]
[{"$f":"IF(语言配置表!A153=\"\",\"\",语言配置表!A153)","v":""},{"$f":"IF(语言配置表!A153=\"\",\"\",语言配置表!C153)","v":""}]
[{"$f":"IF(语言配置表!A154=\"\",\"\",语言配置表!A154)","v":""},{"$f":"IF(语言配置表!A154=\"\",\"\",语言配置表!C154)","v":""}]
[{"$f":"IF(语言配置表!A155=\"\",\"\",语言配置表!A155)","v":""},{"$f":"IF(语言配置表!A155=\"\",\"\",语言配置表!C155)","v":""}]
[{"$f":"IF(语言配置表!A156=\"\",\"\",语言配置表!A156)","v":""},{"$f":"IF(语言配置表!A156=\"\",\"\",语言配置表!C156)","v":""}]
[{"$f":"IF(语言配置表!A157=\"\",\"\",语言配置表!A157)","v":""},{"$f":"IF(语言配置表!A157=\"\",\"\",语言配置表!C157)","v":""}]
[{"$f":"IF(语言配置表!A158=\"\",\"\",语言配置表!A158)","v":""},{"$f":"IF(语言配置表!A158=\"\",\"\",语言配置表!C158)","v":""}]
[{"$f":"IF(语言配置表!A159=\"\",\"\",语言配置表!A159)","v":""},{"$f":"IF(语言配置表!A159=\"\",\"\",语言配置表!C159)","v":""}]
[{"$f":"IF(语言配置表!A160=\"\",\"\",语言配置表!A160)","v":""},{"$f":"IF(语言配置表!A160=\"\",\"\",语言配置表!C160)","v":""}]
[{"$f":"IF(语言配置表!A161=\"\",\"\",语言配置表!A161)","v":""},{"$f":"IF(语言配置表!A161=\"\",\"\",语言配置表!C161)","v":""}]
[{"$f":"IF(语言配置表!A162=\"\",\"\",语言配置表!A162)","v":""},{"$f":"IF(语言配置表!A162=\"\",\"\",语言配置表!C162)","v":""}]
[{"$f":"IF(语言配置表!A163=\"\",\"\",语言配置表!A163)","v":""},{"$f":"IF(语言配置表!A163=\"\",\"\",语言配置表!C163)","v":""}]
[{"$f":"IF(语言配置表!A164=\"\",\"\",语言配置表!A164)","v":""},{"$f":"IF(语言配置表!A164=\"\",\"\",语言配置表!C164)","v":""}]
[{"$f":"IF(语言配置表!A165=\"\",\"\",语言配置表!A165)","v":""},{"$f":"IF(语言配置表!A165=\"\",\"\",语言配置表!C165)","v":""}]
[{"$f":"IF(语言配置表!A166=\"\",\"\",语言配置表!A166)","v":""},{"$f":"IF(语言配置表!A166=\"\",\"\",语言配置表!C166)","v":""}]
[{"$f":"IF(语言配置表!A167=\"\",\"\",语言配置表!A167)","v":""},{"$f":"IF(语言配置表!A167=\"\",\"\",语言配置表!C167)","v":""}]
[{"$f":"IF(语言配置表!A168=\"\",\"\",语言配置表!A168)","v":""},{"$f":"IF(语言配置表!A168=\"\",\"\",语言配置表!C168)","v":""}]
[{"$f":"IF(语言配置表!A169=\"\",\"\",语言配置表!A169)","v":""},{"$f":"IF(语言配置表!A169=\"\",\"\",语言配置表!C169)","v":""}]
[{"$f":"IF(语言配置表!A170=\"\",\"\",语言配置表!A170)","v":""},{"$f":"IF(语言配置表!A170=\"\",\"\",语言配置表!C170)","v":""}]
[{"$f":"IF(语言配置表!A171=\"\",\"\",语言配置表!A171)","v":""},{"$f":"IF(语言配置表!A171=\"\",\"\",语言配置表!C171)","v":""}]
[{"$f":"IF(语言配置表!A172=\"\",\"\",语言配置表!A172)","v":""},{"$f":"IF(语言配置表!A172=\"\",\"\",语言配置表!C172)","v":""}]
[{"$f":"IF(语言配置表!A173=\"\",\"\",语言配置表!A173)","v":""},{"$f":"IF(语言配置表!A173=\"\",\"\",语言配置表!C173)","v":""}]
[{"$f":"IF(语言配置表!A174=\"\",\"\",语言配置表!A174)","v":""},{"$f":"IF(语言配置表!A174=\"\",\"\",语言配置表!C174)","v":""}]
[{"$f":"IF(语言配置表!A175=\"\",\"\",语言配置表!A175)","v":""},{"$f":"IF(语言配置表!A175=\"\",\"\",语言配置表!C175)","v":""}]
[{"$f":"IF(语言配置表!A176=\"\",\"\",语言配置表!A176)","v":""},{"$f":"IF(语言配置表!A176=\"\",\"\",语言配置表!C176)","v":""}]
[{"$f":"IF(语言配置表!A177=\"\",\"\",语言配置表!A177)","v":""},{"$f":"IF(语言配置表!A177=\"\",\"\",语言配置表!C177)","v":""}]
[{"$f":"IF(语言配置表!A178=\"\",\"\",语言配置表!A178)","v":""},{"$f":"IF(语言配置表!A178=\"\",\"\",语言配置表!C178)","v":""}]
[{"$f":"IF(语言配置表!A179=\"\",\"\",语言配置表!A179)","v":""},{"$f":"IF(语言配置表!A179=\"\",\"\",语言配置表!C179)","v":""}]
[{"$f":"IF(语言配置表!A180=\"\",\"\",语言配置表!A180)","v":""},{"$f":"IF(语言配置表!A180=\"\",\"\",语言配置表!C180)","v":""}]
[{"$f":"IF(语言配置表!A181=\"\",\"\",语言配置表!A181)","v":""},{"$f":"IF(语言配置表!A181=\"\",\"\",语言配置表!C181)","v":""}]
[{"$f":"IF(语言配置表!A182=\"\",\"\",语言配置表!A182)","v":""},{"$f":"IF(语言配置表!A182=\"\",\"\",语言配置表!C182)","v":""}]
[{"$f":"IF(语言配置表!A183=\"\",\"\",语言配置表!A183)","v":""},{"$f":"IF(语言配置表!A183=\"\",\"\",语言配置表!C183)","v":""}]
[{"$f":"IF(语言配置表!A184=\"\",\"\",语言配置表!A184)","v":""},{"$f":"IF(语言配置表!A184=\"\",\"\",语言配置表!C184)","v":""}]
[{"$f":"IF(语言配置表!A185=\"\",\"\",语言配置表!A185)","v":""},{"$f":"IF(语言配置表!A185=\"\",\"\",语言配置表!C185)","v":""}]
[{"$f":"IF(语言配置表!A186=\"\",\"\",语言配置表!A186)","v":""},{"$f":"IF(语言配置表!A186=\"\",\"\",语言配置表!C186)","v":""}]
[{"$f":"IF(语言配置表!A187=\"\",\"\",语言配置表!A187)","v":""},{"$f":"IF(语言配置表!A187=\"\",\"\",语言配置表!C187)","v":""}]
[{"$f":"IF(语言配置表!A188=\"\",\"\",语言配置表!A188)","v":""},{"$f":"IF(语言配置表!A188=\"\",\"\",语言配置表!C188)","v":""}]
[{"$f":"IF(语言配置表!A189=\"\",\"\",语言配置表!A189)","v":""},{"$f":"IF(语言配置表!A189=\"\",\"\",语言配置表!C189)","v":""}]
[{"$f":"IF(语言配置表!A190=\"\",\"\",语言配置表!A190)","v":""},{"$f":"IF(语言配置表!A190=\"\",\"\",语言配置表!C190)","v":""}]
[{"$f":"IF(语言配置表!A191=\"\",\"\",语言配置表!A191)","v":""},{"$f":"IF(语言配置表!A191=\"\",\"\",语言配置表!C191)","v":""}]
[{"$f":"IF(语言配置表!A192=\"\",\"\",语言配置表!A192)","v":""},{"$f":"IF(语言配置表!A192=\"\",\"\",语言配置表!C192)","v":""}]
[{"$f":"IF(语言配置表!A193=\"\",\"\",语言配置表!A193)","v":""},{"$f":"IF(语言配置表!A193=\"\",\"\",语言配置表!C193)","v":""}]
[{"$f":"IF(语言配置表!A194=\"\",\"\",语言配置表!A194)","v":""},{"$f":"IF(语言配置表!A194=\"\",\"\",语言配置表!C194)","v":""}]
[{"$f":"IF(语言配置表!A195=\"\",\"\",语言配置表!A195)","v":""},{"$f":"IF(语言配置表!A195=\"\",\"\",语言配置表!C195)","v":""}]
[{"$f":"IF(语言配置表!A196=\"\",\"\",语言配置表!A196)","v":""},{"$f":"IF(语言配置表!A196=\"\",\"\",语言配置表!C196)","v":""}]
[{"$f":"IF(语言配置表!A197=\"\",\"\",语言配置表!A197)","v":""},{"$f":"IF(语言配置表!A197=\"\",\"\",语言配置表!C197)","v":""}]
[{"$f":"IF(语言配置表!A198=\"\",\"\",语言配置表!A198)","v":""},{"$f":"IF(语言配置表!A198=\"\",\"\",语言配置表!C198)","v":""}]
[{"$f":"IF(语言配置表!A199=\"\",\"\",语言配置表!A199)","v":""},{"$f":"IF(语言配置表!A199=\"\",\"\",语言配置表!C199)","v":""}]
[{"$f":"IF(语言配置表!A200=\"\",\"\",语言配置表!A200)","v":""},{"$f":"IF(语言配置表!A200=\"\",\"\",语言配置表!C200)","v":""}]
[{"$f":"IF(语言配置表!A201=\"\",\"\",语言配置表!A201)","v":""},{"$f":"IF(语言配置表!A201=\"\",\"\",语言配置表!C201)","v":""}]
[{"$f":"IF(语言配置表!A202=\"\",\"\",语言配置表!A202)","v":""},{"$f":"IF(语言配置表!A202=\"\",\"\",语言配置表!C202)","v":""}]
[{"$f":"IF(语言配置表!A203=\"\",\"\",语言配置表!A203)","v":""},{"$f":"IF(语言配置表!A203=\"\",\"\",语言配置表!C203)","v":""}]
[{"$f":"IF(语言配置表!A204=\"\",\"\",语言配置表!A204)","v":""},{"$f":"IF(语言配置表!A204=\"\",\"\",语言配置表!C204)","v":""}]
[{"$f":"IF(语言配置表!A205=\"\",\"\",语言配置表!A205)","v":""},{"$f":"IF(语言配置表!A205=\"\",\"\",语言配置表!C205)","v":""}]
[{"$f":"IF(语言配置表!A206=\"\",\"\",语言配置表!A206)","v":""},{"$f":"IF(语言配置表!A206=\"\",\"\",语言配置表!C206)","v":""}]
[{"$f":"IF(语言配置表!A207=\"\",\"\",语言配置表!A207)","v":""},{"$f":"IF(语言配置表!A207=\"\",\"\",语言配置表!C207)","v":""}]
[{"$f":"IF(语言配置表!A208=\"\",\"\",语言配置表!A208)","v":""},{"$f":"IF(语言配置表!A208=\"\",\"\",语言配置表!C208)","v":""}]
[{"$f":"IF(语言配置表!A209=\"\",\"\",语言配置表!A209)","v":""},{"$f":"IF(语言配置表!A209=\"\",\"\",语言配置表!C209)","v":""}]
[{"$f":"IF(语言配置表!A210=\"\",\"\",语言配置表!A210)","v":""},{"$f":"IF(语言配置表!A210=\"\",\"\",语言配置表!C210)","v":""}]
[{"$f":"IF(语言配置表!A211=\"\",\"\",语言配置表!A211)","v":""},{"$f":"IF(语言配置表!A211=\"\",\"\",语言配置表!C211)","v":""}]
[{"$f":"IF(语言配置表!A212=\"\",\"\",语言配置表!A212)","v":""},{"$f":"IF(语言配置表!A212=\"\",\"\",语言配置表!C212)","v":""}]
[{"$f":"IF(语言配置表!A213=\"\",\"\",语言配置表!A213)","v":""},{"$f":"IF(语言配置表!A213=\"\",\"\",语言配置表!C213)","v":""}]
[{"$f":"IF(语言配置表!A214=\"\",\"\",语言配置表!A214)","v":""},{"$f":"IF(语言配置表!A214=\"\",\"\",语言配置表!C214)","v":""}]

{"sheet":"LanguageDEConfig","index":3,"n_rows":20,"n_cols":2,"rows_kept":20,"cut":false,"hidden":false,"merged":[]}
["ID","txt"]
["int","string"]
[]
["ID","德语描述"]
[{"$f":"IF(语言配置表!A5=\"\",\"\",语言配置表!A5)","v":1},{"$f":"IF(语言配置表!A5=\"\",\"\",语言配置表!D5)","v":0}]
[{"$f":"IF(语言配置表!A6=\"\",\"\",语言配置表!A6)","v":2},{"$f":"IF(语言配置表!A6=\"\",\"\",语言配置表!D6)","v":0}]
[{"$f":"IF(语言配置表!A7=\"\",\"\",语言配置表!A7)","v":3},{"$f":"IF(语言配置表!A7=\"\",\"\",语言配置表!D7)","v":0}]
[{"$f":"IF(语言配置表!A8=\"\",\"\",语言配置表!A8)","v":4},{"$f":"IF(语言配置表!A8=\"\",\"\",语言配置表!D8)","v":0}]
[{"$f":"IF(语言配置表!A9=\"\",\"\",语言配置表!A9)","v":5},{"$f":"IF(语言配置表!A9=\"\",\"\",语言配置表!D9)","v":0}]
[{"$f":"IF(语言配置表!A10=\"\",\"\",语言配置表!A10)","v":6},{"$f":"IF(语言配置表!A10=\"\",\"\",语言配置表!D10)","v":0}]
[{"$f":"IF(语言配置表!A11=\"\",\"\",语言配置表!A11)","v":7},{"$f":"IF(语言配置表!A11=\"\",\"\",语言配置表!D11)","v":0}]
[{"$f":"IF(语言配置表!A12=\"\",\"\",语言配置表!A12)","v":8},{"$f":"IF(语言配置表!A12=\"\",\"\",语言配置表!D12)","v":0}]
[{"$f":"IF(语言配置表!A13=\"\",\"\",语言配置表!A13)","v":9},{"$f":"IF(语言配置表!A13=\"\",\"\",语言配置表!D13)","v":0}]
[{"$f":"IF(语言配置表!A14=\"\",\"\",语言配置表!A14)","v":10},{"$f":"IF(语言配置表!A14=\"\",\"\",语言配置表!D14)","v":0}]
[{"$f":"IF(语言配置表!A15=\"\",\"\",语言配置表!A15)","v":11},{"$f":"IF(语言配置表!A15=\"\",\"\",语言配置表!D15)","v":0}]
[{"$f":"IF(语言配置表!A16=\"\",\"\",语言配置表!A16)","v":12},{"$f":"IF(语言配置表!A16=\"\",\"\",语言配置表!D16)","v":0}]
[{"$f":"IF(语言配置表!A17=\"\",\"\",语言配置表!A17)","v":13},{"$f":"IF(语言配置表!A17=\"\",\"\",语言配置表!D17)","v":0}]
[{"$f":"IF(语言配置表!A18=\"\",\"\",语言配置表!A18)","v":14},{"$f":"IF(语言配置表!A18=\"\",\"\",语言配置表!D18)","v":0}]
[{"$f":"IF(语言配置表!A19=\"\",\"\",语言配置表!A19)","v":15},{"$f":"IF(语言配置表!A19=\"\",\"\",语言配置表!D19)","v":0}]
[null,{"$f":"IF(语言配置表!A20=\"\",\"\",语言配置表!D20)","v":0}]

{"sheet":"LanguageFRConfig","index":4,"n_rows":5,"n_cols":2,"rows_kept":5,"cut":false,"hidden":false,"merged":[]}
["ID","txt"]
["int","string"]
[]
["ID","法语描述"]
[{"$f":"IF(语言配置表!A5=\"\",\"\",语言配置表!A5)","v":1},{"$f":"IF(语言配置表!A5=\"\",\"\",语言配置表!E5)","v":0}]

{"sheet":"LanguageRUConfig","index":5,"n_rows":5,"n_cols":2,"rows_kept":5,"cut":false,"hidden":false,"merged":[]}
["ID","txt"]
["int","string"]
[]
["ID","法语描述"]
[{"$f":"IF(语言配置表!A5=\"\",\"\",语言配置表!A5)","v":1},{"$f":"IF(语言配置表!A5=\"\",\"\",语言配置表!F5)","v":0}]

{"sheet":"LanguageTHConfig","index":6,"n_rows":5,"n_cols":2,"rows_kept":5,"cut":false,"hidden":false,"merged":[]}
["ID","txt"]
["int","string"]
[]
["ID","泰语描述"]
[{"$f":"IF(语言配置表!A5=\"\",\"\",语言配置表!A5)","v":1},{"$f":"IF(语言配置表!A5=\"\",\"\",语言配置表!G5)","v":0}]