{"text_format":"2","workbook":"xlsx","n_sheets":2,"sheets":["HeroPowerUpConfig","HeroQiangDuAddConfig"],"not_rendered":{"charts":0,"images":0,"macros":0,"external_links":5,"defined_names":1,"comments":0,"pivot_tables":0},"unopened":[],"bounds":{"document_bytes":16777216,"sheet_cells":100000,"run_cost":"one","rows_first":2000,"rows_last":500,"rows_between":2000,"halvings":0,"cell_chars":16384,"cell_head_chars":4096},"cells_cut":0,"cells_raw":0,"read":"whole","date_system":"1900"}

{"sheet":"HeroPowerUpConfig","index":0,"n_rows":304,"n_cols":57,"rows_kept":304,"cut":false,"hidden":false,"merged":[]}
["ID","HeroLevel","jingjie1","jingjie2","jingjie3","jingjieLanIDs",{"$nulls":6},"levelUpExp","DujieLevelbattleID","DujieRateviaBattle","DujieMustItemIDs","DujieMustItemValues","DujieItemIDs","DujieItemValues","LeijieDamages","HPFactor","ATKFactor","DEFFactor","HudunFactor","defK","ShenshiMax","AutoXiuwei","FailureExpReduce","MaxActiveGongfaNum","MaxPassiveGongfaNum","MaxFabaoNum",{"$nulls":4},"MPFactor","DaoyouCount"]
["int","int","int","int","int","int[]",{"$nulls":6},"int","int","int","int[]","int[]","int[]","int[]","int[]","float","float","float","float","int","int","float","int","int","int","int",{"$nulls":4},"float","int"]
[{"$nulls":31},{"$f":"SUM(AF5:AF304)","v":1229974},{"$f":"AF3/60","v":20499.566666666666},{"$f":"AG3/60","v":341.65944444444443},{"$f":"AH3/12","v":28.471620370370371}]
["ID","玩家修为境界（等级）","大境界ID","中境界ID","小境界ID","境界语言表ID","境界名称1","境界名称2","境界名称3",null,null,null,"升级所需修为值\n（-1代表最大等级)","渡劫必须战斗ID","战斗增加渡劫几率","渡劫必需道具ID","渡劫必需道具数量","渡劫选有道具IDs","渡劫选有道具数量","雷劫伤害\n要填下限、上限、表现上几根雷","生命倍率","攻击倍率","防御倍率","护盾倍率","防御系数K","神识上限","每秒获得的修为值","雷劫失败扣除的当前等级修为百分比","主动功法可配置上限","被动功法可配置上限","法宝可配置上限","吐纳时长(s)","分钟","小时","天（每天12小时）","法力倍率","允许出现的最大挂机道友数量",null,"战斗","必须","数量","选有1","数量1","选有2","数量2","选有3","数量3","选有4","数量4","选有5","数量5","必须","选有1","选有2","选有3","选有4","选有5"]
[1,1,1,1,1,{"$f":"_xlfn.TEXTJOIN(\";\",1,J5:L5)","v":"225;235;238"},"练气","前期.","一重",225,235,238,{"$f":"ROUND([1]ResourceLevelConfig!$E5*[1]ResourceLevelConfig!$L5*0.1,0)*10","v":400},{"$f":"IF(E5=10,100004,-1)","v":-1},0,-1,-1,{"$f":"IF(I5=10,\"1204;1203;1202;1201\",-1)","v":-1},{"$f":"IF(R5=-1,-1,\"1;1;1;1\")","v":-1},{"$f":"IF(G5=G6,0,CONCATENATE(80*ROUND(VLOOKUP(B5,[2]MonsterPowerUpConfig!$A:$I,9,FALSE),0),\";\",120*ROUND(VLOOKUP(B5,[2]MonsterPowerUpConfig!$A:$I,9,FALSE),0)))","v":0},{"$f":"[3]主表!K3","v":5},{"$f":"[3]主表!L3","v":1},{"$f":"[3]主表!M3","v":1},{"$f":"[3]主表!N3","v":0},{"$f":"[3]主表!$G3","v":211},{"$f":"[3]升级!$H3","v":1000},{"$f":"MAX(0.1,ROUND(100/(24*3600)*VLOOKUP(B5,[1]ResourceLevelConfig!$A:$E,5,FALSE),2))","v":0.12},-1,2,1,1,{"$f":"ROUND(10^(B5*0.01+2.07),0)","v":120},null,{"$f":"50*W5","v":50},null,1,1,1,null,null,{"$f":"IF(AN5=\"\",\"\",1)","v":""},null,{"$f":"IF(AP5=\"\",\"\",1)","v":""},null,{"$f":"IF(AR5=\"\",\"\",1)","v":""},null,{"$f":"IF(AT5=\"\",\"\",1)","v":""},null,{"$f":"IF(AV5=\"\",\"\",1)","v":""},null,{"$f":"IF(AX5=\"\",\"\",1)","v":""},{"$f":"IF(AN5=\"\",\"\",VLOOKUP(AN5,[4]ItemConfig!$A:$C,3,FALSE)&AO5)","v":""},{"$f":"IF(AP5=\"\",\"\",VLOOKUP(AP5,[4]ItemConfig!$A:$C,3,FALSE)&AQ5)","v":""},{"$f":"IF(AR5=\"\",\"\",VLOOKUP(AR5,[4]ItemConfig!$A:$C,3,FALSE)&AS5)","v":""},{"$f":"IF(AT5=\"\",\"\",VLOOKUP(AT5,[4]ItemConfig!$A:$C,3,FALSE)&AU5)","v":""},{"$f":"IF(AV5=\"\",\"\",VLOOKUP(AV5,[4]ItemConfig!$A:$C,3,FALSE)&AW5)","v":""},{"$f":"IF(AX5=\"\",\"\",VLOOKUP(AX5,[4]ItemConfig!$A:$C,3,FALSE)&AY5)","v":""}]
[2,2,1,1,2,{"$f":"_xlfn.TEXTJOIN(\";\",1,J6:L6)","v":"225;235;239"},"练气","前期.","二重",225,235,239,{"$f":"ROUND([1]ResourceLevelConfig!$E6*[1]ResourceLevelConfig!$L6*0.1,0)*10","v":410},{"$f":"IF(E6=10,100004,-1)","v":-1},0,-1,-1,{"$f":"IF(I6=10,\"1204;1203;1202;1201\",-1)","v":-1},{"$f":"IF(R6=-1,-1,\"1;1;1;1\")","v":-1},{"$f":"IF(G6=G7,0,CONCATENATE(80*ROUND(VLOOKUP(B6,[2]MonsterPowerUpConfig!$A:$I,9,FALSE),0),\";\",120*ROUND(VLOOKUP(B6,[2]MonsterPowerUpConfig!$A:$I,9,FALSE),0)))","v":0},{"$f":"[3]主表!K4","v":5.4459622494945146},{"$f":"[3]主表!L4","v":1.0135018283999999},{"$f":"[3]主表!M4","v":1.0135018283999999},{"$f":"[3]主表!N4","v":0},{"$f":"[3]主表!$G4","v":213},{"$f":"[3]升级!$H4","v":1000},{"$f":"MAX(0.1,ROUND(100/(24*3600)*VLOOKUP(B6,[1]ResourceLevelConfig!$A:$E,5,FALSE),2))","v":0.12},-1,{"$f":"AC5","v":2},{"$f":"AD5","v":1},1,{"$f":"MAX(AF5+10,ROUND(10^(B6*0.01+1.405),0))","v":130},null,50.675091419999994,null,1,1,2,null,null,{"$f":"IF(AN6=\"\",\"\",1)","v":""},null,"",null,{"$f":"IF(AR6=\"\",\"\",1)","v":""},null,{"$f":"IF(AT6=\"\",\"\",1)","v":""},null,{"$f":"IF(AV6=\"\",\"\",1)","v":""},null,{"$f":"IF(AX6=\"\",\"\",1)","v":""},{"$f":"IF(AN6=\"\",\"\",VLOOKUP(AN6,[4]ItemConfig!$A:$C,3,FALSE)&AO6)","v":""},{"$f":"IF(AP6=\"\",\"\",VLOOKUP(AP6,[4]ItemConfig!$A:$C,3,FALSE)&AQ6)","v":""},{"$f":"IF(AR6=\"\",\"\",VLOOKUP(AR6,[4]ItemConfig!$A:$C,3,FALSE)&AS6)","v":""},{"$f":"IF(AT6=\"\",\"\",VLOOKUP(AT6,[4]ItemConfig!$A:$C,3,FALSE)&AU6)","v":""},{"$f":"IF(AV6=\"\",\"\",VLOOKUP(AV6,[4]ItemConfig!$A:$C,3,FALSE)&AW6)","v":""},{"$f":"IF(AX6=\"\",\"\",VLOOKUP(AX6,[4]ItemConfig!$A:$C,3,FALSE)&AY6)","v":""}]
[3,3,1,1,3,"225;235;240","练气","前期.","三重",225,235,240,{"$f":"ROUND([1]ResourceLevelConfig!$E7*[1]ResourceLevelConfig!$L7*0.1,0)*10","v":420},-1,0,-1,-1,-1,-1,{"$f":"IF(G7=G8,0,CONCATENATE(80*ROUND(VLOOKUP(B7,[2]MonsterPowerUpConfig!$A:$I,9,FALSE),0),\";\",120*ROUND(VLOOKUP(B7,[2]MonsterPowerUpConfig!$A:$I,9,FALSE),0)))","v":0},{"$f":"[3]主表!K5","v":5.9030556136694194},{"$f":"[3]主表!L5","v":1.0271859561701429},{"$f":"[3]主表!M5","v":1.0271859561701429},{"$f":"[3]主表!N5","v":0},{"$f":"[3]主表!$G5","v":216},{"$f":"[3]升级!$H5","v":1000},{"$f":"MAX(0.1,ROUND(100/(24*3600)*VLOOKUP(B7,[1]ResourceLevelConfig!$A:$E,5,FALSE),2))","v":0.12},-1,{"$f":"AC6","v":2},{"$f":"AD6","v":1},{"$f":"AE6","v":1},140,null,51.359297808507144,null,1,1,3,null,null,"",null,"",null,{"$f":"IF(AR7=\"\",\"\",1)","v":""},null,{"$f":"IF(AT7=\"\",\"\",1)","v":""},null,{"$f":"IF(AV7=\"\",\"\",1)","v":""},null,{"$f":"IF(AX7=\"\",\"\",1)","v":""},{"$f":"IF(AN7=\"\",\"\",VLOOKUP(AN7,[4]ItemConfig!$A:$C,3,FALSE)&AO7)","v":""},{"$f":"IF(AP7=\"\",\"\",VLOOKUP(AP7,[4]ItemConfig!$A:$C,3,FALSE)&AQ7)","v":""},{"$f":"IF(AR7=\"\",\"\",VLOOKUP(AR7,[4]ItemConfig!$A:$C,3,FALSE)&AS7)","v":""},{"$f":"IF(AT7=\"\",\"\",VLOOKUP(AT7,[4]ItemConfig!$A:$C,3,FALSE)&AU7)","v":""},{"$f":"IF(AV7=\"\",\"\",VLOOKUP(AV7,[4]ItemConfig!$A:$C,3,FALSE)&AW7)","v":""},{"$f":"IF(AX7=\"\",\"\",VLOOKUP(AX7,[4]ItemConfig!$A:$C,3,FALSE)&AY7)","v":""}]
[4,4,1,1,4,"225;235;241","练气","前期.","四重",225,235,241,{"$f":"ROUND([1]ResourceLevelConfig!$E8*[1]ResourceLevelConfig!$L8*0.1,0)*10","v":430},-1,0,-1,-1,-1,-1,{"$f":"IF(G8=G9,0,CONCATENATE(80*ROUND(VLOOKUP(B8,[2]MonsterPowerUpConfig!$A:$I,9,FALSE),0),\";\",120*ROUND(VLOOKUP(B8,[2]MonsterPowerUpConfig!$A:$I,9,FALSE),0)))","v":0},{"$f":"[3]主表!K6","v":6.3714993746881552},{"$f":"[3]主表!L6","v":1.0410548446852419},{"$f":"[3]主表!M6","v":1.0410548446852419},{"$f":"[3]主表!N6","v":0},{"$f":"[3]主表!$G6","v":219},{"$f":"[3]升级!$H6","v":1000},{"$f":"MAX(0.1,ROUND(100/(24*3600)*VLOOKUP(B8,[1]ResourceLevelConfig!$A:$E,5,FALSE),2))","v":0.12},-1,2,1,1,150,null,52.052742234262098,null,1,1,4,null,null,"",null,"",null,{"$f":"IF(AR8=\"\",\"\",1)","v":""},null,{"$f":"IF(AT8=\"\",\"\",1)","v":""},null,{"$f":"IF(AV8=\"\",\"\",1)","v":""},null,{"$f":"IF(AX8=\"\",\"\",1)","v":""},{"$f":"IF(AN8=\"\",\"\",VLOOKUP(AN8,[4]ItemConfig!$A:$C,3,FALSE)&AO8)","v":""},{"$f":"IF(AP8=\"\",\"\",VLOOKUP(AP8,[4]ItemConfig!$A:$C,3,FALSE)&AQ8)","v":""},{"$f":"IF(AR8=\"\",\"\",VLOOKUP(AR8,[4]ItemConfig!$A:$C,3,FALSE)&AS8)","v":""},{"$f":"IF(AT8=\"\",\"\",VLOOKUP(AT8,[4]ItemConfig!$A:$C,3,FALSE)&AU8)","v":""},{"$f":"IF(AV8=\"\",\"\",VLOOKUP(AV8,[4]ItemConfig!$A:$C,3,FALSE)&AW8)","v":""},{"$f":"IF(AX8=\"\",\"\",VLOOKUP(AX8,[4]ItemConfig!$A:$C,3,FALSE)&AY8)","v":""}]
[5,5,1,1,5,"225;235;242","练气","前期.","五重",225,235,242,{"$f":"ROUND([1]ResourceLevelConfig!$E9*[1]ResourceLevelConfig!$L9*0.1,0)*10","v":440},-1,0,-1,-1,-1,-1,{"$f":"IF(G9=G10,0,CONCATENATE(80*ROUND(VLOOKUP(B9,[2]MonsterPowerUpConfig!$A:$I,9,FALSE),0),\";\",120*ROUND(VLOOKUP(B9,[2]MonsterPowerUpConfig!$A:$I,9,FALSE),0)))","v":0},{"$f":"[3]主表!K7","v":6.8515167069392513},{"$f":"[3]主表!L7","v":1.0551109885531706},{"$f":"[3]主表!M7","v":1.0551109885531706},{"$f":"[3]主表!N7","v":0},{"$f":"[3]主表!$G7","v":222},{"$f":"[3]升级!$H7","v":1000},{"$f":"MAX(0.1,ROUND(100/(24*3600)*VLOOKUP(B9,[1]ResourceLevelConfig!$A:$E,5,FALSE),2))","v":0.12},-1,2,1,1,160,null,52.755549427658529,null,1,1,5,null,null,"",null,"",null,{"$f":"IF(AR9=\"\",\"\",1)","v":""},null,{"$f":"IF(AT9=\"\",\"\",1)","v":""},null,{"$f":"IF(AV9=\"\",\"\",1)","v":""},null,{"$f":"IF(AX9=\"\",\"\",1)","v":""},{"$f":"IF(AN9=\"\",\"\",VLOOKUP(AN9,[4]ItemConfig!$A:$C,3,FALSE)&AO9)","v":""},{"$f":"IF(AP9=\"\",\"\",VLOOKUP(AP9,[4]ItemConfig!$A:$C,3,FALSE)&AQ9)","v":""},{"$f":"IF(AR9=\"\",\"\",VLOOKUP(AR9,[4]ItemConfig!$A:$C,3,FALSE)&AS9)","v":""},{"$f":"IF(AT9=\"\",\"\",VLOOKUP(AT9,[4]ItemConfig!$A:$C,3,FALSE)&AU9)","v":""},{"$f":"IF(AV9=\"\",\"\",VLOOKUP(AV9,[4]ItemConfig!$A:$C,3,FALSE)&AW9)","v":""},{"$f":"IF(AX9=\"\",\"\",VLOOKUP(AX9,[4]ItemConfig!$A:$C,3,FALSE)&AY9)","v":""}]
[6,6,1,1,6,"225;235;243","练气","前期.","六重",225,235,243,{"$f":"ROUND([1]ResourceLevelConfig!$E10*[1]ResourceLevelConfig!$L10*0.1,0)*10","v":500},-1,0,-1,-1,-1,-1,{"$f":"IF(G10=G11,0,CONCATENATE(80*ROUND(VLOOKUP(B10,[2]MonsterPowerUpConfig!$A:$I,9,FALSE),0),\";\",120*ROUND(VLOOKUP(B10,[2]MonsterPowerUpConfig!$A:$I,9,FALSE),0)))","v":0},{"$f":"[3]主表!K8","v":7.3433347421656343},{"$f":"[3]主表!L8","v":1.0693569160635699},{"$f":"[3]主表!M8","v":1.0693569160635699},{"$f":"[3]主表!N8","v":0},{"$f":"[3]主表!$G8","v":225},{"$f":"[3]升级!$H8","v":1000},{"$f":"MAX(0.1,ROUND(100/(24*3600)*VLOOKUP(B10,[1]ResourceLevelConfig!$A:$E,5,FALSE),2))","v":0.13},-1,2,1,1,170,null,53.467845803178491,null,1,1,6,null,null,"",null,"",null,{"$f":"IF(AR10=\"\",\"\",1)","v":""},null,{"$f":"IF(AT10=\"\",\"\",1)","v":""},null,{"$f":"IF(AV10=\"\",\"\",1)","v":""},null,{"$f":"IF(AX10=\"\",\"\",1)","v":""},{"$f":"IF(AN10=\"\",\"\",VLOOKUP(AN10,[4]ItemConfig!$A:$C,3,FALSE)&AO10)","v":""},{"$f":"IF(AP10=\"\",\"\",VLOOKUP(AP10,[4]ItemConfig!$A:$C,3,FALSE)&AQ10)","v":""},{"$f":"IF(AR10=\"\",\"\",VLOOKUP(AR10,[4]ItemConfig!$A:$C,3,FALSE)&AS10)","v":""},{"$f":"IF(AT10=\"\",\"\",VLOOKUP(AT10,[4]ItemConfig!$A:$C,3,FALSE)&AU10)","v":""},{"$f":"IF(AV10=\"\",\"\",VLOOKUP(AV10,[4]ItemConfig!$A:$C,3,FALSE)&AW10)","v":""},{"$f":"IF(AX10=\"\",\"\",VLOOKUP(AX10,[4]ItemConfig!$A:$C,3,FALSE)&AY10)","v":""}]
[7,7,1,1,7,"225;235;244","练气","前期.","七重",225,235,244,{"$f":"ROUND([1]ResourceLevelConfig!$E11*[1]ResourceLevelConfig!$L11*0.1,0)*10","v":510},-1,0,-1,-1,-1,-1,{"$f":"IF(G11=G12,0,CONCATENATE(80*ROUND(VLOOKUP(B11,[2]MonsterPowerUpConfig!$A:$I,9,FALSE),0),\";\",120*ROUND(VLOOKUP(B11,[2]MonsterPowerUpConfig!$A:$I,9,FALSE),0)))","v":0},{"$f":"[3]主表!K9","v":7.8471846356431243},{"$f":"[3]主表!L9","v":1.0837951896426135},{"$f":"[3]主表!M9","v":1.0837951896426135},{"$f":"[3]主表!N9","v":0},{"$f":"[3]主表!$G9","v":228},{"$f":"[3]升级!$H9","v":1000},{"$f":"MAX(0.1,ROUND(100/(24*3600)*VLOOKUP(B11,[1]ResourceLevelConfig!$A:$E,5,FALSE),2))","v":0.13},-1,2,1,1,180,null,54.189759482130675,null,1,1,7,null,null,"",null,"",null,{"$f":"IF(AR11=\"\",\"\",1)","v":""},null,{"$f":"IF(AT11=\"\",\"\",1)","v":""},null,{"$f":"IF(AV11=\"\",\"\",1)","v":""},null,{"$f":"IF(AX11=\"\",\"\",1)","v":""},{"$f":"IF(AN11=\"\",\"\",VLOOKUP(AN11,[4]ItemConfig!$A:$C,3,FALSE)&AO11)","v":""},{"$f":"IF(AP11=\"\",\"\",VLOOKUP(AP11,[4]ItemConfig!$A:$C,3,FALSE)&AQ11)","v":""},{"$f":"IF(AR11=\"\",\"\",VLOOKUP(AR11,[4]ItemConfig!$A:$C,3,FALSE)&AS11)","v":""},{"$f":"IF(AT11=\"\",\"\",VLOOKUP(AT11,[4]ItemConfig!$A:$C,3,FALSE)&AU11)","v":""},{"$f":"IF(AV11=\"\",\"\",VLOOKUP(AV11,[4]ItemConfig!$A:$C,3,FALSE)&AW11)","v":""},{"$f":"IF(AX11=\"\",\"\",VLOOKUP(AX11,[4]ItemConfig!$A:$C,3,FALSE)&AY11)","v":""}]
[8,8,1,1,8,"225;235;245","练气","前期.","八重",225,235,245,{"$f":"ROUND([1]ResourceLevelConfig!$E12*[1]ResourceLevelConfig!$L12*0.1,0)*10","v":520},-1,0,-1,-1,-1,-1,{"$f":"IF(G12=G13,0,CONCATENATE(80*ROUND(VLOOKUP(B12,[2]MonsterPowerUpConfig!$A:$I,9,FALSE),0),\";\",120*ROUND(VLOOKUP(B12,[2]MonsterPowerUpConfig!$A:$I,9,FALSE),0)))","v":0},{"$f":"[3]主表!K10","v":8.3633016334245465},{"$f":"[3]主表!L10","v":1.0984284063139134},{"$f":"[3]主表!M10","v":1.0984284063139134},{"$f":"[3]主表!N10","v":0},{"$f":"[3]主表!$G10","v":231},{"$f":"[3]升级!$H10","v":1000},{"$f":"MAX(0.1,ROUND(100/(24*3600)*VLOOKUP(B12,[1]ResourceLevelConfig!$A:$E,5,FALSE),2))","v":0.13},-1,2,1,1,190,null,54.92142031569567,null,1,1,8,null,null,"",null,"",null,{"$f":"IF(AR12=\"\",\"\",1)","v":""},null,{"$f":"IF(AT12=\"\",\"\",1)","v":""},null,{"$f":"IF(AV12=\"\",\"\",1)","v":""},null,{"$f":"IF(AX12=\"\",\"\",1)","v":""},{"$f":"IF(AN12=\"\",\"\",VLOOKUP(AN12,[4]ItemConfig!$A:$C,3,FALSE)&AO12)","v":""},{"$f":"IF(AP12=\"\",\"\",VLOOKUP(AP12,[4]ItemConfig!$A:$C,3,FALSE)&AQ12)","v":""},{"$f":"IF(AR12=\"\",\"\",VLOOKUP(AR12,[4]ItemConfig!$A:$C,3,FALSE)&AS12)","v":""},{"$f":"IF(AT12=\"\",\"\",VLOOKUP(AT12,[4]ItemConfig!$A:$C,3,FALSE)&AU12)","v":""},{"$f":"IF(AV12=\"\",\"\",VLOOKUP(AV12,[4]ItemConfig!$A:$C,3,FALSE)&AW12)","v":""},{"$f":"IF(AX12=\"\",\"\",VLOOKUP(AX12,[4]ItemConfig!$A:$C,3,FALSE)&AY12)","v":""}]
[9,9,1,1,9,"225;235;246","练气","前期.","九重",225,235,246,{"$f":"ROUND([1]ResourceLevelConfig!$E13*[1]ResourceLevelConfig!$L13*0.1,0)*10","v":530},-1,0,-1,-1,-1,-1,{"$f":"IF(G13=G14,0,CONCATENATE(80*ROUND(VLOOKUP(B13,[2]MonsterPowerUpConfig!$A:$I,9,FALSE),0),\";\",120*ROUND(VLOOKUP(B13,[2]MonsterPowerUpConfig!$A:$I,9,FALSE),0)))","v":0},{"$f":"[3]主表!K11","v":8.8919251406662312},{"$f":"[3]主表!L11","v":1.113259198165649},{"$f":"[3]主表!M11","v":1.113259198165649},{"$f":"[3]主表!N11","v":0},{"$f":"[3]主表!$G11","v":235},{"$f":"[3]升级!$H11","v":1000},{"$f":"MAX(0.1,ROUND(100/(24*3600)*VLOOKUP(B13,[1]ResourceLevelConfig!$A:$E,5,FALSE),2))","v":0.13},-1,2,1,1,200,null,55.662959908282453,null,1,1,9,null,null,"",null,"",null,{"$f":"IF(AR13=\"\",\"\",1)","v":""},null,{"$f":"IF(AT13=\"\",\"\",1)","v":""},null,{"$f":"IF(AV13=\"\",\"\",1)","v":""},null,{"$f":"IF(AX13=\"\",\"\",1)","v":""},{"$f":"IF(AN13=\"\",\"\",VLOOKUP(AN13,[4]ItemConfig!$A:$C,3,FALSE)&AO13)","v":""},{"$f":"IF(AP13=\"\",\"\",VLOOKUP(AP13,[4]ItemConfig!$A:$C,3,FALSE)&AQ13)","v":""},{"$f":"IF(AR13=\"\",\"\",VLOOKUP(AR13,[4]ItemConfig!$A:$C,3,FALSE)&AS13)","v":""},{"$f":"IF(AT13=\"\",\"\",VLOOKUP(AT13,[4]ItemConfig!$A:$C,3,FALSE)&AU13)","v":""},{"$f":"IF(AV13=\"\",\"\",VLOOKUP(AV13,[4]ItemConfig!$A:$C,3,FALSE)&AW13)","v":""},{"$f":"IF(AX13=\"\",\"\",VLOOKUP(AX13,[4]ItemConfig!$A:$C,3,FALSE)&AY13)","v":""}]
[10,10,1,1,10,"225;235;247","练气","前期.","十重",225,235,247,{"$f":"ROUND([1]ResourceLevelConfig!$E14*[1]ResourceLevelConfig!$L14*0.1,0)*10","v":540},100004,0,{"$f":"AN14","v":1301},{"$f":"AO14","v":1},{"$f":"_xlfn.TEXTJOIN(\";\",1,AP14,AR14,AT14,AV14)","v":""},{"$f":"_xlfn.TEXTJOIN(\";\",1,AQ14,AS14,AU14,AW14)","v":""},{"$f":"IF(G14=G15,0,CONCATENATE(80*ROUND(VLOOKUP(B14,[2]MonsterPowerUpConfig!$A:$I,9,FALSE),0),\";\",120*ROUND(VLOOKUP(B14,[2]MonsterPowerUpConfig!$A:$I,9,FALSE),0)))","v":0},{"$f":"[3]主表!K12","v":9.4332987910537938},{"$f":"[3]主表!L12","v":1.1282902328240032},{"$f":"[3]主表!M12","v":1.1282902328240032},{"$f":"[3]主表!N12","v":0},{"$f":"[3]主表!$G12","v":238},{"$f":"[3]升级!$H12","v":1000},{"$f":"MAX(0.1,ROUND(100/(24*3600)*VLOOKUP(B14,[1]ResourceLevelConfig!$A:$E,5,FALSE),2))","v":0.13},20,2,1,1,210,null,56.414511641200157,null,1,1,10,null,1301,1,null,"",null,{"$f":"IF(AR14=\"\",\"\",1)","v":""},null,{"$f":"IF(AT14=\"\",\"\",1)","v":""},null,{"$f":"IF(AV14=\"\",\"\",1)","v":""},null,{"$f":"IF(AX14=\"\",\"\",1)","v":""},{"$f":"IF(AN14=\"\",\"\",VLOOKUP(AN14,[4]ItemConfig!$A:$C,3,FALSE)&AO14)","v":"淬骨丹1"},{"$f":"IF(AP14=\"\",\"\",VLOOKUP(AP14,[4]ItemConfig!$A:$C,3,FALSE)&AQ14)","v":""},{"$f":"IF(AR14=\"\",\"\",VLOOKUP(AR14,[4]ItemConfig!$A:$C,3,FALSE)&AS14)","v":""},{"$f":"IF(AT14=\"\",\"\",VLOOKUP(AT14,[4]ItemConfig!$A:$C,3,FALSE)&AU14)","v":""},{"$f":"IF(AV14=\"\",\"\",VLOOKUP(AV14,[4]ItemConfig!$A:$C,3,FALSE)&AW14)","v":""},{"$f":"IF(AX14=\"\",\"\",VLOOKUP(AX14,[4]ItemConfig!$A:$C,3,FALSE)&AY14)","v":""}]
[11,11,1,2,1,"225;236;238","练气","中期.","一重",225,236,238,{"$f":"ROUND([1]ResourceLevelConfig!$E15*[1]ResourceLevelConfig!$L15*0.1,0)*10","v":550},-1,0,-1,-1,-1,-1,{"$f":"IF(G15=G16,0,CONCATENATE(80*ROUND(VLOOKUP(B15,[2]MonsterPowerUpConfig!$A:$I,9,FALSE),0),\";\",120*ROUND(VLOOKUP(B15,[2]MonsterPowerUpConfig!$A:$I,9,FALSE),0)))","v":0},{"$f":"[3]主表!K13","v":10.840076713451081},{"$f":"[3]主表!L13","v":1.2411192561064035},{"$f":"[3]主表!M13","v":1.2411192561064035},{"$f":"[3]主表!N13","v":0},{"$f":"[3]主表!$G13","v":264},{"$f":"[3]升级!$H13","v":1000},{"$f":"MAX(0.1,ROUND(100/(24*3600)*VLOOKUP(B15,[1]ResourceLevelConfig!$A:$E,5,FALSE),2))","v":0.13},-1,2,1,1,220,null,null,null,1,1,11,null,null,"",null,"",null,{"$f":"IF(AR15=\"\",\"\",1)","v":""},null,{"$f":"IF(AT15=\"\",\"\",1)","v":""},null,{"$f":"IF(AV15=\"\",\"\",1)","v":""},null,{"$f":"IF(AX15=\"\",\"\",1)","v":""},{"$f":"IF(AN15=\"\",\"\",VLOOKUP(AN15,[4]ItemConfig!$A:$C,3,FALSE)&AO15)","v":""},{"$f":"IF(AP15=\"\",\"\",VLOOKUP(AP15,[4]ItemConfig!$A:$C,3,FALSE)&AQ15)","v":""},{"$f":"IF(AR15=\"\",\"\",VLOOKUP(AR15,[4]ItemConfig!$A:$C,3,FALSE)&AS15)","v":""},{"$f":"IF(AT15=\"\",\"\",VLOOKUP(AT15,[4]ItemConfig!$A:$C,3,FALSE)&AU15)","v":""},{"$f":"IF(AV15=\"\",\"\",VLOOKUP(AV15,[4]ItemConfig!$A:$C,3,FALSE)&AW15)","v":""},{"$f":"IF(AX15=\"\",\"\",VLOOKUP(AX15,[4]ItemConfig!$A:$C,3,FALSE)&AY15)","v":""}]
[12,12,1,2,2,"225;236;239","练气","中期.","二重",225,236,239,{"$f":"ROUND([1]ResourceLevelConfig!$E16*[1]ResourceLevelConfig!$L16*0.1,0)*10","v":560},-1,0,-1,-1,-1,-1,{"$f":"IF(G16=G17,0,CONCATENATE(80*ROUND(VLOOKUP(B16,[2]MonsterPowerUpConfig!$A:$I,9,FALSE),0),\";\",120*ROUND(VLOOKUP(B16,[2]MonsterPowerUpConfig!$A:$I,9,FALSE),0)))","v":0},{"$f":"[3]主表!K14","v":11.45614300832368},{"$f":"[3]主表!L14","v":1.2578766353262878},{"$f":"[3]主表!M14","v":1.2578766353262878},{"$f":"[3]主表!N14","v":0},{"$f":"[3]主表!$G14","v":268},{"$f":"[3]升级!$H14","v":1000},{"$f":"MAX(0.1,ROUND(100/(24*3600)*VLOOKUP(B16,[1]ResourceLevelConfig!$A:$E,5,FALSE),2))","v":0.13},-1,{"$f":"AC15","v":2},{"$f":"AD15","v":1},1,230,null,null,null,1,1,12,null,null,"",null,"",null,{"$f":"IF(AR16=\"\",\"\",1)","v":""},null,{"$f":"IF(AT16=\"\",\"\",1)","v":""},null,{"$f":"IF(AV16=\"\",\"\",1)","v":""},null,{"$f":"IF(AX16=\"\",\"\",1)","v":""},{"$f":"IF(AN16=\"\",\"\",VLOOKUP(AN16,[4]ItemConfig!$A:$C,3,FALSE)&AO16)","v":""},{"$f":"IF(AP16=\"\",\"\",VLOOKUP(AP16,[4]ItemConfig!$A:$C,3,FALSE)&AQ16)","v":""},{"$f":"IF(AR16=\"\",\"\",VLOOKUP(AR16,[4]ItemConfig!$A:$C,3,FALSE)&AS16)","v":""},{"$f":"IF(AT16=\"\",\"\",VLOOKUP(AT16,[4]ItemConfig!$A:$C,3,FALSE)&AU16)","v":""},{"$f":"IF(AV16=\"\",\"\",VLOOKUP(AV16,[4]ItemConfig!$A:$C,3,FALSE)&AW16)","v":""},{"$f":"IF(AX16=\"\",\"\",VLOOKUP(AX16,[4]ItemConfig!$A:$C,3,FALSE)&AY16)","v":""}]
[13,13,1,2,3,"225;236;240","练气","中期.","三重",225,236,240,{"$f":"ROUND([1]ResourceLevelConfig!$E17*[1]ResourceLevelConfig!$L17*0.1,0)*10","v":570},-1,0,-1,-1,-1,-1,{"$f":"IF(G17=G18,0,CONCATENATE(80*ROUND(VLOOKUP(B17,[2]MonsterPowerUpConfig!$A:$I,9,FALSE),0),\";\",120*ROUND(VLOOKUP(B17,[2]MonsterPowerUpConfig!$A:$I,9,FALSE),0)))","v":0},{"$f":"[3]主表!K15","v":12.086869206831903},{"$f":"[3]主表!L15","v":1.2748602698048324},{"$f":"[3]主表!M15","v":1.2748602698048324},{"$f":"[3]主表!N15","v":0},{"$f":"[3]主表!$G15","v":272},{"$f":"[3]升级!$H15","v":1000},{"$f":"MAX(0.1,ROUND(100/(24*3600)*VLOOKUP(B17,[1]ResourceLevelConfig!$A:$E,5,FALSE),2))","v":0.13},-1,{"$f":"AC16","v":2},{"$f":"AD16","v":1},{"$f":"AE16","v":1},240,null,null,null,1,1,13,null,null,"",null,"",null,{"$f":"IF(AR17=\"\",\"\",1)","v":""},null,{"$f":"IF(AT17=\"\",\"\",1)","v":""},null,{"$f":"IF(AV17=\"\",\"\",1)","v":""},null,{"$f":"IF(AX17=\"\",\"\",1)","v":""},{"$f":"IF(AN17=\"\",\"\",VLOOKUP(AN17,[4]ItemConfig!$A:$C,3,FALSE)&AO17)","v":""},{"$f":"IF(AP17=\"\",\"\",VLOOKUP(AP17,[4]ItemConfig!$A:$C,3,FALSE)&AQ17)","v":""},{"$f":"IF(AR17=\"\",\"\",VLOOKUP(AR17,[4]ItemConfig!$A:$C,3,FALSE)&AS17)","v":""},{"$f":"IF(AT17=\"\",\"\",VLOOKUP(AT17,[4]ItemConfig!$A:$C,3,FALSE)&AU17)","v":""},{"$f":"IF(AV17=\"\",\"\",VLOOKUP(AV17,[4]ItemConfig!$A:$C,3,FALSE)&AW17)","v":""},{"$f":"IF(AX17=\"\",\"\",VLOOKUP(AX17,[4]ItemConfig!$A:$C,3,FALSE)&AY17)","v":""}]
[14,14,1,2,4,"225;236;241","练气","中期.","四重",225,236,241,{"$f":"ROUND([1]ResourceLevelConfig!$E18*[1]ResourceLevelConfig!$L18*0.1,0)*10","v":580},-1,0,-1,-1,-1,-1,{"$f":"IF(G18=G19,0,CONCATENATE(80*ROUND(VLOOKUP(B18,[2]MonsterPowerUpConfig!$A:$I,9,FALSE),0),\";\",120*ROUND(VLOOKUP(B18,[2]MonsterPowerUpConfig!$A:$I,9,FALSE),0)))","v":0},{"$f":"[3]主表!K16","v":12.732538871484726},{"$f":"[3]主表!L16","v":1.2920732144017149},{"$f":"[3]主表!M16","v":1.2920732144017149},{"$f":"[3]主表!N16","v":0},{"$f":"[3]主表!$G16","v":276},{"$f":"[3]升级!$H16","v":1000},{"$f":"MAX(0.1,ROUND(100/(24*3600)*VLOOKUP(B18,[1]ResourceLevelConfig!$A:$E,5,FALSE),2))","v":0.13},-1,2,1,1,250,null,null,null,1,1,14,null,null,"",null,"",null,{"$f":"IF(AR18=\"\",\"\",1)","v":""},null,{"$f":"IF(AT18=\"\",\"\",1)","v":""},null,{"$f":"IF(AV18=\"\",\"\",1)","v":""},null,{"$f":"IF(AX18=\"\",\"\",1)","v":""},{"$f":"IF(AN18=\"\",\"\",VLOOKUP(AN18,[4]ItemConfig!$A:$C,3,FALSE)&AO18)","v":""},{"$f":"IF(AP18=\"\",\"\",VLOOKUP(AP18,[4]ItemConfig!$A:$C,3,FALSE)&AQ18)","v":""},{"$f":"IF(AR18=\"\",\"\",VLOOKUP(AR18,[4]ItemConfig!$A:$C,3,FALSE)&AS18)","v":""},{"$f":"IF(AT18=\"\",\"\",VLOOKUP(AT18,[4]ItemConfig!$A:$C,3,FALSE)&AU18)","v":""},{"$f":"IF(AV18=\"\",\"\",VLOOKUP(AV18,[4]ItemConfig!$A:$C,3,FALSE)&AW18)","v":""},{"$f":"IF(AX18=\"\",\"\",VLOOKUP(AX18,[4]ItemConfig!$A:$C,3,FALSE)&AY18)","v":""}]
[15,15,1,2,5,"225;236;242","练气","中期.","五重",225,236,242,{"$f":"ROUND([1]ResourceLevelConfig!$E19*[1]ResourceLevelConfig!$L19*0.1,0)*10","v":650},-1,0,-1,-1,-1,-1,{"$f":"IF(G19=G20,0,CONCATENATE(80*ROUND(VLOOKUP(B19,[2]MonsterPowerUpConfig!$A:$I,9,FALSE),0),\";\",120*ROUND(VLOOKUP(B19,[2]MonsterPowerUpConfig!$A:$I,9,FALSE),0)))","v":0},{"$f":"[3]主表!K17","v":13.393440549524598},{"$f":"[3]主表!L17","v":1.3095185652228032},{"$f":"[3]主表!M17","v":1.3095185652228032},{"$f":"[3]主表!N17","v":0},{"$f":"[3]主表!$G17","v":280},{"$f":"[3]升级!$H17","v":1000},{"$f":"MAX(0.1,ROUND(100/(24*3600)*VLOOKUP(B19,[1]ResourceLevelConfig!$A:$E,5,FALSE),2))","v":0.14000000000000001},-1,2,1,1,260,null,null,null,1,1,15,null,null,"",null,"",null,{"$f":"IF(AR19=\"\",\"\",1)","v":""},null,{"$f":"IF(AT19=\"\",\"\",1)","v":""},null,{"$f":"IF(AV19=\"\",\"\",1)","v":""},null,{"$f":"IF(AX19=\"\",\"\",1)","v":""},{"$f":"IF(AN19=\"\",\"\",VLOOKUP(AN19,[4]ItemConfig!$A:$C,3,FALSE)&AO19)","v":""},{"$f":"IF(AP19=\"\",\"\",VLOOKUP(AP19,[4]ItemConfig!$A:$C,3,FALSE)&AQ19)","v":""},{"$f":"IF(AR19=\"\",\"\",VLOOKUP(AR19,[4]ItemConfig!$A:$C,3,FALSE)&AS19)","v":""},{"$f":"IF(AT19=\"\",\"\",VLOOKUP(AT19,[4]ItemConfig!$A:$C,3,FALSE)&AU19)","v":""},{"$f":"IF(AV19=\"\",\"\",VLOOKUP(AV19,[4]ItemConfig!$A:$C,3,FALSE)&AW19)","v":""},{"$f":"IF(AX19=\"\",\"\",VLOOKUP(AX19,[4]ItemConfig!$A:$C,3,FALSE)&AY19)","v":""}]
[16,16,1,2,6,"225;236;243","练气","中期.","六重",225,236,243,{"$f":"ROUND([1]ResourceLevelConfig!$E20*[1]ResourceLevelConfig!$L20*0.1,0)*10","v":660},-1,0,-1,-1,-1,-1,{"$f":"IF(G20=G21,0,CONCATENATE(80*ROUND(VLOOKUP(B20,[2]MonsterPowerUpConfig!$A:$I,9,FALSE),0),\";\",120*ROUND(VLOOKUP(B20,[2]MonsterPowerUpConfig!$A:$I,9,FALSE),0)))","v":0},{"$f":"[3]主表!K18","v":14.069867855840208},{"$f":"[3]主表!L18","v":1.3271994601770556},{"$f":"[3]主表!M18","v":1.3271994601770556},{"$f":"[3]主表!N18","v":0},{"$f":"[3]主表!$G18","v":284},{"$f":"[3]升级!$H18","v":1000},{"$f":"MAX(0.1,ROUND(100/(24*3600)*VLOOKUP(B20,[1]ResourceLevelConfig!$A:$E,5,FALSE),2))","v":0.14000000000000001},-1,2,1,1,270,null,null,null,1,1,16,null,null,"",null,"",null,{"$f":"IF(AR20=\"\",\"\",1)","v":""},null,{"$f":"IF(AT20=\"\",\"\",1)","v":""},null,{"$f":"IF(AV20=\"\",\"\",1)","v":""},null,{"$f":"IF(AX20=\"\",\"\",1)","v":""},{"$f":"IF(AN20=\"\",\"\",VLOOKUP(AN20,[4]ItemConfig!$A:$C,3,FALSE)&AO20)","v":""},{"$f":"IF(AP20=\"\",\"\",VLOOKUP(AP20,[4]ItemConfig!$A:$C,3,FALSE)&AQ20)","v":""},{"$f":"IF(AR20=\"\",\"\",VLOOKUP(AR20,[4]ItemConfig!$A:$C,3,FALSE)&AS20)","v":""},{"$f":"IF(AT20=\"\",\"\",VLOOKUP(AT20,[4]ItemConfig!$A:$C,3,FALSE)&AU20)","v":""},{"$f":"IF(AV20=\"\",\"\",VLOOKUP(AV20,[4]ItemConfig!$A:$C,3,FALSE)&AW20)","v":""},{"$f":"IF(AX20=\"\",\"\",VLOOKUP(AX20,[4]ItemConfig!$A:$C,3,FALSE)&AY20)","v":""}]
{"$rows_left_out":285}
{"sheet":"HeroQiangDuAddConfig","index":1,"n_rows":64,"n_cols":2,"rows_kept":64,"cut":false,"hidden":false,"merged":[]}
["ID","qiangDuZhi"]
["int","float"]
[]
["ID","玩家修为境界（等级）"]
[1,1]
[2,1.085]
[3,1.17]
[4,1.2549999999999999]
[5,1.34]
[6,1.425]
[7,1.51]
[8,1.595]
[9,1.68]
[10,1.7649999999999999]
[11,1.85]
[12,1.9350000000000001]
[13,2.02]
[14,2.105]
[15,2.19]
[16,2.2749999999999999]
{"$rows_left_out":44}