{"text_format":"2","workbook":"xlsx","n_sheets":3,"sheets":["ItemConfig","ID分段","道具用途说明"],"not_rendered":{"charts":0,"images":0,"macros":0,"external_links":0,"defined_names":1,"comments":0,"pivot_tables":0},"unopened":[],"bounds":{"document_bytes":16777216,"sheet_cells":100000,"run_cost":"one","rows_first":2000,"rows_last":500,"rows_between":2000,"halvings":0,"cell_chars":16384,"cell_head_chars":4096},"cells_cut":0,"cells_raw":0,"read":"whole","date_system":"1900"}

{"sheet":"ItemConfig","index":0,"n_rows":72,"n_cols":31,"rows_kept":72,"cut":false,"hidden":false,"merged":[]}
["ID","itemName",null,"itemDesc",null,"icon","itemTag",null,"quality","stack","isSell","itemParam","rewardsNum","isVisible","isUse","useLimit","useLimtValue","costItemNum","rewardsItems","rewardsItemNums","stack","associateID","associateVlaue","sort","itemDesc"]
["int","int",null,"int",null,"string","int",null,"int","int","bool","int[]","int","int","bool","int",null,"int","int[]","int[]","int","int","int[]","int","int"]
[]
["ID1","道具名称\n","道具名\n(查看)","功能说明","功能说明","道具图标","道具分类\n见ID分段",null,"品质\n1.[物品]白\n2.[物品]绿\n3.[物品]蓝\n4.[物品]紫\n5.[物品]橙\n6.[物品]红","堆叠数量\n0.无限","是否出售","按需配置\n装备(职业;位置)","出售金额","进入背包时，是否可见","是否可用","使用限制\n0. 无\n1. 共鸣等级","限制的值","消耗道具数量","获得道具ID","获得道具的数量","堆叠数量\n0.无限","特殊功能ID\n详情见说明页","特殊功能参数\n详情见说明页","背包内排序","包装文本","包装文本","参数1","参数2","参数3","参数4","参数5"]
[1001,169,"铜钱",162,null,{"$f":"\"icon_item_\"&A5","v":"icon_item_1001"},1,{"$f":"CONCATENATE(VLOOKUP(G5,ID分段!A:B,2,FALSE),\"-\",VLOOKUP(G5,ID分段!A:C,3,FALSE))","v":"资源-货币"},2,0,0,null,0,1,0,null,null,0,0,0,0]
[1002,170,"银锭",163,null,{"$f":"\"icon_item_\"&A6","v":"icon_item_1002"},1,{"$f":"CONCATENATE(VLOOKUP(G6,ID分段!A:B,2,FALSE),\"-\",VLOOKUP(G6,ID分段!A:C,3,FALSE))","v":"资源-货币"},4,0,0,null,0,1,0,null,null,0,0,0,0]
[1003,171,"修为",164,null,"icon_item_1003",2,{"$f":"CONCATENATE(VLOOKUP(G7,ID分段!A:B,2,FALSE),\"-\",VLOOKUP(G7,ID分段!A:C,3,FALSE))","v":"资源-材料"},2,0,0,null,0,1,0,null,null,0,0,0,0]
[1004,248,"金锭",249,null,"icon_item_1004",1,{"$f":"CONCATENATE(VLOOKUP(G8,ID分段!A:B,2,FALSE),\"-\",VLOOKUP(G8,ID分段!A:C,3,FALSE))","v":"资源-货币"},5,0,0,null,0,1,0,null,null,0,0,0,0]
[1005,725,"灵气",726,null,{"$f":"\"icon_item_\"&A9","v":"icon_item_1005"},2,{"$f":"CONCATENATE(VLOOKUP(G9,ID分段!A:B,2,FALSE),\"-\",VLOOKUP(G9,ID分段!A:C,3,FALSE))","v":"资源-材料"},3,0,0,null,0,1,0,null,null,0,0,0,0]
[1006,null,"灵韵",null,null,{"$f":"\"icon_item_\"&A10","v":"icon_item_1006"},2,{"$f":"CONCATENATE(VLOOKUP(G10,ID分段!A:B,2,FALSE),\"-\",VLOOKUP(G10,ID分段!A:C,3,FALSE))","v":"资源-材料"},3,0,0,null,0,1,0,null,null,0,0,0,0]
[]
[1201,250,"渡劫丹-A1",259,null,{"$f":"\"icon_item_\"&A12","v":"icon_item_1201"},3,{"$f":"CONCATENATE(VLOOKUP(G12,ID分段!A:B,2,FALSE),\"-\",VLOOKUP(G12,ID分段!A:C,3,FALSE))","v":"资源-渡劫丹"},3,0,0,null,0,1,0,null,null,0,0,0,0,1,"1;100;10;20"]
[1202,251,"渡劫丹-A2",260,null,{"$f":"\"icon_item_\"&A13","v":"icon_item_1202"},3,{"$f":"CONCATENATE(VLOOKUP(G13,ID分段!A:B,2,FALSE),\"-\",VLOOKUP(G13,ID分段!A:C,3,FALSE))","v":"资源-渡劫丹"},4,0,0,null,0,1,0,null,null,0,0,0,0,1,"1;100;20;35"]
[1203,252,"渡劫丹-A3",261,null,"icon_item_1203",3,{"$f":"CONCATENATE(VLOOKUP(G14,ID分段!A:B,2,FALSE),\"-\",VLOOKUP(G14,ID分段!A:C,3,FALSE))","v":"资源-渡劫丹"},5,0,0,null,0,1,0,null,null,0,0,0,0,1,"1;100;30;50"]
[1204,253,"渡劫丹-B1",262,null,{"$f":"\"icon_item_\"&A15","v":"icon_item_1204"},3,{"$f":"CONCATENATE(VLOOKUP(G15,ID分段!A:B,2,FALSE),\"-\",VLOOKUP(G15,ID分段!A:C,3,FALSE))","v":"资源-渡劫丹"},3,0,0,null,0,1,0,null,null,0,0,0,0,1,"101;200;10;20"]
[1205,254,"渡劫丹-B2",263,null,"icon_item_1205",3,{"$f":"CONCATENATE(VLOOKUP(G16,ID分段!A:B,2,FALSE),\"-\",VLOOKUP(G16,ID分段!A:C,3,FALSE))","v":"资源-渡劫丹"},4,0,0,null,0,1,0,null,null,0,0,0,0,1,"101;200;20;35"]
[1206,255,"渡劫丹-B3",264,null,"icon_item_1206",3,{"$f":"CONCATENATE(VLOOKUP(G17,ID分段!A:B,2,FALSE),\"-\",VLOOKUP(G17,ID分段!A:C,3,FALSE))","v":"资源-渡劫丹"},5,0,0,null,0,1,0,null,null,0,0,0,0,1,"101;200;30;50"]
[1207,256,"渡劫丹-C1",265,null,"icon_item_1207",3,{"$f":"CONCATENATE(VLOOKUP(G18,ID分段!A:B,2,FALSE),\"-\",VLOOKUP(G18,ID分段!A:C,3,FALSE))","v":"资源-渡劫丹"},3,0,0,null,0,1,0,null,null,0,0,0,0,1,"201;300;10;20"]
[1208,257,"渡劫丹-C2",266,null,{"$f":"\"icon_item_\"&A19","v":"icon_item_1208"},3,{"$f":"CONCATENATE(VLOOKUP(G19,ID分段!A:B,2,FALSE),\"-\",VLOOKUP(G19,ID分段!A:C,3,FALSE))","v":"资源-渡劫丹"},4,0,0,null,0,1,0,null,null,0,0,0,0,1,"201;300;20;35"]
[1209,258,"渡劫丹-C3",267,null,{"$f":"\"icon_item_\"&A20","v":"icon_item_1209"},3,{"$f":"CONCATENATE(VLOOKUP(G20,ID分段!A:B,2,FALSE),\"-\",VLOOKUP(G20,ID分段!A:C,3,FALSE))","v":"资源-渡劫丹"},5,0,0,null,0,1,0,null,null,0,0,0,0,1,"201;300;30;50"]
[]
[1301,268,"天材地宝1",272,null,{"$f":"\"icon_item_\"&A22","v":"icon_item_1301"},4,{"$f":"CONCATENATE(VLOOKUP(G22,ID分段!A:B,2,FALSE),\"-\",VLOOKUP(G22,ID分段!A:C,3,FALSE))","v":"资源-天材地宝"},4,0,0,null,0,1,0,null,null,0,0,0,0,1,"1;300;10"]
[1302,269,"天材地宝2",273,null,{"$f":"\"icon_item_\"&A23","v":"icon_item_1302"},4,{"$f":"CONCATENATE(VLOOKUP(G23,ID分段!A:B,2,FALSE),\"-\",VLOOKUP(G23,ID分段!A:C,3,FALSE))","v":"资源-天材地宝"},4,0,0,null,0,1,0,null,null,0,0,0,0,1,"1;300;10"]
[1303,270,"天材地宝3",274,null,{"$f":"\"icon_item_\"&A24","v":"icon_item_1303"},4,{"$f":"CONCATENATE(VLOOKUP(G24,ID分段!A:B,2,FALSE),\"-\",VLOOKUP(G24,ID分段!A:C,3,FALSE))","v":"资源-天材地宝"},5,0,0,null,0,1,0,null,null,0,0,0,0,1,"1;300;20"]
[1304,271,"天材地宝4",275,null,{"$f":"\"icon_item_\"&A25","v":"icon_item_1304"},4,{"$f":"CONCATENATE(VLOOKUP(G25,ID分段!A:B,2,FALSE),\"-\",VLOOKUP(G25,ID分段!A:C,3,FALSE))","v":"资源-天材地宝"},6,0,0,null,0,1,0,null,null,0,0,0,0,1,"1;300;30"]
[]
[1401,276,"修为丹1",280,null,{"$f":"\"icon_item_\"&A27","v":"icon_item_1401"},5,{"$f":"CONCATENATE(VLOOKUP(G27,ID分段!A:B,2,FALSE),\"-\",VLOOKUP(G27,ID分段!A:C,3,FALSE))","v":"资源-经验丹"},2,0,0,null,0,1,0,null,null,0,0,0,0,2,500]
[1402,277,"修为丹2",281,null,"icon_item_1402",5,{"$f":"CONCATENATE(VLOOKUP(G28,ID分段!A:B,2,FALSE),\"-\",VLOOKUP(G28,ID分段!A:C,3,FALSE))","v":"资源-经验丹"},3,0,0,null,0,1,0,null,null,0,0,0,0,2,2000]
[1403,278,"修为丹3",282,null,"icon_item_1403",5,{"$f":"CONCATENATE(VLOOKUP(G29,ID分段!A:B,2,FALSE),\"-\",VLOOKUP(G29,ID分段!A:C,3,FALSE))","v":"资源-经验丹"},4,0,0,null,0,1,0,null,null,0,0,0,0,2,10000]
[1404,279,"修为丹4",283,null,"icon_item_1404",5,{"$f":"CONCATENATE(VLOOKUP(G30,ID分段!A:B,2,FALSE),\"-\",VLOOKUP(G30,ID分段!A:C,3,FALSE))","v":"资源-经验丹"},5,0,0,null,0,1,0,null,null,0,0,0,0,2,50000]
[]
[10001,284,"测试法宝",292,null,"icon_skill_10003",11,{"$f":"CONCATENATE(VLOOKUP(G32,ID分段!A:B,2,FALSE),\"-\",VLOOKUP(G32,ID分段!A:C,3,FALSE))","v":"法宝-本体"},4,0,0,null,0,1,0,null,null,0,0,0,0,4,{"$f":"_xlfn.TEXTJOIN(\";\",1,AA32:AE32)","v":"11001;901001"},null,null,null,11001,901001]
[10002,285,"翡翠葫芦",293,null,"icon_skill_10003",11,{"$f":"CONCATENATE(VLOOKUP(G33,ID分段!A:B,2,FALSE),\"-\",VLOOKUP(G33,ID分段!A:C,3,FALSE))","v":"法宝-本体"},4,0,0,null,0,1,0,null,null,0,0,0,0,4,{"$f":"_xlfn.TEXTJOIN(\";\",1,AA33:AE33)","v":"11002;901002"},null,null,null,11002,901002]
[10003,286,"玄龟盾",294,null,"icon_skill_10003",11,{"$f":"CONCATENATE(VLOOKUP(G34,ID分段!A:B,2,FALSE),\"-\",VLOOKUP(G34,ID分段!A:C,3,FALSE))","v":"法宝-本体"},4,0,0,null,0,1,0,null,null,0,0,0,0,4,"11003;901003",null,null,null,11003,901003]
[10004,287,"九幽镇魂瓶",295,null,"icon_skill_10003",11,{"$f":"CONCATENATE(VLOOKUP(G35,ID分段!A:B,2,FALSE),\"-\",VLOOKUP(G35,ID分段!A:C,3,FALSE))","v":"法宝-本体"},5,0,0,null,0,1,0,null,null,0,0,0,0,4,"11004;901004",null,null,null,11004,901004]
[10005,288,"神龙鼎",296,null,"icon_skill_10003",11,{"$f":"CONCATENATE(VLOOKUP(G36,ID分段!A:B,2,FALSE),\"-\",VLOOKUP(G36,ID分段!A:C,3,FALSE))","v":"法宝-本体"},5,0,0,null,0,1,0,null,null,0,0,0,0,4,"11005;901005",null,null,null,11005,901005]
[10006,289,"破天斧",297,null,"icon_skill_10003",11,{"$f":"CONCATENATE(VLOOKUP(G37,ID分段!A:B,2,FALSE),\"-\",VLOOKUP(G37,ID分段!A:C,3,FALSE))","v":"法宝-本体"},5,0,0,null,0,1,0,null,null,0,0,0,0,4,"11006;901006",null,null,null,11006,901006]
[10007,290,"琉璃宝塔",298,null,"icon_skill_10003",11,{"$f":"CONCATENATE(VLOOKUP(G38,ID分段!A:B,2,FALSE),\"-\",VLOOKUP(G38,ID分段!A:C,3,FALSE))","v":"法宝-本体"},6,0,0,null,0,1,0,null,null,0,0,0,0,4,"11007;901007",null,null,null,11007,901007]
[10008,291,"玉莲守心灯",299,null,"icon_skill_10003",11,{"$f":"CONCATENATE(VLOOKUP(G39,ID分段!A:B,2,FALSE),\"-\",VLOOKUP(G39,ID分段!A:C,3,FALSE))","v":"法宝-本体"},6,0,0,null,0,1,0,null,null,0,0,0,0,4,"11008;901008",null,null,null,11008,901008]
[]
[11001,300,"测试法宝碎片",308,null,"icon_skill_10003",12,{"$f":"CONCATENATE(VLOOKUP(G41,ID分段!A:B,2,FALSE),\"-\",VLOOKUP(G41,ID分段!A:C,3,FALSE))","v":"法宝-碎片"},4,0,0,null,0,1,0,null,null,0,0,0,0]
[11002,301,"翡翠葫芦碎片",309,null,"icon_skill_10003",12,{"$f":"CONCATENATE(VLOOKUP(G42,ID分段!A:B,2,FALSE),\"-\",VLOOKUP(G42,ID分段!A:C,3,FALSE))","v":"法宝-碎片"},4,0,0,null,0,1,0,null,null,0,0,0,0]
[11003,302,"玄龟盾碎片",310,null,"icon_skill_10003",12,{"$f":"CONCATENATE(VLOOKUP(G43,ID分段!A:B,2,FALSE),\"-\",VLOOKUP(G43,ID分段!A:C,3,FALSE))","v":"法宝-碎片"},4,0,0,null,0,1,0,null,null,0,0,0,0]
[11004,303,"九幽镇魂瓶碎片",311,null,"icon_skill_10003",12,{"$f":"CONCATENATE(VLOOKUP(G44,ID分段!A:B,2,FALSE),\"-\",VLOOKUP(G44,ID分段!A:C,3,FALSE))","v":"法宝-碎片"},5,0,0,null,0,1,0,null,null,0,0,0,0]
[11005,304,"神龙鼎碎片",312,null,"icon_skill_10003",12,{"$f":"CONCATENATE(VLOOKUP(G45,ID分段!A:B,2,FALSE),\"-\",VLOOKUP(G45,ID分段!A:C,3,FALSE))","v":"法宝-碎片"},5,0,0,null,0,1,0,null,null,0,0,0,0]
[11006,305,"破天斧碎片",313,null,"icon_skill_10003",12,{"$f":"CONCATENATE(VLOOKUP(G46,ID分段!A:B,2,FALSE),\"-\",VLOOKUP(G46,ID分段!A:C,3,FALSE))","v":"法宝-碎片"},5,0,0,null,0,1,0,null,null,0,0,0,0]
[11007,306,"琉璃宝塔碎片",314,null,"icon_skill_10003",12,{"$f":"CONCATENATE(VLOOKUP(G47,ID分段!A:B,2,FALSE),\"-\",VLOOKUP(G47,ID分段!A:C,3,FALSE))","v":"法宝-碎片"},6,0,0,null,0,1,0,null,null,0,0,0,0]
[11008,307,"玉莲守心灯碎片",315,null,"icon_skill_10003",12,{"$f":"CONCATENATE(VLOOKUP(G48,ID分段!A:B,2,FALSE),\"-\",VLOOKUP(G48,ID分段!A:C,3,FALSE))","v":"法宝-碎片"},6,0,0,null,0,1,0,null,null,0,0,0,0]
[]
[12001,316,"剑诀",326,null,"icon_skill_1001",13,{"$f":"CONCATENATE(VLOOKUP(G50,ID分段!A:B,2,FALSE),\"-\",VLOOKUP(G50,ID分段!A:C,3,FALSE))","v":"功法-本体"},3,0,0,null,0,1,0,null,null,0,0,0,0,3,{"$f":"_xlfn.TEXTJOIN(\";\",1,AA50:AE50)","v":"13001;1001"},null,null,null,13001,1001]
[12002,336,"烈焰斩",346,null,"icon_skill_10001",13,{"$f":"CONCATENATE(VLOOKUP(G51,ID分段!A:B,2,FALSE),\"-\",VLOOKUP(G51,ID分段!A:C,3,FALSE))","v":"功法-本体"},3,0,0,null,0,1,0,null,null,0,0,0,0,3,{"$f":"_xlfn.TEXTJOIN(\";\",1,AA51:AE51)","v":"13002;2001"},null,null,null,13002,2001]
[12003,356,"瘴影千丝术",366,null,"icon_skill_40001",13,{"$f":"CONCATENATE(VLOOKUP(G52,ID分段!A:B,2,FALSE),\"-\",VLOOKUP(G52,ID分段!A:C,3,FALSE))","v":"功法-本体"},3,0,0,null,0,1,0,null,null,0,0,0,0,3,"13003;1101",null,null,null,13003,1101]
[12004,376,"雾隐千流法",386,null,"icon_skill_40005",13,{"$f":"CONCATENATE(VLOOKUP(G53,ID分段!A:B,2,FALSE),\"-\",VLOOKUP(G53,ID分段!A:C,3,FALSE))","v":"功法-本体"},3,0,0,null,0,1,0,null,null,0,0,0,0,3,"13004;1201",null,null,null,13004,1201]
[12005,396,"碧落幽冥劲",406,null,"icon_skill_40002",13,{"$f":"CONCATENATE(VLOOKUP(G54,ID分段!A:B,2,FALSE),\"-\",VLOOKUP(G54,ID分段!A:C,3,FALSE))","v":"功法-本体"},4,0,0,null,0,1,0,null,null,0,0,0,0,3,"13005;1301",null,null,null,13005,1301]
[12006,416,"法宝秘籍",426,null,"icon_skill_30005",13,{"$f":"CONCATENATE(VLOOKUP(G55,ID分段!A:B,2,FALSE),\"-\",VLOOKUP(G55,ID分段!A:C,3,FALSE))","v":"功法-本体"},4,0,0,null,0,1,0,null,null,0,0,0,0,3,"13006;501001",null,null,null,13006,501001]
[12007,436,"双生面具",446,null,"icon_skill_20004",13,{"$f":"CONCATENATE(VLOOKUP(G56,ID分段!A:B,2,FALSE),\"-\",VLOOKUP(G56,ID分段!A:C,3,FALSE))","v":"功法-本体"},4,0,0,null,0,1,0,null,null,0,0,0,0,3,"13007;501101",null,null,null,13007,501101]
[12008,456,"火灵丹",466,null,"icon_skill_10002",13,{"$f":"CONCATENATE(VLOOKUP(G57,ID分段!A:B,2,FALSE),\"-\",VLOOKUP(G57,ID分段!A:C,3,FALSE))","v":"功法-本体"},5,0,0,null,0,1,0,null,null,0,0,0,0,3,"13008;501201",null,null,null,13008,501201]
[12009,476,"巨大化",486,null,"icon_skill_20002",13,{"$f":"CONCATENATE(VLOOKUP(G58,ID分段!A:B,2,FALSE),\"-\",VLOOKUP(G58,ID分段!A:C,3,FALSE))","v":"功法-本体"},5,0,0,null,0,1,0,null,null,0,0,0,0,3,"13009;501301",null,null,null,13009,501301]
[12010,496,"极速齿轮",506,null,"icon_skill_10004",13,{"$f":"CONCATENATE(VLOOKUP(G59,ID分段!A:B,2,FALSE),\"-\",VLOOKUP(G59,ID分段!A:C,3,FALSE))","v":"功法-本体"},5,0,0,null,0,1,0,null,null,0,0,0,0,3,"13010;501401",null,null,null,13010,501401]
[12011,516,"崩脉决",526,null,"icon_skill_20001",13,{"$f":"CONCATENATE(VLOOKUP(G60,ID分段!A:B,2,FALSE),\"-\",VLOOKUP(G60,ID分段!A:C,3,FALSE))","v":"功法-本体"},6,0,0,null,0,1,0,null,null,0,0,0,0,3,"13011;501501",null,null,null,13011,501501]
[]
[13001,727,"剑诀碎片",738,null,"icon_skill_1001",14,{"$f":"CONCATENATE(VLOOKUP(G62,ID分段!A:B,2,FALSE),\"-\",VLOOKUP(G62,ID分段!A:C,3,FALSE))","v":"功法-碎片"},3,0,0,null,0,1,0,null,null,0,0,0,0]
[13002,728,"烈焰斩碎片",738,null,"icon_skill_10001",14,{"$f":"CONCATENATE(VLOOKUP(G63,ID分段!A:B,2,FALSE),\"-\",VLOOKUP(G63,ID分段!A:C,3,FALSE))","v":"功法-碎片"},3,0,0,null,0,1,0,null,null,0,0,0,0]
[13003,729,"瘴影千丝术碎片",738,null,"icon_skill_40001",14,{"$f":"CONCATENATE(VLOOKUP(G64,ID分段!A:B,2,FALSE),\"-\",VLOOKUP(G64,ID分段!A:C,3,FALSE))","v":"功法-碎片"},3,0,0,null,0,1,0,null,null,0,0,0,0]
[13004,730,"雾隐千流法碎片",738,null,"icon_skill_40005",14,{"$f":"CONCATENATE(VLOOKUP(G65,ID分段!A:B,2,FALSE),\"-\",VLOOKUP(G65,ID分段!A:C,3,FALSE))","v":"功法-碎片"},3,0,0,null,0,1,0,null,null,0,0,0,0]
[13005,731,"碧落幽冥劲碎片",738,null,"icon_skill_40002",14,{"$f":"CONCATENATE(VLOOKUP(G66,ID分段!A:B,2,FALSE),\"-\",VLOOKUP(G66,ID分段!A:C,3,FALSE))","v":"功法-碎片"},4,0,0,null,0,1,0,null,null,0,0,0,0]
[13006,732,"法宝秘籍碎片",738,null,"icon_skill_30005",14,{"$f":"CONCATENATE(VLOOKUP(G67,ID分段!A:B,2,FALSE),\"-\",VLOOKUP(G67,ID分段!A:C,3,FALSE))","v":"功法-碎片"},4,0,0,null,0,1,0,null,null,0,0,0,0]
[13007,733,"双生面具碎片",738,null,"icon_skill_20004",14,{"$f":"CONCATENATE(VLOOKUP(G68,ID分段!A:B,2,FALSE),\"-\",VLOOKUP(G68,ID分段!A:C,3,FALSE))","v":"功法-碎片"},4,0,0,null,0,1,0,null,null,0,0,0,0]
[13008,734,"火灵丹碎片",738,null,"icon_skill_10002",14,{"$f":"CONCATENATE(VLOOKUP(G69,ID分段!A:B,2,FALSE),\"-\",VLOOKUP(G69,ID分段!A:C,3,FALSE))","v":"功法-碎片"},5,0,0,null,0,1,0,null,null,0,0,0,0]
[13009,735,"巨大化碎片",738,null,"icon_skill_20002",14,{"$f":"CONCATENATE(VLOOKUP(G70,ID分段!A:B,2,FALSE),\"-\",VLOOKUP(G70,ID分段!A:C,3,FALSE))","v":"功法-碎片"},5,0,0,null,0,1,0,null,null,0,0,0,0]
[13010,736,"极速齿轮碎片",738,null,"icon_skill_10004",14,{"$f":"CONCATENATE(VLOOKUP(G71,ID分段!A:B,2,FALSE),\"-\",VLOOKUP(G71,ID分段!A:C,3,FALSE))","v":"功法-碎片"},5,0,0,null,0,1,0,null,null,0,0,0,0]
[13011,737,"崩脉决碎片",738,null,"icon_skill_20001",14,{"$f":"CONCATENATE(VLOOKUP(G72,ID分段!A:B,2,FALSE),\"-\",VLOOKUP(G72,ID分段!A:C,3,FALSE))","v":"功法-碎片"},6,0,0,null,0,1,0,null,null,0,0,0,0]

{"sheet":"ID分段","index":1,"n_rows":11,"n_cols":6,"rows_kept":11,"cut":false,"hidden":false,"merged":[]}
["Tag","大类","小类","起始ID","结束ID","已使用"]
[1,"资源","货币",1000,1099]
[2,"资源","材料",1100,1199]
[3,"资源","渡劫丹",1200,1299]
[4,"资源","天材地宝",1300,1399]
[5,"资源","经验丹",1400,1499]
[]
[11,"法宝","本体",10000,10999]
[12,"法宝","碎片",11000,11999]
[13,"功法","本体",12000,12999]
[14,"功法","碎片",13000,13999]

{"sheet":"道具用途说明","index":2,"n_rows":8,"n_cols":2,"rows_kept":8,"cut":false,"hidden":false,"merged":[]}
["associateID","associateVlaue"]
["int","int[]"]
[]
["特殊功能ID\n","特殊功能参数\n"]
[1,"突破丹可用的下限修为等级（包含）；突破丹可用的上限修为等级（不包含）；突破丹增加的概率；突破失败可以降低的修为损耗%"]
[2,"经验丹增加的修为值"]
[3,"功法对应的碎片ID；功法对应的技能组ID"]
[4,"法宝对应的碎片ID；法宝对应的技能组ID"]