{"text_format":"2","workbook":"xlsx","n_sheets":8,"sheets":["DaoyouModelConfig","emotionConfig","daolvSkill","guajibuff","道友加成辅助","DaoyouLevelupConfig","DaoyouGiftConfig","DaoyouguajiResourcLevel"],"not_rendered":{"charts":0,"images":0,"macros":0,"external_links":3,"defined_names":1,"comments":0,"pivot_tables":0},"unopened":[],"bounds":{"document_bytes":16777216,"sheet_cells":100000,"run_cost":"one","rows_first":2000,"rows_last":500,"rows_between":2000,"halvings":0,"cell_chars":16384,"cell_head_chars":4096},"cells_cut":0,"cells_raw":0,"read":"whole","date_system":"1900"}

{"sheet":"DaoyouModelConfig","index":0,"n_rows":14,"n_cols":34,"rows_kept":14,"cut":false,"hidden":false,"merged":[]}
["ID","name",null,"quality","bodyIcon","headIcon","growupRate","des","desUnlockLv",{"$nulls":4},"PreferGiftID","shownPreferGiftID",{"$nulls":4},"guajiBuffID",{"$nulls":5},"daolvSkillID",null,"EmotionLvforQuest","EventCompleteforQuest","QuestID",null,"EmotionLvforspecialGift","specialGiftID","specialGiftNum"]
["int","int",null,"int","string","string","int","int[]","int[]",{"$nulls":4},"int[]","int[]",{"$nulls":4},"int[]",{"$nulls":5},"int[]",null,"int","int","int",null,"int[]","int[]","int[]"]
[]
["ID","名称","名称","道友品质","半身像","头像","潜力\n80=80%\n等级差","介绍","介绍解锁相熟等级",{"$nulls":4},"喜好的礼物ID","默认显示的礼物ID","喜好礼物1","喜好礼物2","喜好礼物3",null,"挂机增益类型","产出概率","产出类型1","产出类型2","产出1","产出2","成为道侣后提供的技能ID","技能1","触发道侣任务的好感度等级","触发道侣任务必须完成的事件id","道侣任务ID",null,"特殊奖励好感度等级","特殊奖励ID","特殊奖励数量"]
[1,1953,{"$f":"VLOOKUP(B5,[1]语言配置表!$A:$B,2,FALSE)","v":"雀灵儿"},2,"bg_lh_quelinger",null,90,{"$f":"_xlfn.TEXTJOIN(\";\",1,J5:L5)","v":"1963;1964;1965"},"1;3;6",1963,1964,1965,null,{"$f":"_xlfn.TEXTJOIN(\";\",1,P5:R5)","v":"13005;11001;11002"},{"$f":"P5","v":13005},13005,11001,11002,null,{"$f":"_xlfn.TEXTJOIN(\";\",1,U5:W5)","v":"30;11;23"},30,11,23,{"$f":"VLOOKUP(V5,guajibuff!$A:$C,3,FALSE)","v":"双修之旅·小"},{"$f":"VLOOKUP(W5,guajibuff!$A:$C,3,FALSE)","v":"商贾之道·大"},17,{"$f":"VLOOKUP(Z5,daolvSkill!A:E,5,FALSE)","v":"金之灵根"},4,1,6006,null,3,1703,1]
[2,1954,{"$f":"VLOOKUP(B6,[1]语言配置表!$A:$B,2,FALSE)","v":"云枝"},2,"bg_lh_chidaoren",null,90,{"$f":"_xlfn.TEXTJOIN(\";\",1,J6:L6)","v":"1966;1967;1968"},"1;3;6",1966,1967,1968,null,{"$f":"_xlfn.TEXTJOIN(\";\",1,P6:R6)","v":"13010;11003;11004"},{"$f":"P6","v":13010},13010,11003,11004,null,{"$f":"_xlfn.TEXTJOIN(\";\",1,U6:W6)","v":"30;11;33"},30,11,33,{"$f":"VLOOKUP(V6,guajibuff!$A:$C,3,FALSE)","v":"双修之旅·小"},{"$f":"VLOOKUP(W6,guajibuff!$A:$C,3,FALSE)","v":"席地论法·大"},22,{"$f":"VLOOKUP(Z6,daolvSkill!A:E,5,FALSE)","v":"水之灵根"},5,1,6016,null,4,1703,1]
[3,1955,{"$f":"VLOOKUP(B7,[1]语言配置表!$A:$B,2,FALSE)","v":"风瑶"},3,"bg_lh_fengyao",null,100,"1969;1970;1971","1;3;6",1969,1970,1971,null,"13015;11006;11005",13015,13015,11006,11005,null,"30;11;43",30,11,43,{"$f":"VLOOKUP(V7,guajibuff!$A:$C,3,FALSE)","v":"双修之旅·小"},{"$f":"VLOOKUP(W7,guajibuff!$A:$C,3,FALSE)","v":"坎山寻宝·大"},27,{"$f":"VLOOKUP(Z7,daolvSkill!A:E,5,FALSE)","v":"木之灵根"},6,1,6026,null,5,1703,1]
[4,1956,{"$f":"VLOOKUP(B8,[1]语言配置表!$A:$B,2,FALSE)","v":"婉溪"},3,"bg_lh_wanxi",null,100,"1972;1973;1974","1;3;6",1972,1973,1974,null,"13020;11008;11007",13020,13020,11008,11007,null,"30;12;22",30,12,22,{"$f":"VLOOKUP(V8,guajibuff!$A:$C,3,FALSE)","v":"双修之旅·中"},{"$f":"VLOOKUP(W8,guajibuff!$A:$C,3,FALSE)","v":"商贾之道·中"},32,{"$f":"VLOOKUP(Z8,daolvSkill!A:E,5,FALSE)","v":"火之灵根"},7,1,6036,null,4,1703,1]
[7,1959,{"$f":"VLOOKUP(B9,[1]语言配置表!$A:$B,2,FALSE)","v":"馨儿"},4,"bg_lh_xiner",null,110,"1981;1982;1983","1;3;6",1981,1982,1983,null,"13025;11010;13511",13025,13025,11010,13511,null,"30;12;32",30,12,32,{"$f":"VLOOKUP(V9,guajibuff!$A:$C,3,FALSE)","v":"双修之旅·中"},{"$f":"VLOOKUP(W9,guajibuff!$A:$C,3,FALSE)","v":"席地论法·中"},37,{"$f":"VLOOKUP(Z9,daolvSkill!A:E,5,FALSE)","v":"土之灵根"},8,1,9146,null,5,1703,1]
[8,1960,{"$f":"VLOOKUP(B10,[1]语言配置表!$A:$B,2,FALSE)","v":"柳轻烟"},4,"bg_lh_liuqingyan2",null,110,"1984;1985;1986","1;3;6",1984,1985,1986,null,"13501;13506;13512",13501,13501,13506,13512,null,"30;13;41",30,13,41,{"$f":"VLOOKUP(V10,guajibuff!$A:$C,3,FALSE)","v":"双修之旅·大"},{"$f":"VLOOKUP(W10,guajibuff!$A:$C,3,FALSE)","v":"坎山寻宝·小"},18,{"$f":"VLOOKUP(Z10,daolvSkill!A:E,5,FALSE)","v":"金之灵根"},9,1,9146,null,6,1703,1]
[5,1957,{"$f":"VLOOKUP(B11,[1]语言配置表!$A:$B,2,FALSE)","v":"许由"},4,"bg_lh_xuyou",null,100,{"$f":"_xlfn.TEXTJOIN(\";\",1,J11:L11)","v":"1975;1976;1977"},"1;3;6",1975,1976,1977,null,{"$f":"_xlfn.TEXTJOIN(\";\",1,P11:R11)","v":"13502;13507;13513"},{"$f":"P11","v":13502},13502,13507,13513,null,{"$f":"_xlfn.TEXTJOIN(\";\",1,U11:W11)","v":"30;22;33"},30,22,33,{"$f":"VLOOKUP(V11,guajibuff!$A:$C,3,FALSE)","v":"商贾之道·中"},{"$f":"VLOOKUP(W11,guajibuff!$A:$C,3,FALSE)","v":"席地论法·大"},23,{"$f":"VLOOKUP(Z11,daolvSkill!A:E,5,FALSE)","v":"水之灵根"},-1,1,-1,null,5,1703,3]
[6,1958,{"$f":"VLOOKUP(B12,[1]语言配置表!$A:$B,2,FALSE)","v":"疯道人"},5,"bg_lh_fengdaoren",null,100,{"$f":"_xlfn.TEXTJOIN(\";\",1,J12:L12)","v":"1978;1979;1980"},"1;3;6",1978,1979,1980,null,{"$f":"_xlfn.TEXTJOIN(\";\",1,P12:R12)","v":"13503;13508;13514"},{"$f":"P12","v":13503},13503,13508,13514,null,{"$f":"_xlfn.TEXTJOIN(\";\",1,U12:W12)","v":"30;32;43"},30,32,43,{"$f":"VLOOKUP(V12,guajibuff!$A:$C,3,FALSE)","v":"席地论法·中"},{"$f":"VLOOKUP(W12,guajibuff!$A:$C,3,FALSE)","v":"坎山寻宝·大"},28,{"$f":"VLOOKUP(Z12,daolvSkill!A:E,5,FALSE)","v":"木之灵根"},-1,1,-1,null,6,1703,3]
[9,1961,{"$f":"VLOOKUP(B13,[1]语言配置表!$A:$B,2,FALSE)","v":"楚云缪"},5,"bg_lh_chuyunmiao",null,100,{"$f":"_xlfn.TEXTJOIN(\";\",1,J13:L13)","v":"1987;1988;1989"},"1;3;6",1987,1988,1989,null,{"$f":"_xlfn.TEXTJOIN(\";\",1,P13:R13)","v":"13504;13509;13515"},{"$f":"P13","v":13504},13504,13509,13515,null,{"$f":"_xlfn.TEXTJOIN(\";\",1,U13:W13)","v":"30;42;23"},30,42,23,{"$f":"VLOOKUP(V13,guajibuff!$A:$C,3,FALSE)","v":"坎山寻宝·中"},{"$f":"VLOOKUP(W13,guajibuff!$A:$C,3,FALSE)","v":"商贾之道·大"},33,{"$f":"VLOOKUP(Z13,daolvSkill!A:E,5,FALSE)","v":"火之灵根"},-1,1,-1,null,7,1703,3]
[10,1962,{"$f":"VLOOKUP(B14,[1]语言配置表!$A:$B,2,FALSE)","v":"林风"},6,"bg_lh_linfeng",null,100,{"$f":"_xlfn.TEXTJOIN(\";\",1,J14:L14)","v":"1990;1991;1992"},"1;3;6",1990,1991,1992,null,{"$f":"_xlfn.TEXTJOIN(\";\",1,P14:R14)","v":"13505;13510;13516"},{"$f":"P14","v":13505},13505,13510,13516,null,{"$f":"_xlfn.TEXTJOIN(\";\",1,U14:W14)","v":"30;22;43"},30,22,43,{"$f":"VLOOKUP(V14,guajibuff!$A:$C,3,FALSE)","v":"商贾之道·中"},{"$f":"VLOOKUP(W14,guajibuff!$A:$C,3,FALSE)","v":"坎山寻宝·大"},38,{"$f":"VLOOKUP(Z14,daolvSkill!A:E,5,FALSE)","v":"土之灵根"},-1,1,-1,null,8,1703,3]

{"sheet":"emotionConfig","index":1,"n_rows":7,"n_cols":7,"rows_kept":7,"cut":false,"hidden":false,"merged":[]}
["ID","type","icon","des",null,"hanganUpRate"]
["int","int","string","int",null,"int[]"]
[]
["ID","类型\n1=好心情\n2=平衡心情\n3=坏心情","icon","描述ID","描述（策划）","心情影响好感度的范围\n100=10%"]
[1,1,null,2043,"心情很好，送他礼物可获得更多好感度","1100;1300","开心"]
[2,2,null,2044,"心情一般","900;1100","一般"]
[3,3,null,2045,"心情失落，送他礼物获得低于标准值的好感度","700;900","失落"]

{"sheet":"daolvSkill","index":2,"n_rows":44,"n_cols":11,"rows_kept":44,"cut":false,"hidden":false,"merged":[]}
["ID","AttrID","lv","name",null,"des",null,"para","type"]
["int","int","int","int",null,"int",null,"int[]","int"]
[]
["ID","对应AttributeConfig中的ID","等级","名称","名称","描述","描述","参数","类型\n1=唯一\n2=叠加","成长所需礼物ID","每单位增加的值"]
[1,101,1,2046,"生命增幅",2054,"玩家生命+{0}%",3,2]
[2,101,2,2046,"生命增幅",2054,"玩家生命+{0}%",6,2]
[3,101,3,2046,"生命增幅",2054,"玩家生命+{0}%",9,2]
[4,101,4,2046,"生命增幅",2054,"玩家生命+{0}%",12,2]
[5,101,5,2046,"生命增幅",2054,"玩家生命+{0}%",15,2]
[6,102,{"$f":"C5","v":1},2047,"攻击增幅",2055,"玩家攻击+{0}%",3,2]
[7,102,{"$f":"C6","v":2},2047,"攻击增幅",2055,"玩家攻击+{0}%",6,2]
[8,102,3,2047,"攻击增幅",2055,"玩家攻击+{0}%",9,2]
[9,102,4,2047,"攻击增幅",2055,"玩家攻击+{0}%",12,2]
[10,102,5,2047,"攻击增幅",2055,"玩家攻击+{0}%",15,2]
[11,103,1,2048,"防御增幅",2056,"玩家防御+{0}%",3,2]
[12,103,2,2048,"防御增幅",2056,"玩家防御+{0}%",6,2]
[13,103,3,2048,"防御增幅",2056,"玩家防御+{0}%",9,2]
[14,103,4,2048,"防御增幅",2056,"玩家防御+{0}%",12,2]
[15,103,5,2048,"防御增幅",2056,"玩家防御+{0}%",15,2]
[16,106,1,2049,"金之灵根",2057,"玩家金灵根+{0}",2,1]
[17,106,2,2049,"金之灵根",2057,"玩家金灵根+{0}",4,1]
[18,106,3,2049,"金之灵根",2057,"玩家金灵根+{0}",6,1]
[19,106,4,2049,"金之灵根",2057,"玩家金灵根+{0}",8,1]
[20,106,5,2049,"金之灵根",2057,"玩家金灵根+{0}",10,1]
[21,107,1,2050,"水之灵根",2058,"玩家水灵根+{0}",2,1]
[22,107,2,2050,"水之灵根",2058,"玩家水灵根+{0}",4,1]
[23,107,3,2050,"水之灵根",2058,"玩家水灵根+{0}",6,1]
[24,107,4,2050,"水之灵根",2058,"玩家水灵根+{0}",8,1]
[25,107,5,2050,"水之灵根",2058,"玩家水灵根+{0}",10,1]
[26,108,1,2051,"木之灵根",2059,"玩家木灵根+{0}",2,1]
[27,108,2,2051,"木之灵根",2059,"玩家木灵根+{0}",4,1]
[28,108,3,2051,"木之灵根",2059,"玩家木灵根+{0}",6,1]
[29,108,4,2051,"木之灵根",2059,"玩家木灵根+{0}",8,1]
[30,108,5,2051,"木之灵根",2059,"玩家木灵根+{0}",10,1]
[31,109,1,2052,"火之灵根",2060,"玩家火灵根+{0}",2,1]
[32,109,2,2052,"火之灵根",2060,"玩家火灵根+{0}",4,1]
[33,109,3,2052,"火之灵根",2060,"玩家火灵根+{0}",6,1]
[34,109,4,2052,"火之灵根",2060,"玩家火灵根+{0}",8,1]
[35,109,5,2052,"火之灵根",2060,"玩家火灵根+{0}",10,1]
[36,110,1,2053,"土之灵根",2061,"玩家土灵根+{0}",2,1]
{"$rows_left_out":5}
{"sheet":"guajibuff","index":3,"n_rows":28,"n_cols":8,"rows_kept":28,"cut":false,"hidden":false,"merged":[]}
["ID","name",null,"Quality","GivingRate","paraValue","des"]
["int","int",null,"int","int","int","int"]
[]
["ID","名称","名称","品质","产出比例\n100=100%","对应的para值","描述","说明"]
[1,2063,"慷概之心·小",1,25,5,2062,"这位道友离开时有{0}%概率赠与玩家奖励"]
[2,2064,"慷概之心·中",1,50,5,2062,"这位道友离开时有{0}%概率赠与玩家奖励"]
[3,2065,"慷概之心·大",1,75,5,2062,"这位道友离开时有{0}%概率赠与玩家奖励"]
[4,2066,"慷概之心·极",1,100,5,2062,"这位道友离开时有{0}%概率赠与玩家奖励"]
[]
[11,1993,"双修之旅·小",2,25,1,{"$f":"B10+16","v":2009},"这位道友离开时会给与玩家少量修为奖励"]
[12,1994,"双修之旅·中",3,50,1,{"$f":"B11+16","v":2010},"这位道友离开时会给与玩家一些修为奖励"]
[13,1995,"双修之旅·大",4,75,1,2011,"这位道友离开时会给与玩家很多修为奖励"]
[14,1996,"双修之旅·极",5,100,1,2012,"这位道友离开时会给与玩家丰厚修为奖励"]
[]
[21,{"$f":"B10+4","v":1997},"商贾之道·小",2,25,2,{"$f":"B15+16","v":2013},"这位道友离开时会给与玩家少量铜钱奖励"]
[22,{"$f":"B11+4","v":1998},"商贾之道·中",3,50,2,{"$f":"B16+16","v":2014},"这位道友离开时会给与玩家一些铜钱奖励"]
[23,1999,"商贾之道·大",4,75,2,2015,"这位道友离开时会给与玩家很多铜钱奖励"]
[24,2000,"商贾之道·极",5,100,2,2016,"这位道友离开时会给与玩家丰厚铜钱奖励"]
[]
[31,{"$f":"B15+4","v":2001},"席地论法·小",2,25,3,{"$f":"B20+16","v":2017},"这位道友离开时会给与玩家少量功法灵气奖励"]
[32,{"$f":"B16+4","v":2002},"席地论法·中",3,50,3,{"$f":"B21+16","v":2018},"这位道友离开时会给与玩家一些功法灵气奖励"]
[33,2003,"席地论法·大",4,75,3,2019,"这位道友离开时会给与玩家很多功法灵气奖励"]
[34,2004,"席地论法·极",5,100,3,2020,"这位道友离开时会给与玩家丰厚功法灵气奖励"]
[]
[41,{"$f":"B20+4","v":2005},"坎山寻宝·小",2,25,4,{"$f":"B25+16","v":2021},"这位道友离开时会给与玩家少量法宝灵韵奖励"]
[42,{"$f":"B21+4","v":2006},"坎山寻宝·中",3,50,4,{"$f":"B26+16","v":2022},"这位道友离开时会给与玩家一些法宝灵韵奖励"]
[43,2007,"坎山寻宝·大",4,75,4,2023,"这位道友离开时会给与玩家很多法宝灵韵奖励"]
[44,2008,"坎山寻宝·极",5,100,4,2024,"这位道友离开时会给与玩家丰厚法宝灵韵奖励"]

{"sheet":"道友加成辅助","index":4,"n_rows":14,"n_cols":3,"rows_kept":14,"cut":false,"hidden":false,"merged":[]}
["BuffType",null,"BuffValue"]
[1,"属性加成","属性ID；加成数值"]
[2]
[3]
[4]
[5]
[6]
[7]
[8]
[9]
[10]
[11]
[12]
[13]

{"sheet":"DaoyouLevelupConfig","index":5,"n_rows":14,"n_cols":7,"rows_kept":14,"cut":false,"hidden":false,"merged":[]}
["ID","name",null,"exp","prizeID","prizeNum","guajiGrowup"]
["int","int",null,"int","int[]","int[]","int"]
[]
["LV","名称",null,"升级所需经验","道具奖励ID","道具奖励数量","挂机增益成长率\n100=100%"]
[1,2025,"好感度1",1000,-1,-1,0]
[2,2026,"好感度2",2000,1701,1,100]
[3,2027,"好感度3",3000,1701,2,112]
[4,2028,"好感度4",4000,1703,1,125]
[5,2029,"好感度5",5000,1703,1,137]
[6,2030,"好感度6",6000,1703,2,150]
[7,2031,"好感度7",7000,1703,2,162]
[8,2032,"好感度8",8000,1704,1,175]
[9,2033,"好感度9",9000,1704,1,187]
[10,2034,"好感度10",-1,1704,1,200]

{"sheet":"DaoyouGiftConfig","index":6,"n_rows":89,"n_cols":4,"rows_kept":89,"cut":false,"hidden":false,"merged":[]}
["ID","ItemID",null,"emotionValue"]
["int","int",null,"int"]
[]
["ID","道具ID","道具名称","默认增加的好感度值"]
[1,1501,{"$f":"VLOOKUP(B5,[2]ItemConfig!$A:$C,3,FALSE)","v":"清茶"},300]
[2,1502,{"$f":"VLOOKUP(B6,[2]ItemConfig!$A:$C,3,FALSE)","v":"茉莉花茶"},500]
[]
[301,1201,{"$f":"VLOOKUP(B8,[2]ItemConfig!$A:$C,3,FALSE)","v":"灵血草"},100]
[302,1202,{"$f":"VLOOKUP(B9,[2]ItemConfig!$A:$C,3,FALSE)","v":"玄玉髓"},100]
[303,1203,{"$f":"VLOOKUP(B10,[2]ItemConfig!$A:$C,3,FALSE)","v":"赤阳砂"},100]
[304,1204,{"$f":"VLOOKUP(B11,[2]ItemConfig!$A:$C,3,FALSE)","v":"火灵果"},100]
[305,1205,{"$f":"VLOOKUP(B12,[2]ItemConfig!$A:$C,3,FALSE)","v":"婴魂草"},100]
[306,1206,{"$f":"VLOOKUP(B13,[2]ItemConfig!$A:$C,3,FALSE)","v":"灵魄藤"},100]
[307,1207,{"$f":"VLOOKUP(B14,[2]ItemConfig!$A:$C,3,FALSE)","v":"灵冥石"},100]
[308,1208,{"$f":"VLOOKUP(B15,[2]ItemConfig!$A:$C,3,FALSE)","v":"玄金砂"},100]
[309,1209,{"$f":"VLOOKUP(B16,[2]ItemConfig!$A:$C,3,FALSE)","v":"紫玄晶"},100]
[310,1210,{"$f":"VLOOKUP(B17,[2]ItemConfig!$A:$C,3,FALSE)","v":"丹心花"},100]
[311,1211,{"$f":"VLOOKUP(B18,[2]ItemConfig!$A:$C,3,FALSE)","v":"太冥草"},100]
[312,1212,{"$f":"VLOOKUP(B19,[2]ItemConfig!$A:$C,3,FALSE)","v":"星炎草"},100]
[313,1213,{"$f":"VLOOKUP(B20,[2]ItemConfig!$A:$C,3,FALSE)","v":"混元晶"},100]
[314,1214,{"$f":"VLOOKUP(B21,[2]ItemConfig!$A:$C,3,FALSE)","v":"地髓晶"},100]
[315,1215,{"$f":"VLOOKUP(B22,[2]ItemConfig!$A:$C,3,FALSE)","v":"灵月石"},100]
[316,1216,{"$f":"VLOOKUP(B23,[2]ItemConfig!$A:$C,3,FALSE)","v":"玄雷果"},100]
[317,1217,{"$f":"VLOOKUP(B24,[2]ItemConfig!$A:$C,3,FALSE)","v":"龙筋草"},100]
[318,1218,{"$f":"VLOOKUP(B25,[2]ItemConfig!$A:$C,3,FALSE)","v":"太虚花"},100]
[319,1219,{"$f":"VLOOKUP(B26,[2]ItemConfig!$A:$C,3,FALSE)","v":"升仙丹"},100]
[320,1220,{"$f":"VLOOKUP(B27,[2]ItemConfig!$A:$C,3,FALSE)","v":"归虚花"},100]
[321,1221,{"$f":"VLOOKUP(B28,[2]ItemConfig!$A:$C,3,FALSE)","v":"真阳骨"},100]
[322,1222,{"$f":"VLOOKUP(B29,[2]ItemConfig!$A:$C,3,FALSE)","v":"太玄髓"},100]
[323,1223,{"$f":"VLOOKUP(B30,[2]ItemConfig!$A:$C,3,FALSE)","v":"离魄花"},100]
[324,1224,{"$f":"VLOOKUP(B31,[2]ItemConfig!$A:$C,3,FALSE)","v":"裂界藤"},100]
[325,1225,{"$f":"VLOOKUP(B32,[2]ItemConfig!$A:$C,3,FALSE)","v":"寂灭沙"},100]
[326,1226,{"$f":"VLOOKUP(B33,[2]ItemConfig!$A:$C,3,FALSE)","v":"天罡心核"},100]
[]
[501,13001,{"$f":"VLOOKUP(B35,[2]ItemConfig!$A:$C,3,FALSE)","v":"太虚幻剑经碎片"},1]
[502,13002,{"$f":"VLOOKUP(B36,[2]ItemConfig!$A:$C,3,FALSE)","v":"天罡剑气诀碎片"},1]
[503,13003,{"$f":"VLOOKUP(B37,[2]ItemConfig!$A:$C,3,FALSE)","v":"血刃金煌功碎片"},1]
[504,13004,{"$f":"VLOOKUP(B38,[2]ItemConfig!$A:$C,3,FALSE)","v":"飞刃碎片"},1]
[505,13005,{"$f":"VLOOKUP(B39,[2]ItemConfig!$A:$C,3,FALSE)","v":"金针碎片"},1]
[506,13006,{"$f":"VLOOKUP(B40,[2]ItemConfig!$A:$C,3,FALSE)","v":"碧落幽冥劲碎片"},1]
{"$rows_left_out":50}
{"sheet":"DaoyouguajiResourcLevel","index":7,"n_rows":304,"n_cols":6,"rows_kept":304,"cut":false,"hidden":false,"merged":[]}
["ID","para1","para2","para3","para4","para5"]
["int","int","int","int","int","int"]
[]
["ID","玩家修为产出","铜钱产出","功法灵气","法宝灵韵","赠与概率"]
[1,{"$f":"ROUND([3]ResourceLevelConfig!$E5*0.05,0)","v":5},{"$f":"ROUND([3]ResourceLevelConfig!$C5*0.05,0)","v":50},{"$f":"ROUND([3]ResourceLevelConfig!$G5*0.05,0)","v":3},{"$f":"ROUND([3]ResourceLevelConfig!$H5*0.05,0)","v":3},201]
[2,{"$f":"ROUND([3]ResourceLevelConfig!$E6*0.05,0)","v":5},{"$f":"ROUND([3]ResourceLevelConfig!$C6*0.05,0)","v":51},{"$f":"ROUND([3]ResourceLevelConfig!$G6*0.05,0)","v":3},{"$f":"ROUND([3]ResourceLevelConfig!$H6*0.05,0)","v":3},202]
[3,{"$f":"ROUND([3]ResourceLevelConfig!$E7*0.05,0)","v":5},{"$f":"ROUND([3]ResourceLevelConfig!$C7*0.05,0)","v":51},{"$f":"ROUND([3]ResourceLevelConfig!$G7*0.05,0)","v":3},{"$f":"ROUND([3]ResourceLevelConfig!$H7*0.05,0)","v":3},203]
[4,{"$f":"ROUND([3]ResourceLevelConfig!$E8*0.05,0)","v":5},{"$f":"ROUND([3]ResourceLevelConfig!$C8*0.05,0)","v":52},{"$f":"ROUND([3]ResourceLevelConfig!$G8*0.05,0)","v":3},{"$f":"ROUND([3]ResourceLevelConfig!$H8*0.05,0)","v":3},204]
[5,{"$f":"ROUND([3]ResourceLevelConfig!$E9*0.05,0)","v":5},{"$f":"ROUND([3]ResourceLevelConfig!$C9*0.05,0)","v":52},{"$f":"ROUND([3]ResourceLevelConfig!$G9*0.05,0)","v":3},{"$f":"ROUND([3]ResourceLevelConfig!$H9*0.05,0)","v":3},205]
[6,{"$f":"ROUND([3]ResourceLevelConfig!$E10*0.05,0)","v":6},{"$f":"ROUND([3]ResourceLevelConfig!$C10*0.05,0)","v":53},{"$f":"ROUND([3]ResourceLevelConfig!$G10*0.05,0)","v":3},{"$f":"ROUND([3]ResourceLevelConfig!$H10*0.05,0)","v":3},206]
[7,{"$f":"ROUND([3]ResourceLevelConfig!$E11*0.05,0)","v":6},{"$f":"ROUND([3]ResourceLevelConfig!$C11*0.05,0)","v":53},{"$f":"ROUND([3]ResourceLevelConfig!$G11*0.05,0)","v":3},{"$f":"ROUND([3]ResourceLevelConfig!$H11*0.05,0)","v":3},207]
[8,{"$f":"ROUND([3]ResourceLevelConfig!$E12*0.05,0)","v":6},{"$f":"ROUND([3]ResourceLevelConfig!$C12*0.05,0)","v":54},{"$f":"ROUND([3]ResourceLevelConfig!$G12*0.05,0)","v":3},{"$f":"ROUND([3]ResourceLevelConfig!$H12*0.05,0)","v":3},208]
[9,{"$f":"ROUND([3]ResourceLevelConfig!$E13*0.05,0)","v":6},{"$f":"ROUND([3]ResourceLevelConfig!$C13*0.05,0)","v":54},{"$f":"ROUND([3]ResourceLevelConfig!$G13*0.05,0)","v":3},{"$f":"ROUND([3]ResourceLevelConfig!$H13*0.05,0)","v":3},209]
[10,{"$f":"ROUND([3]ResourceLevelConfig!$E14*0.05,0)","v":6},{"$f":"ROUND([3]ResourceLevelConfig!$C14*0.05,0)","v":55},{"$f":"ROUND([3]ResourceLevelConfig!$G14*0.05,0)","v":3},{"$f":"ROUND([3]ResourceLevelConfig!$H14*0.05,0)","v":3},210]
[11,{"$f":"ROUND([3]ResourceLevelConfig!$E15*0.05,0)","v":6},{"$f":"ROUND([3]ResourceLevelConfig!$C15*0.05,0)","v":55},{"$f":"ROUND([3]ResourceLevelConfig!$G15*0.05,0)","v":3},{"$f":"ROUND([3]ResourceLevelConfig!$H15*0.05,0)","v":3},211]
[12,{"$f":"ROUND([3]ResourceLevelConfig!$E16*0.05,0)","v":6},{"$f":"ROUND([3]ResourceLevelConfig!$C16*0.05,0)","v":56},{"$f":"ROUND([3]ResourceLevelConfig!$G16*0.05,0)","v":3},{"$f":"ROUND([3]ResourceLevelConfig!$H16*0.05,0)","v":3},212]
[13,{"$f":"ROUND([3]ResourceLevelConfig!$E17*0.05,0)","v":6},{"$f":"ROUND([3]ResourceLevelConfig!$C17*0.05,0)","v":56},{"$f":"ROUND([3]ResourceLevelConfig!$G17*0.05,0)","v":3},{"$f":"ROUND([3]ResourceLevelConfig!$H17*0.05,0)","v":3},213]
[14,{"$f":"ROUND([3]ResourceLevelConfig!$E18*0.05,0)","v":6},{"$f":"ROUND([3]ResourceLevelConfig!$C18*0.05,0)","v":57},{"$f":"ROUND([3]ResourceLevelConfig!$G18*0.05,0)","v":3},{"$f":"ROUND([3]ResourceLevelConfig!$H18*0.05,0)","v":3},214]
[15,{"$f":"ROUND([3]ResourceLevelConfig!$E19*0.05,0)","v":6},{"$f":"ROUND([3]ResourceLevelConfig!$C19*0.05,0)","v":58},{"$f":"ROUND([3]ResourceLevelConfig!$G19*0.05,0)","v":3},{"$f":"ROUND([3]ResourceLevelConfig!$H19*0.05,0)","v":3},215]
[16,{"$f":"ROUND([3]ResourceLevelConfig!$E20*0.05,0)","v":6},{"$f":"ROUND([3]ResourceLevelConfig!$C20*0.05,0)","v":58},{"$f":"ROUND([3]ResourceLevelConfig!$G20*0.05,0)","v":3},{"$f":"ROUND([3]ResourceLevelConfig!$H20*0.05,0)","v":3},216]
[17,{"$f":"ROUND([3]ResourceLevelConfig!$E21*0.05,0)","v":6},{"$f":"ROUND([3]ResourceLevelConfig!$C21*0.05,0)","v":59},{"$f":"ROUND([3]ResourceLevelConfig!$G21*0.05,0)","v":3},{"$f":"ROUND([3]ResourceLevelConfig!$H21*0.05,0)","v":3},217]
[18,{"$f":"ROUND([3]ResourceLevelConfig!$E22*0.05,0)","v":6},{"$f":"ROUND([3]ResourceLevelConfig!$C22*0.05,0)","v":59},{"$f":"ROUND([3]ResourceLevelConfig!$G22*0.05,0)","v":3},{"$f":"ROUND([3]ResourceLevelConfig!$H22*0.05,0)","v":3},218]
[19,{"$f":"ROUND([3]ResourceLevelConfig!$E23*0.05,0)","v":6},{"$f":"ROUND([3]ResourceLevelConfig!$C23*0.05,0)","v":60},{"$f":"ROUND([3]ResourceLevelConfig!$G23*0.05,0)","v":3},{"$f":"ROUND([3]ResourceLevelConfig!$H23*0.05,0)","v":3},219]
[20,{"$f":"ROUND([3]ResourceLevelConfig!$E24*0.05,0)","v":6},{"$f":"ROUND([3]ResourceLevelConfig!$C24*0.05,0)","v":61},{"$f":"ROUND([3]ResourceLevelConfig!$G24*0.05,0)","v":3},{"$f":"ROUND([3]ResourceLevelConfig!$H24*0.05,0)","v":3},220]
[21,{"$f":"ROUND([3]ResourceLevelConfig!$E25*0.05,0)","v":6},{"$f":"ROUND([3]ResourceLevelConfig!$C25*0.05,0)","v":61},{"$f":"ROUND([3]ResourceLevelConfig!$G25*0.05,0)","v":4},{"$f":"ROUND([3]ResourceLevelConfig!$H25*0.05,0)","v":4},221]
[22,{"$f":"ROUND([3]ResourceLevelConfig!$E26*0.05,0)","v":6},{"$f":"ROUND([3]ResourceLevelConfig!$C26*0.05,0)","v":62},{"$f":"ROUND([3]ResourceLevelConfig!$G26*0.05,0)","v":4},{"$f":"ROUND([3]ResourceLevelConfig!$H26*0.05,0)","v":4},222]
[23,{"$f":"ROUND([3]ResourceLevelConfig!$E27*0.05,0)","v":6},{"$f":"ROUND([3]ResourceLevelConfig!$C27*0.05,0)","v":62},{"$f":"ROUND([3]ResourceLevelConfig!$G27*0.05,0)","v":4},{"$f":"ROUND([3]ResourceLevelConfig!$H27*0.05,0)","v":4},223]
[24,{"$f":"ROUND([3]ResourceLevelConfig!$E28*0.05,0)","v":7},{"$f":"ROUND([3]ResourceLevelConfig!$C28*0.05,0)","v":63},{"$f":"ROUND([3]ResourceLevelConfig!$G28*0.05,0)","v":4},{"$f":"ROUND([3]ResourceLevelConfig!$H28*0.05,0)","v":4},224]
[25,{"$f":"ROUND([3]ResourceLevelConfig!$E29*0.05,0)","v":7},{"$f":"ROUND([3]ResourceLevelConfig!$C29*0.05,0)","v":64},{"$f":"ROUND([3]ResourceLevelConfig!$G29*0.05,0)","v":4},{"$f":"ROUND([3]ResourceLevelConfig!$H29*0.05,0)","v":4},225]
[26,{"$f":"ROUND([3]ResourceLevelConfig!$E30*0.05,0)","v":7},{"$f":"ROUND([3]ResourceLevelConfig!$C30*0.05,0)","v":64},{"$f":"ROUND([3]ResourceLevelConfig!$G30*0.05,0)","v":4},{"$f":"ROUND([3]ResourceLevelConfig!$H30*0.05,0)","v":4},226]
[27,{"$f":"ROUND([3]ResourceLevelConfig!$E31*0.05,0)","v":7},{"$f":"ROUND([3]ResourceLevelConfig!$C31*0.05,0)","v":65},{"$f":"ROUND([3]ResourceLevelConfig!$G31*0.05,0)","v":4},{"$f":"ROUND([3]ResourceLevelConfig!$H31*0.05,0)","v":4},227]
[28,{"$f":"ROUND([3]ResourceLevelConfig!$E32*0.05,0)","v":7},{"$f":"ROUND([3]ResourceLevelConfig!$C32*0.05,0)","v":66},{"$f":"ROUND([3]ResourceLevelConfig!$G32*0.05,0)","v":4},{"$f":"ROUND([3]ResourceLevelConfig!$H32*0.05,0)","v":4},228]
[29,{"$f":"ROUND([3]ResourceLevelConfig!$E33*0.05,0)","v":7},{"$f":"ROUND([3]ResourceLevelConfig!$C33*0.05,0)","v":66},{"$f":"ROUND([3]ResourceLevelConfig!$G33*0.05,0)","v":4},{"$f":"ROUND([3]ResourceLevelConfig!$H33*0.05,0)","v":4},229]
[30,{"$f":"ROUND([3]ResourceLevelConfig!$E34*0.05,0)","v":7},{"$f":"ROUND([3]ResourceLevelConfig!$C34*0.05,0)","v":67},{"$f":"ROUND([3]ResourceLevelConfig!$G34*0.05,0)","v":4},{"$f":"ROUND([3]ResourceLevelConfig!$H34*0.05,0)","v":4},230]
[31,{"$f":"ROUND([3]ResourceLevelConfig!$E35*0.05,0)","v":7},{"$f":"ROUND([3]ResourceLevelConfig!$C35*0.05,0)","v":68},{"$f":"ROUND([3]ResourceLevelConfig!$G35*0.05,0)","v":4},{"$f":"ROUND([3]ResourceLevelConfig!$H35*0.05,0)","v":4},231]
[32,{"$f":"ROUND([3]ResourceLevelConfig!$E36*0.05,0)","v":7},{"$f":"ROUND([3]ResourceLevelConfig!$C36*0.05,0)","v":68},{"$f":"ROUND([3]ResourceLevelConfig!$G36*0.05,0)","v":4},{"$f":"ROUND([3]ResourceLevelConfig!$H36*0.05,0)","v":4},232]
[33,{"$f":"ROUND([3]ResourceLevelConfig!$E37*0.05,0)","v":7},{"$f":"ROUND([3]ResourceLevelConfig!$C37*0.05,0)","v":69},{"$f":"ROUND([3]ResourceLevelConfig!$G37*0.05,0)","v":4},{"$f":"ROUND([3]ResourceLevelConfig!$H37*0.05,0)","v":4},233]
[34,{"$f":"ROUND([3]ResourceLevelConfig!$E38*0.05,0)","v":7},{"$f":"ROUND([3]ResourceLevelConfig!$C38*0.05,0)","v":70},{"$f":"ROUND([3]ResourceLevelConfig!$G38*0.05,0)","v":4},{"$f":"ROUND([3]ResourceLevelConfig!$H38*0.05,0)","v":4},234]
[35,{"$f":"ROUND([3]ResourceLevelConfig!$E39*0.05,0)","v":7},{"$f":"ROUND([3]ResourceLevelConfig!$C39*0.05,0)","v":70},{"$f":"ROUND([3]ResourceLevelConfig!$G39*0.05,0)","v":4},{"$f":"ROUND([3]ResourceLevelConfig!$H39*0.05,0)","v":4},235]
[36,{"$f":"ROUND([3]ResourceLevelConfig!$E40*0.05,0)","v":7},{"$f":"ROUND([3]ResourceLevelConfig!$C40*0.05,0)","v":71},{"$f":"ROUND([3]ResourceLevelConfig!$G40*0.05,0)","v":4},{"$f":"ROUND([3]ResourceLevelConfig!$H40*0.05,0)","v":4},236]
{"$rows_left_out":264}