{"text_format":"2","workbook":"xlsx","n_sheets":3,"sheets":["SkiptoConfig","跳转参数详情","解锁参数详情"],"not_rendered":{"charts":0,"images":0,"macros":0,"external_links":1,"defined_names":2,"comments":0,"pivot_tables":0},"unopened":[],"bounds":{"document_bytes":16777216,"sheet_cells":100000,"run_cost":"one","rows_first":2000,"rows_last":500,"rows_between":2000,"halvings":0,"cell_chars":16384,"cell_head_chars":4096},"cells_cut":0,"cells_raw":0,"read":"whole","date_system":"1900"}

{"sheet":"SkiptoConfig","index":0,"n_rows":9,"n_cols":12,"rows_kept":9,"cut":false,"hidden":false,"merged":[]}
["ID","SkipType","SkipID","SkipArguments",null,"SkipTxt",null,"UnlockType","UnlockPara1","UnlockPara2"]
["int","int","int","int[]",null,"int",null,"int","int[]","int"]
[]
["ID","跳转类型","跳转ID\n填写方法见附页","跳转参数\n填写方法见附页","跳转到哪里","跳转来源语言表ID","玩家看到的显示文字","该跳转解锁条件类型","该跳转解锁条件参数","该跳转在不可跳转时给玩家看的【达成条件】语言表","该条件的解锁条件","该跳转在不可跳转时给玩家看的【达成条件】文本"]
[1,1,1,-1,{"$f":"VLOOKUP(C5,跳转参数详情!A:B,2,FALSE)","v":"功法"},10107,{"$f":"IF(F5>0,VLOOKUP(F5,[1]語言配置表!$A:$B,2,FALSE),\"\")","v":"功法"},1,null,null,{"$f":"IF(H5=\"\",\"\",VLOOKUP(H5,解锁参数详情!A:B,2,FALSE))","v":"需要满足unlock表中的ID解锁"}]
[2,2,2,-1,{"$f":"VLOOKUP(C6,跳转参数详情!A:B,2,FALSE)","v":"法宝"},10108,{"$f":"IF(F6>0,VLOOKUP(F6,[1]語言配置表!$A:$B,2,FALSE),\"\")","v":"法宝"},null,null,null,{"$f":"IF(H6=\"\",\"\",VLOOKUP(H6,解锁参数详情!A:B,2,FALSE))","v":""}]
[3,3,3,-1,{"$f":"VLOOKUP(C7,跳转参数详情!A:B,2,FALSE)","v":"洞府"},10109,{"$f":"IF(F7>0,VLOOKUP(F7,[1]語言配置表!$A:$B,2,FALSE),\"\")","v":"洞府"},null,null,null,{"$f":"IF(H7=\"\",\"\",VLOOKUP(H7,解锁参数详情!A:B,2,FALSE))","v":""}]
[4,4,4,-1,{"$f":"VLOOKUP(C8,跳转参数详情!A:B,2,FALSE)","v":"商店"},10110,{"$f":"IF(F8>0,VLOOKUP(F8,[1]語言配置表!$A:$B,2,FALSE),\"\")","v":"商店"},null,null,null,{"$f":"IF(H8=\"\",\"\",VLOOKUP(H8,解锁参数详情!A:B,2,FALSE))","v":""}]
[5,5,5,-1,{"$f":"VLOOKUP(C9,跳转参数详情!A:B,2,FALSE)","v":"使用神识"},10111,{"$f":"IF(F9>0,VLOOKUP(F9,[1]語言配置表!$A:$B,2,FALSE),\"\")","v":"使用神识"},null,null,null,{"$f":"IF(H9=\"\",\"\",VLOOKUP(H9,解锁参数详情!A:B,2,FALSE))","v":""}]

{"sheet":"跳转参数详情","index":1,"n_rows":6,"n_cols":3,"rows_kept":6,"cut":false,"hidden":false,"merged":[]}
["跳转ID","跳转功能","参数"]
[1,"功法"]
[2,"法宝"]
[3,"洞府"]
[4,"商店"]
[5,"使用神识"]

{"sheet":"解锁参数详情","index":2,"n_rows":2,"n_cols":5,"rows_kept":2,"cut":false,"hidden":false,"merged":[]}
["跳转ID","解锁逻辑","参数1","参数2","参数3"]
[1,"需要满足unlock表中的ID解锁","UnlockID"]