{"text_format":"2","workbook":"xlsx","n_sheets":3,"sheets":["ShopGroupConfig","ShopConfig","ShopItemConfig"],"not_rendered":{"charts":0,"images":0,"macros":0,"external_links":2,"defined_names":3,"comments":0,"pivot_tables":0},"unopened":[],"bounds":{"document_bytes":16777216,"sheet_cells":100000,"run_cost":"one","rows_first":2000,"rows_last":500,"rows_between":2000,"halvings":0,"cell_chars":16384,"cell_head_chars":4096},"cells_cut":0,"cells_raw":0,"read":"whole","date_system":"1900"}

{"sheet":"ShopGroupConfig","index":0,"n_rows":5,"n_cols":9,"rows_kept":5,"cut":false,"hidden":false,"merged":[]}
["ID",null,"sortNum","shopName","RefreshType","refreshCostItemId","refreshCost","refreshLimit"]
["int",null,"int","int","int","int","int[]","int"]
[]
["ID","商店名（策划用）","选项卡排序\n-小的在前面","商店名\n（左侧列表中名字）","刷新类型\n0=不刷新\n1=每日自动刷新\n2=每周自动刷新\n3=每月自动刷新\n4=按开启时间固定间隔自动刷新\n","刷新消耗道具ID\n（此列不为-1时，可以手动刷新）","刷新消耗道具数量\n（刷新次数增加消耗会改变，0表示免费)","周期内刷新次数上限（如果有手动刷新，必须要填次数）","备注"]
[1,{"$f":"VLOOKUP(D5,[1]語言配置表!$A:$B,2,FALSE)","v":"GM商店"},1,1900,1,-1,-1,-1]

{"sheet":"ShopConfig","index":1,"n_rows":10,"n_cols":13,"rows_kept":10,"cut":false,"hidden":false,"merged":[]}
["ID",null,"shopName","shopDesc","shopShowTemplate","shopShowTemplateParm","shopGroup","unlockType","unlockValue","unlockMessage","shopItemID","pageSortNum","continueTime"]
["int",null,"int","int","int","string[]","int","int","int[]","int","int","int","int"]
[]
["ID","商店名\n（策划用）","品名","商品介绍","商品表现的模板","商品表现的模板de参数","页签所属商店","解锁条件\n0=无\n1=关卡\n2=共鸣等级","解锁参数","解锁描述","对应的商品ID","页签排序\n（小的在前面）","持续时间（分钟）\n(-1永久)"]
[1,null,{"$f":"VLOOKUP(VLOOKUP(K5,ShopItemConfig!A:C,3,FALSE),[2]ItemConfig!$A:$B,2,FALSE)","v":169},null,3,"icon_Coin",1,0,0,0,1,1,-1]
[2,null,{"$f":"VLOOKUP(VLOOKUP(K6,ShopItemConfig!A:C,3,FALSE),[2]ItemConfig!$A:$B,2,FALSE)","v":170},null,3,"icon_Coins_s",1,0,0,0,2,2,-1]
[3,null,{"$f":"VLOOKUP(VLOOKUP(K7,ShopItemConfig!A:C,3,FALSE),[2]ItemConfig!$A:$B,2,FALSE)","v":171},null,3,"icon_Gem_Star_Blue",1,0,0,0,3,3,-1]
[4,null,{"$f":"VLOOKUP(VLOOKUP(K8,ShopItemConfig!A:C,3,FALSE),[2]ItemConfig!$A:$B,2,FALSE)","v":248},null,3,"icon_Demo_Gem04",1,0,0,0,4,4,-1]
[5,null,{"$f":"VLOOKUP(VLOOKUP(K9,ShopItemConfig!A:C,3,FALSE),[2]ItemConfig!$A:$B,2,FALSE)","v":725},null,3,"icon_GradeBadge_Master",1,0,0,0,5,5,-1]
[6,null,{"$f":"VLOOKUP(VLOOKUP(K10,ShopItemConfig!A:C,3,FALSE),[2]ItemConfig!$A:$B,2,FALSE)","v":1400},null,3,"icon_GradeBadge_Challenger",1,0,0,0,6,6,-1]

{"sheet":"ShopItemConfig","index":2,"n_rows":10,"n_cols":10,"rows_kept":10,"cut":false,"hidden":false,"merged":[]}
["ID","giftID","itemId","itemCount","costItemId","price","oldPrice","buyCount","maxBuyCount"]
["int","string","int[]","int[]","int","int","int","int","int"]
[]
["ID","分发ID\n（appstore等分发礼包时使用）","包含道具ID","道具数量","消耗道具ID\n\n0 = 免费\n1032 = 广告","现价\n（玩家购买价）","原价","可买次数\n(当期)\n-1=不限制","最大购买次数\n(全局)\n-1=不限制"]
[1,null,1001,9999,1001,0,1,-1,-1,{"$f":"CONCATENATE(VLOOKUP(C5,[2]ItemConfig!$A:$C,3,FALSE),\" × \",D5)","v":"铜钱 × 9999"}]
[2,null,1002,9999,1001,1,1,-1,-1,{"$f":"CONCATENATE(VLOOKUP(C6,[2]ItemConfig!$A:$C,3,FALSE),\" × \",D6)","v":"银锭 × 9999"}]
[3,null,1003,9999,1001,1,1,-1,-1,{"$f":"CONCATENATE(VLOOKUP(C7,[2]ItemConfig!$A:$C,3,FALSE),\" × \",D7)","v":"修为 × 9999"}]
[4,null,1004,9999,1001,1,1,-1,-1,{"$f":"CONCATENATE(VLOOKUP(C8,[2]ItemConfig!$A:$C,3,FALSE),\" × \",D8)","v":"金锭 × 9999"}]
[5,null,1005,9999,1001,1,1,-1,-1,{"$f":"CONCATENATE(VLOOKUP(C9,[2]ItemConfig!$A:$C,3,FALSE),\" × \",D9)","v":"功法灵气 × 9999"}]
[6,null,1006,9999,1001,1,1,-1,-1,{"$f":"CONCATENATE(VLOOKUP(C10,[2]ItemConfig!$A:$C,3,FALSE),\" × \",D10)","v":"法宝灵韵 × 9999"}]