{"text_format":"2","workbook":"xlsx","n_sheets":3,"sheets":["ItemConfig","ID分段","道具用途说明"],"not_rendered":{"charts":0,"images":0,"macros":0,"external_links":0,"defined_names":1,"comments":0,"pivot_tables":0},"unopened":[],"bounds":{"document_bytes":16777216,"sheet_cells":100000,"run_cost":"one","rows_first":2000,"rows_last":500,"rows_between":2000,"halvings":0,"cell_chars":16384,"cell_head_chars":4096},"cells_cut":0,"cells_raw":0,"read":"whole","date_system":"1900"}

{"sheet":"ItemConfig","index":0,"n_rows":133,"n_cols":31,"rows_kept":133,"cut":false,"hidden":false,"merged":[]}
["ID","itemName",null,"itemDesc",null,"icon","itemTag",null,"quality","stack","isSell","itemParam","rewardsNum","isVisible","isUse","useLimit","useLimtValue","costItemNum","rewardsItems","rewardsItemNums","stack","associateID","associateVlaue","sort","itemDesc"]
["int","int",null,"int",null,"string","int",null,"int","int","bool","int[]","int","int","bool","int",null,"int","int[]","int[]","int","int","int[]","int","int"]
[]
["ID1","道具名称\n","道具名\n(查看)","功能说明","功能说明","道具图标","道具分类\n见ID分段",null,"品质\n1.[物品]白\n2.[物品]绿\n3.[物品]蓝\n4.[物品]紫\n5.[物品]橙\n6.[物品]红","堆叠数量\n0.无限","是否出售","按需配置\n装备(职业;位置)","出售金额","进入背包时，是否可见","是否可用","使用限制\n0. 无\n1. 共鸣等级","限制的值","消耗道具数量","获得道具ID","获得道具的数量","堆叠数量\n0.无限","特殊功能ID\n详情见说明页","特殊功能参数\n详情见说明页","背包内排序","包装文本","包装文本","参数1","参数2","参数3","参数4","参数5"]
[1001,169,"铜钱",162,null,"icon_Coin",1,{"$f":"CONCATENATE(VLOOKUP(G5,ID分段!A:B,2,FALSE),\"-\",VLOOKUP(G5,ID分段!A:C,3,FALSE))","v":"资源-货币"},2,0,0,null,0,1,0,null,null,0,0,0,0]
[1002,170,"银锭",163,null,"icon_Coins_s",1,{"$f":"CONCATENATE(VLOOKUP(G6,ID分段!A:B,2,FALSE),\"-\",VLOOKUP(G6,ID分段!A:C,3,FALSE))","v":"资源-货币"},4,0,0,null,0,1,0,null,null,0,0,0,0]
[1003,171,"修为",164,null,"icon_Gem_Star_Blue",2,{"$f":"CONCATENATE(VLOOKUP(G7,ID分段!A:B,2,FALSE),\"-\",VLOOKUP(G7,ID分段!A:C,3,FALSE))","v":"资源-材料"},2,0,0,null,0,1,0,null,null,0,0,0,0]
[1004,248,"金锭",249,null,"icon_Demo_Gem04",1,{"$f":"CONCATENATE(VLOOKUP(G8,ID分段!A:B,2,FALSE),\"-\",VLOOKUP(G8,ID分段!A:C,3,FALSE))","v":"资源-货币"},5,0,0,null,0,1,0,null,null,0,0,0,0]
[1005,725,"功法灵气",726,null,"icon_GradeBadge_Master",2,{"$f":"CONCATENATE(VLOOKUP(G9,ID分段!A:B,2,FALSE),\"-\",VLOOKUP(G9,ID分段!A:C,3,FALSE))","v":"资源-材料"},3,0,0,null,0,1,0,null,null,0,0,0,0]
[1006,1400,"法宝灵韵",1401,null,"icon_GradeBadge_Challenger",2,{"$f":"CONCATENATE(VLOOKUP(G10,ID分段!A:B,2,FALSE),\"-\",VLOOKUP(G10,ID分段!A:C,3,FALSE))","v":"资源-材料"},3,0,0,null,0,1,0,null,null,0,0,0,0]
[]
[1201,250,"渡劫丹-A1",259,null,{"$f":"\"icon_item_\"&A12","v":"icon_item_1201"},3,{"$f":"CONCATENATE(VLOOKUP(G12,ID分段!A:B,2,FALSE),\"-\",VLOOKUP(G12,ID分段!A:C,3,FALSE))","v":"资源-渡劫丹"},3,0,0,null,0,1,0,null,null,0,0,0,0,1,"1;100;10;20"]
[1202,251,"渡劫丹-A2",260,null,{"$f":"\"icon_item_\"&A13","v":"icon_item_1202"},3,{"$f":"CONCATENATE(VLOOKUP(G13,ID分段!A:B,2,FALSE),\"-\",VLOOKUP(G13,ID分段!A:C,3,FALSE))","v":"资源-渡劫丹"},4,0,0,null,0,1,0,null,null,0,0,0,0,1,"1;100;20;35"]
[1203,252,"渡劫丹-A3",261,null,"icon_item_1203",3,{"$f":"CONCATENATE(VLOOKUP(G14,ID分段!A:B,2,FALSE),\"-\",VLOOKUP(G14,ID分段!A:C,3,FALSE))","v":"资源-渡劫丹"},5,0,0,null,0,1,0,null,null,0,0,0,0,1,"1;100;30;50"]
[1204,253,"渡劫丹-B1",262,null,{"$f":"\"icon_item_\"&A15","v":"icon_item_1204"},3,{"$f":"CONCATENATE(VLOOKUP(G15,ID分段!A:B,2,FALSE),\"-\",VLOOKUP(G15,ID分段!A:C,3,FALSE))","v":"资源-渡劫丹"},3,0,0,null,0,1,0,null,null,0,0,0,0,1,"101;200;10;20"]
[1205,254,"渡劫丹-B2",263,null,"icon_item_1205",3,{"$f":"CONCATENATE(VLOOKUP(G16,ID分段!A:B,2,FALSE),\"-\",VLOOKUP(G16,ID分段!A:C,3,FALSE))","v":"资源-渡劫丹"},4,0,0,null,0,1,0,null,null,0,0,0,0,1,"101;200;20;35"]
[1206,255,"渡劫丹-B3",264,null,"icon_item_1206",3,{"$f":"CONCATENATE(VLOOKUP(G17,ID分段!A:B,2,FALSE),\"-\",VLOOKUP(G17,ID分段!A:C,3,FALSE))","v":"资源-渡劫丹"},5,0,0,null,0,1,0,null,null,0,0,0,0,1,"101;200;30;50"]
[1207,256,"渡劫丹-C1",265,null,"icon_item_1207",3,{"$f":"CONCATENATE(VLOOKUP(G18,ID分段!A:B,2,FALSE),\"-\",VLOOKUP(G18,ID分段!A:C,3,FALSE))","v":"资源-渡劫丹"},3,0,0,null,0,1,0,null,null,0,0,0,0,1,"201;300;10;20"]
[1208,257,"渡劫丹-C2",266,null,{"$f":"\"icon_item_\"&A19","v":"icon_item_1208"},3,{"$f":"CONCATENATE(VLOOKUP(G19,ID分段!A:B,2,FALSE),\"-\",VLOOKUP(G19,ID分段!A:C,3,FALSE))","v":"资源-渡劫丹"},4,0,0,null,0,1,0,null,null,0,0,0,0,1,"201;300;20;35"]
[1209,258,"渡劫丹-C3",267,null,{"$f":"\"icon_item_\"&A20","v":"icon_item_1209"},3,{"$f":"CONCATENATE(VLOOKUP(G20,ID分段!A:B,2,FALSE),\"-\",VLOOKUP(G20,ID分段!A:C,3,FALSE))","v":"资源-渡劫丹"},5,0,0,null,0,1,0,null,null,0,0,0,0,1,"201;300;30;50"]
[]
[1301,268,"天材地宝1",272,null,{"$f":"\"icon_item_\"&A22","v":"icon_item_1301"},4,{"$f":"CONCATENATE(VLOOKUP(G22,ID分段!A:B,2,FALSE),\"-\",VLOOKUP(G22,ID分段!A:C,3,FALSE))","v":"资源-天材地宝"},4,0,0,null,0,1,0,null,null,0,0,0,0,1,"1;300;10"]
[1302,269,"天材地宝2",273,null,{"$f":"\"icon_item_\"&A23","v":"icon_item_1302"},4,{"$f":"CONCATENATE(VLOOKUP(G23,ID分段!A:B,2,FALSE),\"-\",VLOOKUP(G23,ID分段!A:C,3,FALSE))","v":"资源-天材地宝"},4,0,0,null,0,1,0,null,null,0,0,0,0,1,"1;300;10"]
[1303,270,"天材地宝3",274,null,{"$f":"\"icon_item_\"&A24","v":"icon_item_1303"},4,{"$f":"CONCATENATE(VLOOKUP(G24,ID分段!A:B,2,FALSE),\"-\",VLOOKUP(G24,ID分段!A:C,3,FALSE))","v":"资源-天材地宝"},5,0,0,null,0,1,0,null,null,0,0,0,0,1,"1;300;20"]
[1304,271,"天材地宝4",275,null,{"$f":"\"icon_item_\"&A25","v":"icon_item_1304"},4,{"$f":"CONCATENATE(VLOOKUP(G25,ID分段!A:B,2,FALSE),\"-\",VLOOKUP(G25,ID分段!A:C,3,FALSE))","v":"资源-天材地宝"},6,0,0,null,0,1,0,null,null,0,0,0,0,1,"1;300;30"]
[]
[1401,276,"修为丹·下",280,null,{"$f":"\"icon_item_\"&A27","v":"icon_item_1401"},5,{"$f":"CONCATENATE(VLOOKUP(G27,ID分段!A:B,2,FALSE),\"-\",VLOOKUP(G27,ID分段!A:C,3,FALSE))","v":"资源-经验丹"},2,0,0,null,0,1,0,null,null,0,0,0,0,2,500]
[1402,277,"修为丹·中",281,null,"icon_item_1402",5,{"$f":"CONCATENATE(VLOOKUP(G28,ID分段!A:B,2,FALSE),\"-\",VLOOKUP(G28,ID分段!A:C,3,FALSE))","v":"资源-经验丹"},3,0,0,null,0,1,0,null,null,0,0,0,0,2,2000]
[1403,278,"修为丹·上",282,null,"icon_item_1403",5,{"$f":"CONCATENATE(VLOOKUP(G29,ID分段!A:B,2,FALSE),\"-\",VLOOKUP(G29,ID分段!A:C,3,FALSE))","v":"资源-经验丹"},4,0,0,null,0,1,0,null,null,0,0,0,0,2,10000]
[1404,279,"修为丹·极",283,null,"icon_item_1404",5,{"$f":"CONCATENATE(VLOOKUP(G30,ID分段!A:B,2,FALSE),\"-\",VLOOKUP(G30,ID分段!A:C,3,FALSE))","v":"资源-经验丹"},5,0,0,null,0,1,0,null,null,0,0,0,0,2,50000]
[]
[1501,1947,"好感度礼物1",1949,{"$f":"CONCATENATE(\"道具描述_\",C32)","v":"道具描述_好感度礼物1"},{"$f":"\"icon_item_\"&A32","v":"icon_item_1501"},6,{"$f":"CONCATENATE(VLOOKUP(G32,ID分段!A:B,2,FALSE),\"-\",VLOOKUP(G32,ID分段!A:C,3,FALSE))","v":"资源-好感度礼物"},3,0,0,null,0,1,0,null,null,0,0,0,0,0,0]
[1502,1948,"好感度礼物2",1950,{"$f":"CONCATENATE(\"道具描述_\",C33)","v":"道具描述_好感度礼物2"},{"$f":"\"icon_item_\"&A33","v":"icon_item_1502"},6,{"$f":"CONCATENATE(VLOOKUP(G33,ID分段!A:B,2,FALSE),\"-\",VLOOKUP(G33,ID分段!A:C,3,FALSE))","v":"资源-好感度礼物"},4,0,0,null,0,1,0,null,null,0,0,0,0,0,0]
[]
[1601,1951,"心情礼物1",1952,{"$f":"CONCATENATE(\"道具描述_\",C35)","v":"道具描述_心情礼物1"},{"$f":"\"icon_item_\"&A35","v":"icon_item_1601"},7,{"$f":"CONCATENATE(VLOOKUP(G35,ID分段!A:B,2,FALSE),\"-\",VLOOKUP(G35,ID分段!A:C,3,FALSE))","v":"资源-心情礼物"},2,0,0,null,0,1,0,null,null,0,0,0,0,5,10]
[]
[10001,284,"神龙鼎",292,null,"icon_item_10001",11,{"$f":"CONCATENATE(VLOOKUP(G37,ID分段!A:B,2,FALSE),\"-\",VLOOKUP(G37,ID分段!A:C,3,FALSE))","v":"法宝-本体"},3,0,0,null,0,1,0,null,null,0,0,0,0,4,{"$f":"_xlfn.TEXTJOIN(\";\",1,AA37:AE37)","v":"11001;3101"},null,null,null,11001,3101]
[10002,285,"破天斧",293,null,"icon_item_10002",11,{"$f":"CONCATENATE(VLOOKUP(G38,ID分段!A:B,2,FALSE),\"-\",VLOOKUP(G38,ID分段!A:C,3,FALSE))","v":"法宝-本体"},4,0,0,null,0,1,0,null,null,0,0,0,0,4,{"$f":"_xlfn.TEXTJOIN(\";\",1,AA38:AE38)","v":"11002;3102"},null,null,null,11002,3102]
[10003,286,"翡翠葫芦",294,null,"icon_item_10003",11,{"$f":"CONCATENATE(VLOOKUP(G39,ID分段!A:B,2,FALSE),\"-\",VLOOKUP(G39,ID分段!A:C,3,FALSE))","v":"法宝-本体"},3,0,0,null,0,1,0,null,null,0,0,0,0,4,"11003;3201",null,null,null,11003,3201]
[10004,287,"混沌珠",295,null,"icon_item_10004",11,{"$f":"CONCATENATE(VLOOKUP(G40,ID分段!A:B,2,FALSE),\"-\",VLOOKUP(G40,ID分段!A:C,3,FALSE))","v":"法宝-本体"},4,0,0,null,0,1,0,null,null,0,0,0,0,4,"11004;3202",null,null,null,11004,3202]
[10005,288,"琉璃宝塔",296,null,"icon_item_10005",11,{"$f":"CONCATENATE(VLOOKUP(G41,ID分段!A:B,2,FALSE),\"-\",VLOOKUP(G41,ID分段!A:C,3,FALSE))","v":"法宝-本体"},5,0,0,null,0,1,0,null,null,0,0,0,0,4,"11005;3203",null,null,null,11005,3203]
[10006,289,"九幽镇魂瓶",297,null,"icon_item_10006",11,{"$f":"CONCATENATE(VLOOKUP(G42,ID分段!A:B,2,FALSE),\"-\",VLOOKUP(G42,ID分段!A:C,3,FALSE))","v":"法宝-本体"},3,0,0,null,0,1,0,null,null,0,0,0,0,4,"11006;3301",null,null,null,11006,3301]
[10007,290,"玉莲守心灯",298,null,"icon_item_10007",11,{"$f":"CONCATENATE(VLOOKUP(G43,ID分段!A:B,2,FALSE),\"-\",VLOOKUP(G43,ID分段!A:C,3,FALSE))","v":"法宝-本体"},4,0,0,null,0,1,0,null,null,0,0,0,0,4,"11007;3302",null,null,null,11007,3302]
[10008,291,"融灵塔",299,null,"icon_item_10008",11,{"$f":"CONCATENATE(VLOOKUP(G44,ID分段!A:B,2,FALSE),\"-\",VLOOKUP(G44,ID分段!A:C,3,FALSE))","v":"法宝-本体"},3,0,0,null,0,1,0,null,null,0,0,0,0,4,"11008;3401",null,null,null,11008,3401]
[10009,1402,"禁元珠",1405,null,"icon_item_10009",11,{"$f":"CONCATENATE(VLOOKUP(G45,ID分段!A:B,2,FALSE),\"-\",VLOOKUP(G45,ID分段!A:C,3,FALSE))","v":"法宝-本体"},4,0,0,null,0,1,0,null,null,0,0,0,0,4,{"$f":"_xlfn.TEXTJOIN(\";\",1,AA45:AE45)","v":"11009;3402"},null,null,null,11009,3402]
[10010,1403,"玄龟盾",1406,null,"icon_item_10010",11,{"$f":"CONCATENATE(VLOOKUP(G46,ID分段!A:B,2,FALSE),\"-\",VLOOKUP(G46,ID分段!A:C,3,FALSE))","v":"法宝-本体"},3,0,0,null,0,1,0,null,null,0,0,0,0,4,"11010;3501",null,null,null,11010,3501]
[10011,1404,"天殇血刃剑",1407,null,{"$f":"\"icon_item_\"&A47","v":"icon_item_10011"},11,{"$f":"CONCATENATE(VLOOKUP(G47,ID分段!A:B,2,FALSE),\"-\",VLOOKUP(G47,ID分段!A:C,3,FALSE))","v":"法宝-本体"},4,0,0,null,0,1,0,null,null,0,0,0,0,4,{"$f":"_xlfn.TEXTJOIN(\";\",1,AA47:AE47)","v":"11011;3502"},null,null,null,11011,3502]
[]
[11001,300,"神龙鼎碎片",308,null,"icon_item_11001",12,{"$f":"CONCATENATE(VLOOKUP(G49,ID分段!A:B,2,FALSE),\"-\",VLOOKUP(G49,ID分段!A:C,3,FALSE))","v":"法宝-碎片"},3,0,0,null,0,1,0,null,null,0,0,0,0]
[11002,301,"破天斧碎片",309,null,"icon_item_11002",12,{"$f":"CONCATENATE(VLOOKUP(G50,ID分段!A:B,2,FALSE),\"-\",VLOOKUP(G50,ID分段!A:C,3,FALSE))","v":"法宝-碎片"},4,0,0,null,0,1,0,null,null,0,0,0,0]
[11003,302,"翡翠葫芦碎片",310,null,"icon_item_11003",12,{"$f":"CONCATENATE(VLOOKUP(G51,ID分段!A:B,2,FALSE),\"-\",VLOOKUP(G51,ID分段!A:C,3,FALSE))","v":"法宝-碎片"},3,0,0,null,0,1,0,null,null,0,0,0,0]
[11004,303,"混沌珠碎片",311,null,"icon_item_11004",12,{"$f":"CONCATENATE(VLOOKUP(G52,ID分段!A:B,2,FALSE),\"-\",VLOOKUP(G52,ID分段!A:C,3,FALSE))","v":"法宝-碎片"},4,0,0,null,0,1,0,null,null,0,0,0,0]
[11005,304,"琉璃宝塔碎片",312,null,"icon_item_11005",12,{"$f":"CONCATENATE(VLOOKUP(G53,ID分段!A:B,2,FALSE),\"-\",VLOOKUP(G53,ID分段!A:C,3,FALSE))","v":"法宝-碎片"},5,0,0,null,0,1,0,null,null,0,0,0,0]
[11006,305,"九幽镇魂瓶碎片",313,null,"icon_item_11006",12,{"$f":"CONCATENATE(VLOOKUP(G54,ID分段!A:B,2,FALSE),\"-\",VLOOKUP(G54,ID分段!A:C,3,FALSE))","v":"法宝-碎片"},3,0,0,null,0,1,0,null,null,0,0,0,0]
[11007,306,"玉莲守心灯碎片",314,null,"icon_item_11007",12,{"$f":"CONCATENATE(VLOOKUP(G55,ID分段!A:B,2,FALSE),\"-\",VLOOKUP(G55,ID分段!A:C,3,FALSE))","v":"法宝-碎片"},4,0,0,null,0,1,0,null,null,0,0,0,0]
[11008,307,"融灵塔碎片",315,null,"icon_item_11008",12,{"$f":"CONCATENATE(VLOOKUP(G56,ID分段!A:B,2,FALSE),\"-\",VLOOKUP(G56,ID分段!A:C,3,FALSE))","v":"法宝-碎片"},3,0,0,null,0,1,0,null,null,0,0,0,0]
[11009,1408,"禁元珠碎片",1411,null,"icon_item_11009",12,{"$f":"CONCATENATE(VLOOKUP(G57,ID分段!A:B,2,FALSE),\"-\",VLOOKUP(G57,ID分段!A:C,3,FALSE))","v":"法宝-碎片"},4,0,0,null,0,1,0,null,null,0,0,0,0]
[11010,1409,"玄龟盾碎片",1412,null,"icon_item_11010",12,{"$f":"CONCATENATE(VLOOKUP(G58,ID分段!A:B,2,FALSE),\"-\",VLOOKUP(G58,ID分段!A:C,3,FALSE))","v":"法宝-碎片"},3,0,0,null,0,1,0,null,null,0,0,0,0]
[11011,1410,"天殇血刃剑碎片",1413,null,{"$f":"\"icon_item_\"&A59","v":"icon_item_11011"},12,{"$f":"CONCATENATE(VLOOKUP(G59,ID分段!A:B,2,FALSE),\"-\",VLOOKUP(G59,ID分段!A:C,3,FALSE))","v":"法宝-碎片"},4,0,0,null,0,1,0,null,null,0,0,0,0]
[]
[12001,1414,"太虚幻剑经",1500,"功法-金1","icon_item_12001",13,{"$f":"CONCATENATE(VLOOKUP(G61,ID分段!A:B,2,FALSE),\"-\",VLOOKUP(G61,ID分段!A:C,3,FALSE))","v":"功法-本体"},5,0,0,null,0,1,0,null,null,0,0,0,0,3,{"$f":"_xlfn.TEXTJOIN(\";\",1,AA61:AE61)","v":"13001;1101"},null,null,null,13001,1101]
[12002,1415,"天罡剑气诀",1501,"功法-金2","icon_item_12002",13,{"$f":"CONCATENATE(VLOOKUP(G62,ID分段!A:B,2,FALSE),\"-\",VLOOKUP(G62,ID分段!A:C,3,FALSE))","v":"功法-本体"},5,0,0,null,0,1,0,null,null,0,0,0,0,3,{"$f":"_xlfn.TEXTJOIN(\";\",1,AA62:AE62)","v":"13002;1102"},null,null,null,13002,1102]
[12003,1416,"血刃金煌功",1502,"功法-金3","icon_item_12003",13,{"$f":"CONCATENATE(VLOOKUP(G63,ID分段!A:B,2,FALSE),\"-\",VLOOKUP(G63,ID分段!A:C,3,FALSE))","v":"功法-本体"},5,0,0,null,0,1,0,null,null,0,0,0,0,3,"13003;1103",null,null,null,13003,1103]
[12004,1417,"飞刃",1503,"功法-金4","icon_item_12004",13,{"$f":"CONCATENATE(VLOOKUP(G64,ID分段!A:B,2,FALSE),\"-\",VLOOKUP(G64,ID分段!A:C,3,FALSE))","v":"功法-本体"},4,0,0,null,0,1,0,null,null,0,0,0,0,3,"13004;1104",null,null,null,13004,1104]
[12005,1418,"金针",1504,"功法-金5","icon_item_12005",13,{"$f":"CONCATENATE(VLOOKUP(G65,ID分段!A:B,2,FALSE),\"-\",VLOOKUP(G65,ID分段!A:C,3,FALSE))","v":"功法-本体"},3,0,0,null,0,1,0,null,null,0,0,0,0,3,"13005;1105",null,null,null,13005,1105]
[12006,1419,"碧落幽冥劲",1505,"功法-水1","icon_item_12006",13,{"$f":"CONCATENATE(VLOOKUP(G66,ID分段!A:B,2,FALSE),\"-\",VLOOKUP(G66,ID分段!A:C,3,FALSE))","v":"功法-本体"},5,0,0,null,0,1,0,null,null,0,0,0,0,3,"13006;1201",null,null,null,13006,1201]
[12007,1420,"雾隐千流法",1506,"功法-水2","icon_item_12007",13,{"$f":"CONCATENATE(VLOOKUP(G67,ID分段!A:B,2,FALSE),\"-\",VLOOKUP(G67,ID分段!A:C,3,FALSE))","v":"功法-本体"},5,0,0,null,0,1,0,null,null,0,0,0,0,3,"13007;1202",null,null,null,13007,1202]
[12008,1421,"功法-水3",1507,"功法-水3","icon_item_12008",13,{"$f":"CONCATENATE(VLOOKUP(G68,ID分段!A:B,2,FALSE),\"-\",VLOOKUP(G68,ID分段!A:C,3,FALSE))","v":"功法-本体"},5,0,0,null,0,1,0,null,null,0,0,0,0,3,"13008;1203",null,null,null,13008,1203]
[12009,1422,"水球",1508,"功法-水4","icon_item_12009",13,{"$f":"CONCATENATE(VLOOKUP(G69,ID分段!A:B,2,FALSE),\"-\",VLOOKUP(G69,ID分段!A:C,3,FALSE))","v":"功法-本体"},4,0,0,null,0,1,0,null,null,0,0,0,0,3,"13009;1204",null,null,null,13009,1204]
[12010,1423,"冰刀",1509,"功法-水5","icon_item_12010",13,{"$f":"CONCATENATE(VLOOKUP(G70,ID分段!A:B,2,FALSE),\"-\",VLOOKUP(G70,ID分段!A:C,3,FALSE))","v":"功法-本体"},3,0,0,null,0,1,0,null,null,0,0,0,0,3,"13010;1205",null,null,null,13010,1205]
[12011,1424,"瘴影千丝术",1510,"功法-木1","icon_item_12011",13,{"$f":"CONCATENATE(VLOOKUP(G71,ID分段!A:B,2,FALSE),\"-\",VLOOKUP(G71,ID分段!A:C,3,FALSE))","v":"功法-本体"},5,0,0,null,0,1,0,null,null,0,0,0,0,3,"13011;1301",null,null,null,13011,1301]
[12012,1425,"蚀骨腐血掌",1511,"功法-木2",{"$f":"\"icon_item_\"&A72","v":"icon_item_12012"},13,{"$f":"CONCATENATE(VLOOKUP(G72,ID分段!A:B,2,FALSE),\"-\",VLOOKUP(G72,ID分段!A:C,3,FALSE))","v":"功法-本体"},5,0,0,null,0,1,0,null,null,0,0,0,0,3,{"$f":"_xlfn.TEXTJOIN(\";\",1,AA72:AE72)","v":"13012;1302"},null,null,null,13012,1302]
[12013,1426,"功法-木3",1512,"功法-木3","icon_item_12013",13,{"$f":"CONCATENATE(VLOOKUP(G73,ID分段!A:B,2,FALSE),\"-\",VLOOKUP(G73,ID分段!A:C,3,FALSE))","v":"功法-本体"},5,0,0,null,0,1,0,null,null,0,0,0,0,3,{"$f":"_xlfn.TEXTJOIN(\";\",1,AA73:AE73)","v":"13013;1303"},null,null,null,13013,1303]
[12014,1427,"竹刺",1513,"功法-木4","icon_item_12014",13,{"$f":"CONCATENATE(VLOOKUP(G74,ID分段!A:B,2,FALSE),\"-\",VLOOKUP(G74,ID分段!A:C,3,FALSE))","v":"功法-本体"},4,0,0,null,0,1,0,null,null,0,0,0,0,3,"13014;1304",null,null,null,13014,1304]
[12015,1428,"飞叶",1514,"功法-木5","icon_item_12015",13,{"$f":"CONCATENATE(VLOOKUP(G75,ID分段!A:B,2,FALSE),\"-\",VLOOKUP(G75,ID分段!A:C,3,FALSE))","v":"功法-本体"},3,0,0,null,0,1,0,null,null,0,0,0,0,3,"13015;1305",null,null,null,13015,1305]
[12016,1429,"烈焰剑",1515,"功法-火1","icon_item_12016",13,{"$f":"CONCATENATE(VLOOKUP(G76,ID分段!A:B,2,FALSE),\"-\",VLOOKUP(G76,ID分段!A:C,3,FALSE))","v":"功法-本体"},5,0,0,null,0,1,0,null,null,0,0,0,0,3,"13016;1401",null,null,null,13016,1401]
[12017,1430,"赤焰龙吟功",1516,"功法-火2","icon_item_12017",13,{"$f":"CONCATENATE(VLOOKUP(G77,ID分段!A:B,2,FALSE),\"-\",VLOOKUP(G77,ID分段!A:C,3,FALSE))","v":"功法-本体"},5,0,0,null,0,1,0,null,null,0,0,0,0,3,"13017;1402",null,null,null,13017,1402]
[12018,1431,"朱雀燎原指",1517,"功法-火3","icon_item_12018",13,{"$f":"CONCATENATE(VLOOKUP(G78,ID分段!A:B,2,FALSE),\"-\",VLOOKUP(G78,ID分段!A:C,3,FALSE))","v":"功法-本体"},5,0,0,null,0,1,0,null,null,0,0,0,0,3,"13018;1403",null,null,null,13018,1403]
[12019,1432,"火球",1518,"功法-火4","icon_item_12019",13,{"$f":"CONCATENATE(VLOOKUP(G79,ID分段!A:B,2,FALSE),\"-\",VLOOKUP(G79,ID分段!A:C,3,FALSE))","v":"功法-本体"},4,0,0,null,0,1,0,null,null,0,0,0,0,3,"13019;1404",null,null,null,13019,1404]
[12020,1433,"火刀",1519,"功法-火5","icon_item_12020",13,{"$f":"CONCATENATE(VLOOKUP(G80,ID分段!A:B,2,FALSE),\"-\",VLOOKUP(G80,ID分段!A:C,3,FALSE))","v":"功法-本体"},3,0,0,null,0,1,0,null,null,0,0,0,0,3,"13020;1405",null,null,null,13020,1405]
[12021,1434,"黄尘灭魂刺",1520,"功法-土1","icon_item_12021",13,{"$f":"CONCATENATE(VLOOKUP(G81,ID分段!A:B,2,FALSE),\"-\",VLOOKUP(G81,ID分段!A:C,3,FALSE))","v":"功法-本体"},5,0,0,null,0,1,0,null,null,0,0,0,0,3,"13021;1501",null,null,null,13021,1501]
[12022,1435,"地裂屠龙斩",1521,"功法-土2","icon_item_12022",13,{"$f":"CONCATENATE(VLOOKUP(G82,ID分段!A:B,2,FALSE),\"-\",VLOOKUP(G82,ID分段!A:C,3,FALSE))","v":"功法-本体"},5,0,0,null,0,1,0,null,null,0,0,0,0,3,"13022;1502",null,null,null,13022,1502]
[12023,1436,"功法-土3",1522,"功法-土3",{"$f":"\"icon_item_\"&A83","v":"icon_item_12023"},13,{"$f":"CONCATENATE(VLOOKUP(G83,ID分段!A:B,2,FALSE),\"-\",VLOOKUP(G83,ID分段!A:C,3,FALSE))","v":"功法-本体"},5,0,0,null,0,1,0,null,null,0,0,0,0,3,{"$f":"_xlfn.TEXTJOIN(\";\",1,AA83:AE83)","v":"13023;1503"},null,null,null,13023,1503]
[12024,1437,"落石",1523,"功法-土4","icon_item_12024",13,{"$f":"CONCATENATE(VLOOKUP(G84,ID分段!A:B,2,FALSE),\"-\",VLOOKUP(G84,ID分段!A:C,3,FALSE))","v":"功法-本体"},4,0,0,null,0,1,0,null,null,0,0,0,0,3,"13024;1504",null,null,null,13024,1504]
[12025,1438,"小石头",1524,"功法-土5","icon_item_12025",13,{"$f":"CONCATENATE(VLOOKUP(G85,ID分段!A:B,2,FALSE),\"-\",VLOOKUP(G85,ID分段!A:C,3,FALSE))","v":"功法-本体"},3,0,0,null,0,1,0,null,null,0,0,0,0,3,"13025;1505",null,null,null,13025,1505]
[]
[12501,1800,"天衍星辰诀",1850,null,"icon_item_12501",13,{"$f":"CONCATENATE(VLOOKUP(G87,ID分段!A:B,2,FALSE),\"-\",VLOOKUP(G87,ID分段!A:C,3,FALSE))","v":"功法-本体"},4,0,0,null,0,1,0,null,null,0,0,0,0,3,{"$f":"_xlfn.TEXTJOIN(\";\",1,AA87:AE87)","v":"13501;2001"},null,null,null,13501,2001]
[12502,1801,"法宝秘籍",1851,null,"icon_item_12502",13,{"$f":"CONCATENATE(VLOOKUP(G88,ID分段!A:B,2,FALSE),\"-\",VLOOKUP(G88,ID分段!A:C,3,FALSE))","v":"功法-本体"},4,0,0,null,0,1,0,null,null,0,0,0,0,3,{"$f":"_xlfn.TEXTJOIN(\";\",1,AA88:AE88)","v":"13502;2002"},null,null,null,13502,2002]
[12503,1802,"崩脉决",1852,null,"icon_item_12503",13,{"$f":"CONCATENATE(VLOOKUP(G89,ID分段!A:B,2,FALSE),\"-\",VLOOKUP(G89,ID分段!A:C,3,FALSE))","v":"功法-本体"},4,0,0,null,0,1,0,null,null,0,0,0,0,3,"13503;2003",null,null,null,13503,2003]
[12504,1803,"两仪决",1853,null,"icon_item_12504",13,{"$f":"CONCATENATE(VLOOKUP(G90,ID分段!A:B,2,FALSE),\"-\",VLOOKUP(G90,ID分段!A:C,3,FALSE))","v":"功法-本体"},4,0,0,null,0,1,0,null,null,0,0,0,0,3,"13504;2004",null,null,null,13504,2004]
[12505,1804,"火焰决",1854,null,"icon_item_12505",13,{"$f":"CONCATENATE(VLOOKUP(G91,ID分段!A:B,2,FALSE),\"-\",VLOOKUP(G91,ID分段!A:C,3,FALSE))","v":"功法-本体"},4,0,0,null,0,1,0,null,null,0,0,0,0,3,"13505;2005",null,null,null,13505,2005]
[12506,1805,"乾坤巨灵诀",1855,null,"icon_item_12506",13,{"$f":"CONCATENATE(VLOOKUP(G92,ID分段!A:B,2,FALSE),\"-\",VLOOKUP(G92,ID分段!A:C,3,FALSE))","v":"功法-本体"},4,0,0,null,0,1,0,null,null,0,0,0,0,3,"13506;2006",null,null,null,13506,2006]
[12507,1806,"极速齿轮",1856,null,"icon_item_12507",13,{"$f":"CONCATENATE(VLOOKUP(G93,ID分段!A:B,2,FALSE),\"-\",VLOOKUP(G93,ID分段!A:C,3,FALSE))","v":"功法-本体"},4,0,0,null,0,1,0,null,null,0,0,0,0,3,"13507;2007",null,null,null,13507,2007]
[12508,1807,"太虚剑意",1857,null,"icon_item_12508",13,{"$f":"CONCATENATE(VLOOKUP(G94,ID分段!A:B,2,FALSE),\"-\",VLOOKUP(G94,ID分段!A:C,3,FALSE))","v":"功法-本体"},4,0,0,null,0,1,0,null,null,0,0,0,0,3,"13508;2008",null,null,null,13508,2008]
[12509,1808,"青莲净体诀",1858,null,{"$f":"\"icon_item_\"&A95","v":"icon_item_12509"},13,{"$f":"CONCATENATE(VLOOKUP(G95,ID分段!A:B,2,FALSE),\"-\",VLOOKUP(G95,ID分段!A:C,3,FALSE))","v":"功法-本体"},4,0,0,null,0,1,0,null,null,0,0,0,0,3,{"$f":"_xlfn.TEXTJOIN(\";\",1,AA95:AE95)","v":"13507;2007"},null,null,null,13507,2007]
[12510,1809,"碧霄回春术",1859,null,"icon_item_12510",13,{"$f":"CONCATENATE(VLOOKUP(G96,ID分段!A:B,2,FALSE),\"-\",VLOOKUP(G96,ID分段!A:C,3,FALSE))","v":"功法-本体"},4,0,0,null,0,1,0,null,null,0,0,0,0,3,"13508;2008",null,null,null,13508,2008]
[]
[13001,1600,{"$f":"CONCATENATE(C61,\"碎片\")","v":"太虚幻剑经碎片"},1700,null,"icon_item_13001",14,{"$f":"CONCATENATE(VLOOKUP(G98,ID分段!A:B,2,FALSE),\"-\",VLOOKUP(G98,ID分段!A:C,3,FALSE))","v":"功法-碎片"},5,0,0,null,0,1,0,null,null,0,0,0,0]
[13002,1601,"天罡剑气诀碎片",1701,null,"icon_item_13002",14,{"$f":"CONCATENATE(VLOOKUP(G99,ID分段!A:B,2,FALSE),\"-\",VLOOKUP(G99,ID分段!A:C,3,FALSE))","v":"功法-碎片"},5,0,0,null,0,1,0,null,null,0,0,0,0]
[13003,1602,"血刃金煌功碎片",1702,null,"icon_item_13003",14,{"$f":"CONCATENATE(VLOOKUP(G100,ID分段!A:B,2,FALSE),\"-\",VLOOKUP(G100,ID分段!A:C,3,FALSE))","v":"功法-碎片"},5,0,0,null,0,1,0,null,null,0,0,0,0]
[13004,1603,"飞刃碎片",1703,null,"icon_item_13004",14,{"$f":"CONCATENATE(VLOOKUP(G101,ID分段!A:B,2,FALSE),\"-\",VLOOKUP(G101,ID分段!A:C,3,FALSE))","v":"功法-碎片"},4,0,0,null,0,1,0,null,null,0,0,0,0]
[13005,1604,"金针碎片",1704,null,"icon_item_13005",14,{"$f":"CONCATENATE(VLOOKUP(G102,ID分段!A:B,2,FALSE),\"-\",VLOOKUP(G102,ID分段!A:C,3,FALSE))","v":"功法-碎片"},3,0,0,null,0,1,0,null,null,0,0,0,0]
[13006,1605,"碧落幽冥劲碎片",1705,null,"icon_item_13006",14,{"$f":"CONCATENATE(VLOOKUP(G103,ID分段!A:B,2,FALSE),\"-\",VLOOKUP(G103,ID分段!A:C,3,FALSE))","v":"功法-碎片"},5,0,0,null,0,1,0,null,null,0,0,0,0]
[13007,1606,"雾隐千流法碎片",1706,null,"icon_item_13007",14,{"$f":"CONCATENATE(VLOOKUP(G104,ID分段!A:B,2,FALSE),\"-\",VLOOKUP(G104,ID分段!A:C,3,FALSE))","v":"功法-碎片"},5,0,0,null,0,1,0,null,null,0,0,0,0]
[13008,1607,"功法-水3碎片",1707,null,"icon_item_13008",14,{"$f":"CONCATENATE(VLOOKUP(G105,ID分段!A:B,2,FALSE),\"-\",VLOOKUP(G105,ID分段!A:C,3,FALSE))","v":"功法-碎片"},5,0,0,null,0,1,0,null,null,0,0,0,0]
[13009,1608,"水球碎片",1708,null,"icon_item_13009",14,{"$f":"CONCATENATE(VLOOKUP(G106,ID分段!A:B,2,FALSE),\"-\",VLOOKUP(G106,ID分段!A:C,3,FALSE))","v":"功法-碎片"},4,0,0,null,0,1,0,null,null,0,0,0,0]
[13010,1609,"冰刀碎片",1709,null,"icon_item_13010",14,{"$f":"CONCATENATE(VLOOKUP(G107,ID分段!A:B,2,FALSE),\"-\",VLOOKUP(G107,ID分段!A:C,3,FALSE))","v":"功法-碎片"},3,0,0,null,0,1,0,null,null,0,0,0,0]
[13011,1610,"瘴影千丝术碎片",1710,null,"icon_item_13011",14,{"$f":"CONCATENATE(VLOOKUP(G108,ID分段!A:B,2,FALSE),\"-\",VLOOKUP(G108,ID分段!A:C,3,FALSE))","v":"功法-碎片"},5,0,0,null,0,1,0,null,null,0,0,0,0]
[13012,1611,"蚀骨腐血掌碎片",1711,null,{"$f":"\"icon_item_\"&A109","v":"icon_item_13012"},14,{"$f":"CONCATENATE(VLOOKUP(G109,ID分段!A:B,2,FALSE),\"-\",VLOOKUP(G109,ID分段!A:C,3,FALSE))","v":"功法-碎片"},5,0,0,null,0,1,0,null,null,0,0,0,0]
[13013,1612,"功法-木3碎片",1712,null,"icon_item_13013",14,{"$f":"CONCATENATE(VLOOKUP(G110,ID分段!A:B,2,FALSE),\"-\",VLOOKUP(G110,ID分段!A:C,3,FALSE))","v":"功法-碎片"},5,0,0,null,0,1,0,null,null,0,0,0,0]
[13014,1613,"竹刺碎片",1713,null,"icon_item_13014",14,{"$f":"CONCATENATE(VLOOKUP(G111,ID分段!A:B,2,FALSE),\"-\",VLOOKUP(G111,ID分段!A:C,3,FALSE))","v":"功法-碎片"},4,0,0,null,0,1,0,null,null,0,0,0,0]
[13015,1614,"飞叶碎片",1714,null,"icon_item_13015",14,{"$f":"CONCATENATE(VLOOKUP(G112,ID分段!A:B,2,FALSE),\"-\",VLOOKUP(G112,ID分段!A:C,3,FALSE))","v":"功法-碎片"},3,0,0,null,0,1,0,null,null,0,0,0,0]
[13016,1615,"烈焰剑碎片",1715,null,"icon_item_13016",14,{"$f":"CONCATENATE(VLOOKUP(G113,ID分段!A:B,2,FALSE),\"-\",VLOOKUP(G113,ID分段!A:C,3,FALSE))","v":"功法-碎片"},5,0,0,null,0,1,0,null,null,0,0,0,0]
[13017,1616,"赤焰龙吟功碎片",1716,null,"icon_item_13017",14,{"$f":"CONCATENATE(VLOOKUP(G114,ID分段!A:B,2,FALSE),\"-\",VLOOKUP(G114,ID分段!A:C,3,FALSE))","v":"功法-碎片"},5,0,0,null,0,1,0,null,null,0,0,0,0]
[13018,1617,"朱雀燎原指碎片",1717,null,"icon_item_13018",14,{"$f":"CONCATENATE(VLOOKUP(G115,ID分段!A:B,2,FALSE),\"-\",VLOOKUP(G115,ID分段!A:C,3,FALSE))","v":"功法-碎片"},5,0,0,null,0,1,0,null,null,0,0,0,0]
[13019,1618,"火球碎片",1718,null,"icon_item_13019",14,{"$f":"CONCATENATE(VLOOKUP(G116,ID分段!A:B,2,FALSE),\"-\",VLOOKUP(G116,ID分段!A:C,3,FALSE))","v":"功法-碎片"},4,0,0,null,0,1,0,null,null,0,0,0,0]
[13020,1619,"火刀碎片",1719,null,"icon_item_13020",14,{"$f":"CONCATENATE(VLOOKUP(G117,ID分段!A:B,2,FALSE),\"-\",VLOOKUP(G117,ID分段!A:C,3,FALSE))","v":"功法-碎片"},3,0,0,null,0,1,0,null,null,0,0,0,0]
[13021,1620,"黄尘灭魂刺碎片",1720,null,"icon_item_13021",14,{"$f":"CONCATENATE(VLOOKUP(G118,ID分段!A:B,2,FALSE),\"-\",VLOOKUP(G118,ID分段!A:C,3,FALSE))","v":"功法-碎片"},5,0,0,null,0,1,0,null,null,0,0,0,0]
[13022,1621,"地裂屠龙斩碎片",1721,null,"icon_item_13022",14,{"$f":"CONCATENATE(VLOOKUP(G119,ID分段!A:B,2,FALSE),\"-\",VLOOKUP(G119,ID分段!A:C,3,FALSE))","v":"功法-碎片"},5,0,0,null,0,1,0,null,null,0,0,0,0]
[13023,1622,"功法-土3碎片",1722,null,"icon_item_13023",14,{"$f":"CONCATENATE(VLOOKUP(G120,ID分段!A:B,2,FALSE),\"-\",VLOOKUP(G120,ID分段!A:C,3,FALSE))","v":"功法-碎片"},5,0,0,null,0,1,0,null,null,0,0,0,0]
{"$rows_left_out":14}
{"sheet":"ID分段","index":1,"n_rows":13,"n_cols":6,"rows_kept":13,"cut":false,"hidden":false,"merged":[]}
["Tag","大类","小类","起始ID","结束ID","已使用"]
[1,"资源","货币",1000,1099]
[2,"资源","材料",1100,1199]
[3,"资源","渡劫丹",1200,1299]
[4,"资源","天材地宝",1300,1399]
[5,"资源","经验丹",1400,1499]
[6,"资源","好感度礼物",1500,1599]
[7,"资源","心情礼物",1600,1699]
[]
[11,"法宝","本体",10000,10999]
[12,"法宝","碎片",11000,11999]
[13,"功法","本体",12000,12999]
[14,"功法","碎片",13000,13999]

{"sheet":"道具用途说明","index":2,"n_rows":9,"n_cols":2,"rows_kept":9,"cut":false,"hidden":false,"merged":[]}
["associateID","associateVlaue"]
["int","int[]"]
[]
["特殊功能ID\n","特殊功能参数\n"]
[1,"突破丹可用的下限修为等级（包含）；突破丹可用的上限修为等级（不包含）；突破丹增加的概率；突破失败可以降低的修为损耗%"]
[2,"经验丹增加的修为值"]
[3,"功法对应的碎片ID；功法对应的技能组ID"]
[4,"法宝对应的碎片ID；法宝对应的技能组ID"]
[5,"心情礼物对应增加的心情值"]