{"text_format":"2","workbook":"xlsx","n_sheets":5,"sheets":["SkillConfig","SkillPowerupConfig","SkillConstant","技能设计","异常状态效果值"],"not_rendered":{"charts":0,"images":0,"macros":0,"external_links":1,"defined_names":1,"comments":0,"pivot_tables":0},"unopened":[],"bounds":{"document_bytes":16777216,"sheet_cells":100000,"run_cost":"one","rows_first":2000,"rows_last":500,"rows_between":2000,"halvings":0,"cell_chars":16384,"cell_head_chars":4096},"cells_cut":0,"cells_raw":0,"read":"whole","date_system":"1900"}

{"sheet":"SkillConfig","index":0,"n_rows":630,"n_cols":49,"rows_kept":630,"cut":false,"hidden":false,"merged":[]}
["ID","PieceID","power","name","dec",null,null,"attribute","icon","scriptName","IDGroup","timelineName","cd","addcd","SkillType","level","effectValue","intensifierIndex","addPropertyType","addPropertyValue","PromoteLan","PromoteLanPara","PromoteLanPara"]
["int","int","float","int","int",null,null,"int","string","string","int","string","float","float","int","int","float[]","int[]","int[]","float[]","int","float[]","float[]"]
[{"$nulls":41},{"$f":"SUMIFS(AP5:AP10095,$A5:$A10095,\"<>\"&\"\",$P5:$P10095,6)","v":174},{"$f":"SUMIFS(AQ5:AQ10095,$A5:$A10095,\"<>\"&\"\",$P5:$P10095,6)","v":308},166,10,10,20,20,10]
["技能ID\nIDGroup+技能等级","对应的碎片ID","功法强度\n基于标准强度的百分比\n50=50%","名称语言表ID","描述语言表ID","技能名称","技能效果","技能属性\n1=金\n2=水\n4=木\n8=火\n16=土","图标","脚本名称","技能组","技能的timeline表现，没得就不填，这个可以程序填","功法：多少圈释放1次\n法宝：CD多少秒","功法上阵后，大道增加的CD\n大道的默认CD","技能类型:\n1=主动功法\n2=被动功法\n3=法宝技能\n4=大道\n","星级","效果值","允许被加强的效果下表","属性ID表内对应\n101=生命百分比\n102=攻击百分比\n103=防御百分比\n106~110=金木水火土灵根\n","具体效果值","升星简短描述","升星简短描述参数","哪边的法宝被影响\n0=无\n1=前方\n-1=后方","数值1","数值2","数值3","数值4","数值5","数值6","数值7","升星描述",null,null,"总威力","段数","单段伤害","buff占比","额外占比","恢复能力","恢复类型\n0=攻击力\n1=最大生命值","技能生效最大次数",101,102,103,106,107,108,109,110]
[null,"英雄-主动功法区域"]
[{"$f":"K6*10+P6-1","v":11010},13001,100,316,739,"太虚幻剑经","身体周围幻化出{0}柄细剑，每柄细剑对敌人造成{1}%伤害，并有{2}几率对敌人造成1层流血。",1,{"$f":"CONCATENATE(\"icon_s\",K6)","v":"icon_s1101"},{"$f":"CONCATENATE(\"S\",K6)","v":"S1101"},1101,"1101_timeline_TD",1,1,1,1,{"$f":"_xlfn.TEXTJOIN(\";\",1,X6:AD6)","v":"6;18;100"},2,{"$f":"_xlfn.TEXTJOIN(\";\",1,IF(AP6=\"\",\"\",101),IF(AQ6=\"\",\"\",102),IF(AR6=\"\",\"\",103),IF(AS6=\"\",\"\",106),IF(AT6=\"\",\"\",107),IF(AU6=\"\",\"\",108),IF(AV6=\"\",\"\",109),IF(AW6=\"\",\"\",110))","v":""},{"$f":"_xlfn.TEXTJOIN(\";\",1,AP6:AW6)","v":""},-1,null,null,6,{"$f":"ROUND(异常状态效果值!G9*(1-AK6)/AI6,0)","v":18},100,{"$nulls":5},{"$f":"IF(F6=\"\",\"\",CONCATENATE(F6,\"·\",CHOOSE(P6,\"壹\",\"贰\",\"叁\",\"肆\",\"伍\",\"陆\")))","v":"太虚幻剑经·壹"},null,{"$f":"IF(A6=\"\",\"\",AI6*AJ6/(1-AK6-AL6))","v":154.285714285714},{"$f":"X6","v":6},{"$f":"Y6","v":18},{"$f":"AI6*5/100","v":0.3}]
[{"$f":"K7*10+P7-1","v":11011},13001,150,317,740,"太虚幻剑经","身体周围幻化出{0}柄细剑，每柄细剑对敌人造成{1}%伤害，并有{2}几率对敌人造成1层流血。",1,"icon_s1101",{"$f":"CONCATENATE(\"S\",K7)","v":"S1101"},1101,"1101_timeline_TD",1,1,1,2,{"$f":"_xlfn.TEXTJOIN(\";\",1,X7:AD7)","v":"6;23;100"},2,{"$f":"_xlfn.TEXTJOIN(\";\",1,IF(AP7=\"\",\"\",101),IF(AQ7=\"\",\"\",102),IF(AR7=\"\",\"\",103),IF(AS7=\"\",\"\",106),IF(AT7=\"\",\"\",107),IF(AU7=\"\",\"\",108),IF(AV7=\"\",\"\",109),IF(AW7=\"\",\"\",110))","v":""},{"$f":"_xlfn.TEXTJOIN(\";\",1,AP7:AW7)","v":""},1100,2,null,6,{"$f":"ROUND(异常状态效果值!G10*(1-AK7)/AI7,0)","v":23},100,{"$nulls":4},{"$f":"CONCATENATE(\"飞剑数量+\",V7)","v":"飞剑数量+2"},{"$f":"IF(F7=\"\",\"\",CONCATENATE(F7,\"·\",CHOOSE(P7,\"壹\",\"贰\",\"叁\",\"肆\",\"伍\",\"陆\")))","v":"太虚幻剑经·贰"},null,{"$f":"IF(A7=\"\",\"\",AI7*AJ7/(1-AK7-AL7))","v":197.142857142857},{"$f":"X7","v":6},{"$f":"Y7","v":23},{"$f":"AI7*5/100","v":0.3}]
[11012,13001,225,318,741,"太虚幻剑经","身体周围幻化出{0}柄细剑，每柄细剑对敌人造成{1}%伤害，并有{2}几率对敌人造成1层流血。",1,"icon_s1101","S1101",1101,"1101_timeline_TD",1,1,1,3,"6;30;100",2,"101","10",1101,10,null,6,{"$f":"ROUND(异常状态效果值!G11*(1-AK8)/AI8,0)","v":30},100,{"$nulls":4},{"$f":"CONCATENATE(CHOOSE(S8-100,\"生命\",\"攻击\",\"防御\"),\"+\",V8,\"%\")","v":"生命+10%"},"太虚幻剑经·叁",null,257.142857142857,6,30,{"$f":"AI8*5/100","v":0.3},{"$nulls":4},10]
[11013,13001,337.5,319,742,"太虚幻剑经","身体周围幻化出{0}柄细剑，每柄细剑对敌人造成{1}%伤害，并有{2}几率对敌人造成1层流血。\n如果敌人有减益状态，则虚剑伤害提升{3}%。",1,"icon_s1101","S1101",1101,"1101_timeline_TD",1,1,1,4,"6;34;100;10",2,"101","10",1102,1,null,6,{"$f":"ROUND(异常状态效果值!G12*(1-AK9)/AI9,0)","v":34},100,10,null,null,null,{"$f":"CONCATENATE(\"飞剑数量+\",V9,\"，对带减益的敌人增伤\")","v":"飞剑数量+1，对带减益的敌人增伤"},"太虚幻剑经·肆",null,340,6,34,{"$f":"AI9*5/100+AA9/100","v":0.4},{"$nulls":4},10]
[11014,13001,506.25,320,743,"太虚幻剑经","身体周围幻化出{0}柄细剑，每柄细剑对敌人造成{1}%伤害，并有{2}几率对敌人造成1层流血。\n如果敌人有减益状态，则虚剑伤害提升{3}%。",1,"icon_s1101","S1101",1101,"1101_timeline_TD",1,1,1,5,"6;41;100;10",2,"101","20",1103,10,null,6,{"$f":"ROUND(异常状态效果值!G13*(1-AK10)/AI10,0)","v":41},100,10,null,null,null,{"$f":"CONCATENATE(CHOOSE(S10-100,\"生命\",\"攻击\",\"防御\"),\"+\",V10,\"%\")","v":"生命+10%"},"太虚幻剑经·伍",null,410,6,41,{"$f":"AI10*5/100+AA10/100","v":0.4},{"$nulls":4},20]
[11015,13001,759.375,321,744,"太虚幻剑经","身体周围幻化出{0}柄更大体型的虚剑，每柄虚剑对敌人造成{1}%伤害，并有{2}几率对敌人造成1层流血。\n如果敌人有减益状态，则虚剑伤害提升{3}%。",1,"icon_s1101","S1101",1101,"1101_timeline_TD",1,1,1,6,"7;41;100;10",2,"101","20",1104,null,null,7,{"$f":"ROUND(异常状态效果值!G14*(1-AK11)/AI11,0)","v":41},100,10,null,null,null,"发射伤害更高的幻剑","太虚幻剑经·陆",null,521.818181818182,7,41,{"$f":"AI11*5/100+AA11/100","v":0.45},{"$nulls":4},20]
[{"$nulls":13},1,{"$nulls":17},"",null,""]
[{"$f":"K13*10+P13-1","v":11020},{"$f":"B6+1","v":13002},100,322,745,"天罡剑气诀","吸收自身灵气凝聚{0}柄大剑，大剑旋转快速穿透敌人对敌人照成{1}%伤害",1,{"$f":"CONCATENATE(\"icon_s\",K13)","v":"icon_s1102"},{"$f":"CONCATENATE(\"S\",K13)","v":"S1102"},{"$f":"K6+1","v":1102},"1102_timeline_TD",1,1,1,1,{"$f":"_xlfn.TEXTJOIN(\";\",1,X13:AD13)","v":"1;150"},2,{"$f":"_xlfn.TEXTJOIN(\";\",1,IF(AP13=\"\",\"\",101),IF(AQ13=\"\",\"\",102),IF(AR13=\"\",\"\",103),IF(AS13=\"\",\"\",106),IF(AT13=\"\",\"\",107),IF(AU13=\"\",\"\",108),IF(AV13=\"\",\"\",109),IF(AW13=\"\",\"\",110))","v":""},{"$f":"_xlfn.TEXTJOIN(\";\",1,AP13:AW13)","v":""},-1,null,null,1,{"$f":"ROUND(异常状态效果值!G9*(1-AK13)/AI13,0)","v":150},{"$nulls":6},"天罡剑气诀·壹",null,150,{"$f":"X13","v":1},{"$f":"Y13","v":150}]
[{"$f":"K14*10+P14-1","v":11021},{"$f":"B7+1","v":13002},150,323,746,"天罡剑气诀","吸收自身灵气凝聚{0}柄大剑，大剑旋转快速穿透敌人对敌人照成{1}%伤害\n敌人如果在流血或放血状态，对敌人造成的伤害+{2}%",1,{"$f":"CONCATENATE(\"icon_s\",K14)","v":"icon_s1102"},{"$f":"CONCATENATE(\"S\",K14)","v":"S1102"},{"$f":"K7+1","v":1102},"1102_timeline_TD",1,1,1,2,{"$f":"_xlfn.TEXTJOIN(\";\",1,X14:AD14)","v":"1;150;25"},2,{"$f":"_xlfn.TEXTJOIN(\";\",1,IF(AP14=\"\",\"\",101),IF(AQ14=\"\",\"\",102),IF(AR14=\"\",\"\",103),IF(AS14=\"\",\"\",106),IF(AT14=\"\",\"\",107),IF(AU14=\"\",\"\",108),IF(AV14=\"\",\"\",109),IF(AW14=\"\",\"\",110))","v":""},{"$f":"_xlfn.TEXTJOIN(\";\",1,AP14:AW14)","v":""},1105,2,null,1,{"$f":"ROUND(异常状态效果值!G10*(1-AK14)/AI14,0)","v":150},25,{"$nulls":4},"对流血或放血敌人增伤","天罡剑气诀·贰",null,200,{"$f":"X14","v":1},{"$f":"Y14","v":150},{"$f":"Z14/100","v":0.25}]
[11022,13002,225,324,747,"天罡剑气诀","吸收自身灵气凝聚{0}柄大剑，大剑旋转快速穿透敌人对敌人照成{1}%伤害\n敌人如果在流血或放血状态，对敌人造成的伤害+{2}%",1,"icon_s1102","S1102",1102,"1102_timeline_TD",1,1,1,3,"1;195;25",2,"102","10",1106,10,null,1,{"$f":"ROUND(异常状态效果值!G11*(1-AK15)/AI15,0)","v":195},25,{"$nulls":4},{"$f":"CONCATENATE(CHOOSE(S15-100,\"生命\",\"攻击\",\"防御\"),\"+\",V15,\"%\")","v":"攻击+10%"},"天罡剑气诀·叁",null,260,1,{"$f":"Y15","v":195},{"$f":"Z15/100","v":0.25},{"$nulls":5},10]
[11023,13002,337.5,325,748,"天罡剑气诀","吸收自身灵气凝聚{0}柄大剑，大剑旋转快速穿透敌人对敌人照成{1}%伤害\n敌人如果在流血或放血状态，对敌人造成的伤害+{2}%\n重伤敌人后，如果目标没在放血状态，直接放血且不消耗流血层数",1,"icon_s1102","S1102",1102,"1102_timeline_TD",1,1,1,4,"1;221;25",2,"102","10",1107,1,null,1,{"$f":"ROUND(异常状态效果值!G12*(1-AK16)/AI16,0)","v":221},25,{"$nulls":4},"无条件放血","天罡剑气诀·肆",null,340,1,221,{"$f":"Z16/100+0.1","v":0.35},{"$nulls":5},10]
[11024,13002,506.25,326,749,"天罡剑气诀","吸收自身灵气凝聚{0}柄大剑，大剑旋转快速穿透敌人对敌人照成{1}%伤害\n敌人如果在流血或放血状态，对敌人造成的伤害+{2}%\n重伤敌人后，如果目标没在放血状态，直接放血且不消耗流血层数",1,"icon_s1102","S1102",1102,"1102_timeline_TD",1,1,1,5,"1;267;25",2,"102","20",1108,10,null,1,{"$f":"ROUND(异常状态效果值!G13*(1-AK17)/AI17,0)","v":267},25,{"$nulls":4},{"$f":"CONCATENATE(CHOOSE(S17-100,\"生命\",\"攻击\",\"防御\"),\"+\",V17,\"%\")","v":"攻击+10%"},"天罡剑气诀·伍",null,410.769230769231,1,267,{"$f":"Z17/100+0.1","v":0.35},{"$nulls":5},20]
[11025,13002,759.375,327,750,"天罡剑气诀","吸收自身灵气凝聚{0}柄大剑，大剑旋转快速穿透敌人对敌人照成{1}%伤害\n敌人如果在流血或放血状态，对敌人造成的伤害+{2}%\n重伤敌人后，如果目标没在放血状态，直接放血且不消耗流血层数\n全盛状态，剑的体型变大，对拼强度+{3}%，伤害提升{4}%",1,"icon_s1102","S1102",1102,"1102_timeline_TD",1,1,1,6,"1;338;25;100",2,"102","20",1109,null,null,1,{"$f":"ROUND(异常状态效果值!G14*(1-AK18)/AI18,0)","v":338},25,100,null,null,null,"对拼强度和伤害提升","天罡剑气诀·陆",null,520,1,338,{"$f":"(Z18+AB18)/100+0.1","v":0.35},{"$nulls":5},20]
[{"$nulls":13},1,{"$nulls":17},"",null,"",null,null,null," "]
[{"$f":"K20*10+P20-1","v":11030},{"$f":"B13+1","v":13003},100,328,751,"血刃金煌功","向前方挥动{0}次，每次挥动形成一道血刃刀气，对敌人{1}造成伤害，并有{2}%概率对敌人造成流血。",1,{"$f":"CONCATENATE(\"icon_s\",K20)","v":"icon_s1103"},{"$f":"CONCATENATE(\"S\",K20)","v":"S1103"},{"$f":"K13+1","v":1103},"1103_timeline_TD",1,1,1,1,{"$f":"_xlfn.TEXTJOIN(\";\",1,X20:AD20)","v":"3;47;100"},2,{"$f":"_xlfn.TEXTJOIN(\";\",1,IF(AP20=\"\",\"\",101),IF(AQ20=\"\",\"\",102),IF(AR20=\"\",\"\",103),IF(AS20=\"\",\"\",106),IF(AT20=\"\",\"\",107),IF(AU20=\"\",\"\",108),IF(AV20=\"\",\"\",109),IF(AW20=\"\",\"\",110))","v":""},{"$f":"_xlfn.TEXTJOIN(\";\",1,AP20:AW20)","v":""},-1,null,null,3,{"$f":"ROUND(异常状态效果值!G9*(1-AK20-AM20*0.1)/AI20,0)","v":47},100,{"$nulls":5},"血刃金煌功·壹",null,150,{"$f":"X20","v":3},{"$f":"Y20","v":47},{"$f":"AI20*异常状态效果值!B1/100","v":0.06}]
{"$rows_left_out":611}
{"sheet":"SkillPowerupConfig","index":1,"n_rows":65,"n_cols":13,"rows_kept":65,"cut":false,"hidden":false,"merged":[]}
["ID","MainPower","SkillPower1","LevelupItem","LevelupItemNum",{"$nulls":4},"PlayerLevelLimit"]
["int","float","float","int[]","int[]",{"$nulls":4},"int"]
[]
["等级","功法对拼标准强度","标准强度百分比","功法升级所需道具","攻击升级所需道具数量","道具1","数量1","道具2","数量2","升级所需境界",1.1225,100,100]
[1,100,100,{"$f":"_xlfn.TEXTJOIN(\";\",1,F5,H5)","v":"1001;1005"},{"$f":"_xlfn.TEXTJOIN(\";\",1,G5,I5)","v":"1125;188"},1001,{"$f":"ROUND(20*VLOOKUP(J5,[1]ResourceLevelConfig!$A:$G,3,FALSE)/8,0)","v":1125},1005,{"$f":"ROUND(50*VLOOKUP(J5,[1]ResourceLevelConfig!$A:$G,7,FALSE)/8,0)","v":188},6]
[2,{"$f":"ROUND(B5*K$4,2)","v":112.25},{"$f":"ROUND(C$5+(M$4*A5/60),2)","v":101.67},{"$f":"_xlfn.TEXTJOIN(\";\",1,F6,H6)","v":"1001;1005"},"1500;250",1001,{"$f":"ROUND(20*VLOOKUP(J6,[1]ResourceLevelConfig!$A:$G,3,FALSE)/8,0)","v":1500},1005,{"$f":"ROUND(50*VLOOKUP(J6,[1]ResourceLevelConfig!$A:$G,7,FALSE)/8,0)","v":250},11]
[3,{"$f":"ROUND(B6*K$4,2)","v":126},{"$f":"ROUND(C$5+(M$4*A6/60),2)","v":103.33},"1001;1005","1875;313",1001,{"$f":"ROUND(20*VLOOKUP(J7,[1]ResourceLevelConfig!$A:$G,3,FALSE)/8,0)","v":1875},1005,{"$f":"ROUND(50*VLOOKUP(J7,[1]ResourceLevelConfig!$A:$G,7,FALSE)/8,0)","v":313},16]
[4,141.44,105,"1001;1005","2250;375",1001,{"$f":"ROUND(20*VLOOKUP(J8,[1]ResourceLevelConfig!$A:$G,3,FALSE)/8,0)","v":2250},1005,{"$f":"ROUND(50*VLOOKUP(J8,[1]ResourceLevelConfig!$A:$G,7,FALSE)/8,0)","v":375},21]
[5,158.77,106.67,"1001;1005","2625;438",1001,{"$f":"ROUND(20*VLOOKUP(J9,[1]ResourceLevelConfig!$A:$G,3,FALSE)/8,0)","v":2625},1005,{"$f":"ROUND(50*VLOOKUP(J9,[1]ResourceLevelConfig!$A:$G,7,FALSE)/8,0)","v":438},26]
[6,178.22,108.33,"1001;1005","3000;500",1001,{"$f":"ROUND(20*VLOOKUP(J10,[1]ResourceLevelConfig!$A:$G,3,FALSE)/8,0)","v":3000},1005,{"$f":"ROUND(50*VLOOKUP(J10,[1]ResourceLevelConfig!$A:$G,7,FALSE)/8,0)","v":500},31]
[7,200.05,110,"1001;1005","3375;563",1001,{"$f":"ROUND(20*VLOOKUP(J11,[1]ResourceLevelConfig!$A:$G,3,FALSE)/8,0)","v":3375},1005,{"$f":"ROUND(50*VLOOKUP(J11,[1]ResourceLevelConfig!$A:$G,7,FALSE)/8,0)","v":563},36]
[8,224.56,111.67,"1001;1005","3750;625",1001,{"$f":"ROUND(20*VLOOKUP(J12,[1]ResourceLevelConfig!$A:$G,3,FALSE)/8,0)","v":3750},1005,{"$f":"ROUND(50*VLOOKUP(J12,[1]ResourceLevelConfig!$A:$G,7,FALSE)/8,0)","v":625},41]
[9,252.07,113.33,"1001;1005","4140;688",1001,{"$f":"ROUND(20*VLOOKUP(J13,[1]ResourceLevelConfig!$A:$G,3,FALSE)/8,0)","v":4140},1005,{"$f":"ROUND(50*VLOOKUP(J13,[1]ResourceLevelConfig!$A:$G,7,FALSE)/8,0)","v":688},46]
[10,282.95,115,"1001;1005","4570;750",1001,{"$f":"ROUND(20*VLOOKUP(J14,[1]ResourceLevelConfig!$A:$G,3,FALSE)/8,0)","v":4570},1005,{"$f":"ROUND(50*VLOOKUP(J14,[1]ResourceLevelConfig!$A:$G,7,FALSE)/8,0)","v":750},51]
[11,317.61,116.67,"1001;1005","5048;825",1001,{"$f":"ROUND(20*VLOOKUP(J15,[1]ResourceLevelConfig!$A:$G,3,FALSE)/8,0)","v":5048},1005,{"$f":"ROUND(50*VLOOKUP(J15,[1]ResourceLevelConfig!$A:$G,7,FALSE)/8,0)","v":825},56]
[12,356.52,118.33,"1001;1005","5573;919",1001,{"$f":"ROUND(20*VLOOKUP(J16,[1]ResourceLevelConfig!$A:$G,3,FALSE)/8,0)","v":5573},1005,{"$f":"ROUND(50*VLOOKUP(J16,[1]ResourceLevelConfig!$A:$G,7,FALSE)/8,0)","v":919},61]
[13,400.19,120,"1001;1005","6150;1013",1001,{"$f":"ROUND(20*VLOOKUP(J17,[1]ResourceLevelConfig!$A:$G,3,FALSE)/8,0)","v":6150},1005,{"$f":"ROUND(50*VLOOKUP(J17,[1]ResourceLevelConfig!$A:$G,7,FALSE)/8,0)","v":1013},66]
[14,449.21,121.67,"1001;1005","6788;1106",1001,{"$f":"ROUND(20*VLOOKUP(J18,[1]ResourceLevelConfig!$A:$G,3,FALSE)/8,0)","v":6788},1005,{"$f":"ROUND(50*VLOOKUP(J18,[1]ResourceLevelConfig!$A:$G,7,FALSE)/8,0)","v":1106},71]
[15,504.24,123.33,"1001;1005","7493;1231",1001,{"$f":"ROUND(20*VLOOKUP(J19,[1]ResourceLevelConfig!$A:$G,3,FALSE)/8,0)","v":7493},1005,{"$f":"ROUND(50*VLOOKUP(J19,[1]ResourceLevelConfig!$A:$G,7,FALSE)/8,0)","v":1231},76]
[16,566.01,125,"1001;1005","8273;1356",1001,{"$f":"ROUND(20*VLOOKUP(J20,[1]ResourceLevelConfig!$A:$G,3,FALSE)/8,0)","v":8273},1005,{"$f":"ROUND(50*VLOOKUP(J20,[1]ResourceLevelConfig!$A:$G,7,FALSE)/8,0)","v":1356},81]
{"$rows_left_out":46}
{"sheet":"SkillConstant","index":2,"n_rows":18,"n_cols":12,"rows_kept":18,"cut":false,"hidden":false,"merged":[]}
["ID",null,"SkilltoPieceNum","SkillPromoteNeedPieceNum"]
["int",null,"int[]","int[]"]
[]
[null,null,"重复功法自动转碎片的数量","功法升到对应星级所需碎片数量"]
[1,null,{"$f":"_xlfn.TEXTJOIN(\";\",1,C8:C17)","v":"1;5;20;100;200;300;500;700;1000;1300"},{"$f":"_xlfn.TEXTJOIN(\";\",1,1,D8:D16)","v":"1;4;15;80;100;100;200;200;300;300"}]
[{"$nulls":4},"升星所需数量"]
[null,null,"碎片数量","升星所需碎片","1星","2星","3星","4星","权重","标准概率","预设概率"]
[null,1,1,{"$f":"C9-C8","v":4},{"$f":"D8/C$8","v":4},null,null,null,{"$f":"C$8*C$9*C$10*C$11/C8","v":10000},{"$f":"I8/SUM(I$8:I$11)","v":0.793650793650794},{"$f":"1-SUM(K9:K11)","v":0.825}]
[null,2,5,{"$f":"C10-C9","v":15},{"$f":"D9/C$8","v":15},{"$f":"D9/C$9","v":3},null,null,{"$f":"C$8*C$9*C$10*C$11/C9","v":2000},{"$f":"I9/SUM(I$8:I$11)","v":0.158730158730159},0.14,{"$f":"K9/J9","v":0.882}]
[null,3,20,80,80,{"$f":"D10/C$9","v":16},{"$f":"D10/C$10","v":4},null,500,0.0396825396825397,0.03,0.756]
[null,4,100,100,100,20,{"$f":"D11/C$10","v":5},{"$f":"D11/C$11","v":1},100,0.00793650793650794,0.005,0.63]
[null,5,200,100,100,20,5,{"$f":"D12/C$11","v":1}]
[null,6,{"$f":"C12+D12","v":300},200,200,40,10,2]
[null,7,{"$f":"C13+D13","v":500},200,200,40,10,2]
[null,8,700,300,300,60,15,3]
[null,9,1000,300,300,60,15,3]
[null,10,1300]
[{"$nulls":4},{"$f":"SUM(E8:E16)+1","v":1300},{"$f":"SUM(F8:F16)+1","v":260},{"$f":"SUM(G8:G16)+1","v":65},{"$f":"SUM(H8:H16)+1","v":13}]

{"sheet":"技能设计","index":3,"n_rows":41,"n_cols":27,"rows_kept":41,"cut":false,"hidden":false,"merged":[]}
[null,null,"生命","攻击","防御",null,"金","水","木","火","土"]
[null,"星级",101,102,103,null,106,107,108,109,110]
["0星",1,{"$f":"SUMIFS(SkillConfig!AP5:AP10095,SkillConfig!$A5:$A10095,\"<>\"&\"\",SkillConfig!$P5:$P10095,$B3)","v":0},{"$f":"SUMIFS(SkillConfig!AQ5:AQ10095,SkillConfig!$A5:$A10095,\"<>\"&\"\",SkillConfig!$P5:$P10095,$B3)","v":0},{"$f":"SUMIFS(SkillConfig!AR5:AR10095,SkillConfig!$A5:$A10095,\"<>\"&\"\",SkillConfig!$P5:$P10095,$B3)","v":0},null,{"$f":"SUMIFS(SkillConfig!AS5:AS10095,SkillConfig!$A5:$A10095,\"<>\"&\"\",SkillConfig!$P5:$P10095,$B3)","v":0},{"$f":"SUMIFS(SkillConfig!AT5:AT10095,SkillConfig!$A5:$A10095,\"<>\"&\"\",SkillConfig!$P5:$P10095,$B3)","v":0},{"$f":"SUMIFS(SkillConfig!AU5:AU10095,SkillConfig!$A5:$A10095,\"<>\"&\"\",SkillConfig!$P5:$P10095,$B3)","v":0},{"$f":"SUMIFS(SkillConfig!AV5:AV10095,SkillConfig!$A5:$A10095,\"<>\"&\"\",SkillConfig!$P5:$P10095,$B3)","v":0},{"$f":"SUMIFS(SkillConfig!AW5:AW10095,SkillConfig!$A5:$A10095,\"<>\"&\"\",SkillConfig!$P5:$P10095,$B3)","v":0}]
["1星",2,{"$f":"SUMIFS(SkillConfig!AP6:AP10096,SkillConfig!$A6:$A10096,\"<>\"&\"\",SkillConfig!$P6:$P10096,$B4)","v":21},{"$f":"SUMIFS(SkillConfig!AQ6:AQ10096,SkillConfig!$A6:$A10096,\"<>\"&\"\",SkillConfig!$P6:$P10096,$B4)","v":62},{"$f":"SUMIFS(SkillConfig!AR6:AR10096,SkillConfig!$A6:$A10096,\"<>\"&\"\",SkillConfig!$P6:$P10096,$B4)","v":24},null,{"$f":"SUMIFS(SkillConfig!AS6:AS10096,SkillConfig!$A6:$A10096,\"<>\"&\"\",SkillConfig!$P6:$P10096,$B4)","v":5},{"$f":"SUMIFS(SkillConfig!AT6:AT10096,SkillConfig!$A6:$A10096,\"<>\"&\"\",SkillConfig!$P6:$P10096,$B4)","v":0},{"$f":"SUMIFS(SkillConfig!AU6:AU10096,SkillConfig!$A6:$A10096,\"<>\"&\"\",SkillConfig!$P6:$P10096,$B4)","v":5},{"$f":"SUMIFS(SkillConfig!AV6:AV10096,SkillConfig!$A6:$A10096,\"<>\"&\"\",SkillConfig!$P6:$P10096,$B4)","v":5},{"$f":"SUMIFS(SkillConfig!AW6:AW10096,SkillConfig!$A6:$A10096,\"<>\"&\"\",SkillConfig!$P6:$P10096,$B4)","v":0}]
["2星",3,{"$f":"SUMIFS(SkillConfig!AP7:AP10097,SkillConfig!$A7:$A10097,\"<>\"&\"\",SkillConfig!$P7:$P10097,$B5)","v":77},{"$f":"SUMIFS(SkillConfig!AQ7:AQ10097,SkillConfig!$A7:$A10097,\"<>\"&\"\",SkillConfig!$P7:$P10097,$B5)","v":139},{"$f":"SUMIFS(SkillConfig!AR7:AR10097,SkillConfig!$A7:$A10097,\"<>\"&\"\",SkillConfig!$P7:$P10097,$B5)","v":78},null,{"$f":"SUMIFS(SkillConfig!AS7:AS10097,SkillConfig!$A7:$A10097,\"<>\"&\"\",SkillConfig!$P7:$P10097,$B5)","v":5},{"$f":"SUMIFS(SkillConfig!AT7:AT10097,SkillConfig!$A7:$A10097,\"<>\"&\"\",SkillConfig!$P7:$P10097,$B5)","v":5},{"$f":"SUMIFS(SkillConfig!AU7:AU10097,SkillConfig!$A7:$A10097,\"<>\"&\"\",SkillConfig!$P7:$P10097,$B5)","v":10},{"$f":"SUMIFS(SkillConfig!AV7:AV10097,SkillConfig!$A7:$A10097,\"<>\"&\"\",SkillConfig!$P7:$P10097,$B5)","v":10},{"$f":"SUMIFS(SkillConfig!AW7:AW10097,SkillConfig!$A7:$A10097,\"<>\"&\"\",SkillConfig!$P7:$P10097,$B5)","v":5}]
["3星",4,{"$f":"SUMIFS(SkillConfig!AP8:AP10098,SkillConfig!$A8:$A10098,\"<>\"&\"\",SkillConfig!$P8:$P10098,$B6)","v":103},{"$f":"SUMIFS(SkillConfig!AQ8:AQ10098,SkillConfig!$A8:$A10098,\"<>\"&\"\",SkillConfig!$P8:$P10098,$B6)","v":211},{"$f":"SUMIFS(SkillConfig!AR8:AR10098,SkillConfig!$A8:$A10098,\"<>\"&\"\",SkillConfig!$P8:$P10098,$B6)","v":102},null,{"$f":"SUMIFS(SkillConfig!AS8:AS10098,SkillConfig!$A8:$A10098,\"<>\"&\"\",SkillConfig!$P8:$P10098,$B6)","v":10},{"$f":"SUMIFS(SkillConfig!AT8:AT10098,SkillConfig!$A8:$A10098,\"<>\"&\"\",SkillConfig!$P8:$P10098,$B6)","v":5},{"$f":"SUMIFS(SkillConfig!AU8:AU10098,SkillConfig!$A8:$A10098,\"<>\"&\"\",SkillConfig!$P8:$P10098,$B6)","v":10},{"$f":"SUMIFS(SkillConfig!AV8:AV10098,SkillConfig!$A8:$A10098,\"<>\"&\"\",SkillConfig!$P8:$P10098,$B6)","v":10},{"$f":"SUMIFS(SkillConfig!AW8:AW10098,SkillConfig!$A8:$A10098,\"<>\"&\"\",SkillConfig!$P8:$P10098,$B6)","v":5}]
["4星",5,{"$f":"SUMIFS(SkillConfig!AP9:AP10099,SkillConfig!$A9:$A10099,\"<>\"&\"\",SkillConfig!$P9:$P10099,$B7)","v":159},{"$f":"SUMIFS(SkillConfig!AQ9:AQ10099,SkillConfig!$A9:$A10099,\"<>\"&\"\",SkillConfig!$P9:$P10099,$B7)","v":288},{"$f":"SUMIFS(SkillConfig!AR9:AR10099,SkillConfig!$A9:$A10099,\"<>\"&\"\",SkillConfig!$P9:$P10099,$B7)","v":151},null,{"$f":"SUMIFS(SkillConfig!AS9:AS10099,SkillConfig!$A9:$A10099,\"<>\"&\"\",SkillConfig!$P9:$P10099,$B7)","v":10},{"$f":"SUMIFS(SkillConfig!AT9:AT10099,SkillConfig!$A9:$A10099,\"<>\"&\"\",SkillConfig!$P9:$P10099,$B7)","v":10},{"$f":"SUMIFS(SkillConfig!AU9:AU10099,SkillConfig!$A9:$A10099,\"<>\"&\"\",SkillConfig!$P9:$P10099,$B7)","v":20},{"$f":"SUMIFS(SkillConfig!AV9:AV10099,SkillConfig!$A9:$A10099,\"<>\"&\"\",SkillConfig!$P9:$P10099,$B7)","v":20},{"$f":"SUMIFS(SkillConfig!AW9:AW10099,SkillConfig!$A9:$A10099,\"<>\"&\"\",SkillConfig!$P9:$P10099,$B7)","v":10}]
["5星",6,{"$f":"SUMIFS(SkillConfig!AP10:AP10100,SkillConfig!$A10:$A10100,\"<>\"&\"\",SkillConfig!$P10:$P10100,$B8)","v":174},{"$f":"SUMIFS(SkillConfig!AQ10:AQ10100,SkillConfig!$A10:$A10100,\"<>\"&\"\",SkillConfig!$P10:$P10100,$B8)","v":308},{"$f":"SUMIFS(SkillConfig!AR10:AR10100,SkillConfig!$A10:$A10100,\"<>\"&\"\",SkillConfig!$P10:$P10100,$B8)","v":166},null,{"$f":"SUMIFS(SkillConfig!AS10:AS10100,SkillConfig!$A10:$A10100,\"<>\"&\"\",SkillConfig!$P10:$P10100,$B8)","v":10},{"$f":"SUMIFS(SkillConfig!AT10:AT10100,SkillConfig!$A10:$A10100,\"<>\"&\"\",SkillConfig!$P10:$P10100,$B8)","v":10},{"$f":"SUMIFS(SkillConfig!AU10:AU10100,SkillConfig!$A10:$A10100,\"<>\"&\"\",SkillConfig!$P10:$P10100,$B8)","v":20},{"$f":"SUMIFS(SkillConfig!AV10:AV10100,SkillConfig!$A10:$A10100,\"<>\"&\"\",SkillConfig!$P10:$P10100,$B8)","v":20},{"$f":"SUMIFS(SkillConfig!AW10:AW10100,SkillConfig!$A10:$A10100,\"<>\"&\"\",SkillConfig!$P10:$P10100,$B8)","v":10}]
{"$rows_empty":9}
[{"$nulls":25},"金","高速，低伤害"]
[{"$nulls":12},20,{"$nulls":8},"血祭神通","为所有流血状态附加上血祭，\n流血带来的伤害会充能血祭，充能满后\n对敌人照成大量伤害",null,null,null,"流血"]
[{"$nulls":21},"金煞决\n","前方功法对敌人照成伤害时额外附加一层流血",null,null,null,"放血"]
[]
[]
[]
[{"$nulls":21},"毒瘴领域\n","前方功法在击中目标时，额外施加 一层毒，对流血中的目标额外施加一层\n",null,null,"木","高范围，高异常伤害"]
[{"$nulls":21},"毒爆\n","后方功法击中目标后让目标身上\n的毒气爆炸开来，对目标照成额外的20%伤害，如果范围内其敌人也有毒，则对其他敌人照成等额的伤害",null,null,null,"毒"]
[]
[{"$nulls":21},"异常转移","对目标照成的以上状态有20%概率转移到\n周围的敌人身上"]
[]
{"$rows_left_out":14}
{"sheet":"异常状态效果值","index":4,"n_rows":50,"n_cols":39,"rows_kept":50,"cut":false,"hidden":false,"merged":[[13,11,15,11],[16,11,17,11],[18,11,19,11],[20,11,21,11],[22,11,23,11],[24,11,25,11],[26,11,27,11],[28,11,29,11],[30,11,31,11],[33,11,34,11],[35,11,36,11],[37,11,38,11],[39,11,40,11],[41,11,42,11],[43,11,44,11],[45,11,46,11],[47,11,48,11],[49,11,50,11],[16,12,17,12],[18,12,19,12],[20,12,21,12],[22,12,23,12],[24,12,25,12],[26,12,27,12],[28,12,29,12],[30,12,31,12],[33,12,34,12],[35,12,36,12],[37,12,38,12],[39,12,40,12],[41,12,42,12],[43,12,44,12],[45,12,46,12],[47,12,48,12],[49,12,50,12]]}
["流血buff效果值",2]
["寒气buff转换为伤害值",1]
["毒的转换值",2]
["燃烧转换值",2]
["细尘转换值",1]
["感电转换值",1]
["鼠疫转换值",3]
[{"$nulls":6},"s功法伤害强度","普通"]
[{"$nulls":6},150,150]
[{"$nulls":6},200,200]
[{"$nulls":6},260,250]
[{"$nulls":6},340,300]
[{"$nulls":6},410,350]
[{"$nulls":6},520,400,null,null,null,"天衍星辰诀","引星辰之力入体，增强玩家体魄让后方槽位的功法无视防御性护盾（功法法宝带来的防护罩、自身护盾），"]
[]
[]
[{"$nulls":11},"法宝秘籍","后方槽位第一个技能在击中目前时为法宝提供1%充能"]
[]
[{"$nulls":11},"崩脉决","前方功法照成伤害时有{0}%概率施加一层对应属性的伤势"]
[{"$nulls":24},85,{"$nulls":11},{"$f":"AI20*异常状态效果值!B1/100","v":0}]
{"$rows_left_out":30}