{"text_format":"2","workbook":"xlsx","n_sheets":2,"sheets":["TowerConfig","TowerInfoConfig"],"not_rendered":{"charts":0,"images":0,"macros":0,"external_links":1,"defined_names":2,"comments":0,"pivot_tables":0},"unopened":[],"bounds":{"document_bytes":16777216,"sheet_cells":100000,"run_cost":"one","rows_first":2000,"rows_last":500,"rows_between":2000,"halvings":0,"cell_chars":16384,"cell_head_chars":4096},"cells_cut":0,"cells_raw":0,"read":"whole","date_system":"1900"}

{"sheet":"TowerConfig","index":0,"n_rows":5,"n_cols":5,"rows_kept":5,"cut":false,"hidden":false,"merged":[]}
["ID","name",null,"massge","towerinfoIdGroup"]
["int","int",null,"int","int"]
[]
["modelID","塔名称",null,null,"塔的详情效果Id组"]
[1,null,"命运峰",null,1]

{"sheet":"TowerInfoConfig","index":1,"n_rows":104,"n_cols":18,"rows_kept":104,"cut":false,"hidden":false,"merged":[]}
["ID","groupId","level","name",null,"massge","towerType","typeValue","reward","unlockValue"]
["int","int","int","int",null,"int","int","int[]","int[]","int"]
[]
["modelID","id组","层",null,null,null,"1=战斗（levelbattleId）\n2=剧情（剧情事件ID）",null,"奖励","解锁值","道具1","道具2","数量1","数量2","等级",null,"组合1","组合2"]
[1,1,1,null,"第1层",null,1,2001,{"$f":"CONCATENATE(L5,\";\",K5)","v":"1001;21012"},null,21012,1001,1,{"$f":"IF(L5>1400,1,VLOOKUP(O5,[1]ResourceLevelConfig!$A:$E,L5-998,FALSE)*2)","v":21888},10,null,{"$f":"_xlfn.TEXTJOIN(\";\",1,K5:L5)","v":"21012;1001"},{"$f":"_xlfn.TEXTJOIN(\";\",1,M5:N5)","v":"1;21888"}]
[2,1,2,null,"第2层",null,1,2002,{"$f":"CONCATENATE(L6,\";\",K6)","v":"1003;21012"},null,21012,1003,1,{"$f":"IF(L6>1400,1,VLOOKUP(O6,[1]ResourceLevelConfig!$A:$E,L6-998,FALSE)*2)","v":2260},13,null,{"$f":"_xlfn.TEXTJOIN(\";\",1,K6:L6)","v":"21012;1003"},{"$f":"_xlfn.TEXTJOIN(\";\",1,M6:N6)","v":"1;2260"}]
[3,1,3,null,"第3层",null,1,2003,"1401;21012",null,21012,1401,1,{"$f":"IF(L7>1400,1,VLOOKUP(O7,[1]ResourceLevelConfig!$A:$E,L7-998,FALSE)*2)","v":1},16,null,"21012;1401","1;1"]
[4,1,4,null,"第4层",null,1,2004,"1001;21012",null,21012,1001,1,{"$f":"IF(L8>1400,1,VLOOKUP(O8,[1]ResourceLevelConfig!$A:$E,L8-998,FALSE)*2)","v":23952},19,null,"21012;1001","1;23952"]
[5,1,5,null,"第5层",null,1,2005,"1003;21012",null,21012,1003,1,{"$f":"IF(L9>1400,1,VLOOKUP(O9,[1]ResourceLevelConfig!$A:$E,L9-998,FALSE)*2)","v":2460},22,null,"21012;1003","1;2460"]
[6,1,6,null,"第6层",null,1,2006,"1001;21012",null,21012,1001,1,{"$f":"IF(L10>1400,1,VLOOKUP(O10,[1]ResourceLevelConfig!$A:$E,L10-998,FALSE)*2)","v":25436},25,null,"21012;1001","1;25436"]
[7,1,7,null,"第7层",null,1,2007,"1003;21012",null,21012,1003,1,{"$f":"IF(L11>1400,1,VLOOKUP(O11,[1]ResourceLevelConfig!$A:$E,L11-998,FALSE)*2)","v":2620},28,null,"21012;1003","1;2620"]
[8,1,8,null,"第8层",null,1,2008,"1401;21012",null,21012,1401,1,{"$f":"IF(L12>1400,1,VLOOKUP(O12,[1]ResourceLevelConfig!$A:$E,L12-998,FALSE)*2)","v":1},31,null,"21012;1401","1;1"]
[9,1,9,null,"第9层",null,1,2009,"1001;21012",null,21012,1001,1,{"$f":"IF(L13>1400,1,VLOOKUP(O13,[1]ResourceLevelConfig!$A:$E,L13-998,FALSE)*2)","v":27836},34,null,"21012;1001","1;27836"]
[10,1,10,null,"第10层",null,1,2010,"1003;21012",null,21012,1003,1,{"$f":"IF(L14>1400,1,VLOOKUP(O14,[1]ResourceLevelConfig!$A:$E,L14-998,FALSE)*2)","v":2860},37,null,"21012;1003","1;2860"]
[11,1,11,null,"第11层",null,1,2011,"1001;21012",null,21012,1001,1,{"$f":"IF(L15>1400,1,VLOOKUP(O15,[1]ResourceLevelConfig!$A:$E,L15-998,FALSE)*2)","v":29562},40,null,"21012;1001","1;29562"]
[12,1,12,null,"第12层",null,1,2012,"1003;21012",null,21012,1003,1,{"$f":"IF(L16>1400,1,VLOOKUP(O16,[1]ResourceLevelConfig!$A:$E,L16-998,FALSE)*2)","v":3040},43,null,"21012;1003","1;3040"]
[13,1,13,null,"第13层",null,1,2013,"1401;21012",null,21012,1401,1,{"$f":"IF(L17>1400,1,VLOOKUP(O17,[1]ResourceLevelConfig!$A:$E,L17-998,FALSE)*2)","v":1},46,null,"21012;1401","1;1"]
[14,1,14,null,"第14层",null,1,2014,"1001;21012",null,21012,1001,1,{"$f":"IF(L18>1400,1,VLOOKUP(O18,[1]ResourceLevelConfig!$A:$E,L18-998,FALSE)*2)","v":32352},49,null,"21012;1001","1;32352"]
[15,1,15,null,"第15层",null,1,2015,"1003;21012",null,21012,1003,1,{"$f":"IF(L19>1400,1,VLOOKUP(O19,[1]ResourceLevelConfig!$A:$E,L19-998,FALSE)*2)","v":3340},52,null,"21012;1003","1;3340"]
[16,1,16,null,"第16层",null,1,2016,"1001;21012",null,21012,1001,1,{"$f":"IF(L20>1400,1,VLOOKUP(O20,[1]ResourceLevelConfig!$A:$E,L20-998,FALSE)*2)","v":34356},55,null,"21012;1001","1;34356"]
[17,1,17,null,"第17层",null,1,2017,"1003;21012",null,21012,1003,1,{"$f":"IF(L21>1400,1,VLOOKUP(O21,[1]ResourceLevelConfig!$A:$E,L21-998,FALSE)*2)","v":3540},58,null,"21012;1003","1;3540"]
[18,1,18,null,"第18层",null,1,2018,"1401;21012",null,21012,1401,1,{"$f":"IF(L22>1400,1,VLOOKUP(O22,[1]ResourceLevelConfig!$A:$E,L22-998,FALSE)*2)","v":1},61,null,"21012;1401","1;1"]
[19,1,19,null,"第19层",null,1,2019,"1001;21012",null,21012,1001,1,{"$f":"IF(L23>1400,1,VLOOKUP(O23,[1]ResourceLevelConfig!$A:$E,L23-998,FALSE)*2)","v":37598},64,null,"21012;1001","1;37598"]
[20,1,20,null,"第20层",null,1,2020,"1003;21012",null,21012,1003,1,{"$f":"IF(L24>1400,1,VLOOKUP(O24,[1]ResourceLevelConfig!$A:$E,L24-998,FALSE)*2)","v":3880},67,null,"21012;1003","1;3880"]
[21,1,21,null,"第21层",null,1,2021,"1001;21012",null,21012,1001,1,{"$f":"IF(L25>1400,1,VLOOKUP(O25,[1]ResourceLevelConfig!$A:$E,L25-998,FALSE)*2)","v":39928},70,null,"21012;1001","1;39928"]
[22,1,22,null,"第22层",null,1,2022,"1003;21012",null,21012,1003,1,{"$f":"IF(L26>1400,1,VLOOKUP(O26,[1]ResourceLevelConfig!$A:$E,L26-998,FALSE)*2)","v":4120},73,null,"21012;1003","1;4120"]
[23,1,23,null,"第23层",null,1,2023,"1401;21012",null,21012,1401,1,{"$f":"IF(L27>1400,1,VLOOKUP(O27,[1]ResourceLevelConfig!$A:$E,L27-998,FALSE)*2)","v":1},76,null,"21012;1401","1;1"]
[24,1,24,null,"第24层",null,1,2024,"1001;21012",null,21012,1001,1,{"$f":"IF(L28>1400,1,VLOOKUP(O28,[1]ResourceLevelConfig!$A:$E,L28-998,FALSE)*2)","v":43694},79,null,"21012;1001","1;43694"]
[25,1,25,null,"第25层",null,1,2025,"1003;21012",null,21012,1003,1,{"$f":"IF(L29>1400,1,VLOOKUP(O29,[1]ResourceLevelConfig!$A:$E,L29-998,FALSE)*2)","v":4500},82,null,"21012;1003","1;4500"]
[26,1,26,null,"第26层",null,1,2026,"1001;21012",null,21012,1001,1,{"$f":"IF(L30>1400,1,VLOOKUP(O30,[1]ResourceLevelConfig!$A:$E,L30-998,FALSE)*2)","v":46402},85,null,"21012;1001","1;46402"]
[27,1,27,null,"第27层",null,1,2027,"1003;21012",null,21012,1003,1,{"$f":"IF(L31>1400,1,VLOOKUP(O31,[1]ResourceLevelConfig!$A:$E,L31-998,FALSE)*2)","v":4780},88,null,"21012;1003","1;4780"]
[28,1,28,null,"第28层",null,1,2028,"1402;21012",null,21012,1402,1,{"$f":"IF(L32>1400,1,VLOOKUP(O32,[1]ResourceLevelConfig!$A:$E,L32-998,FALSE)*2)","v":1},91,null,"21012;1402","1;1"]
[29,1,29,null,"第29层",null,1,2029,"1001;21012",null,21012,1001,1,{"$f":"IF(L33>1400,1,VLOOKUP(O33,[1]ResourceLevelConfig!$A:$E,L33-998,FALSE)*2)","v":50780},94,null,"21012;1001","1;50780"]
[30,1,30,null,"第30层",null,1,2030,"1003;21012",null,21012,1003,1,{"$f":"IF(L34>1400,1,VLOOKUP(O34,[1]ResourceLevelConfig!$A:$E,L34-998,FALSE)*2)","v":5240},97,null,"21012;1003","1;5240"]
[31,1,31,null,"第31层",null,1,2031,"1001;21012",null,21012,1001,1,{"$f":"IF(L35>1400,1,VLOOKUP(O35,[1]ResourceLevelConfig!$A:$E,L35-998,FALSE)*2)","v":53926},100,null,"21012;1001","1;53926"]
[32,1,32,null,"第32层",null,1,2032,"1003;21012",null,21012,1003,1,{"$f":"IF(L36>1400,1,VLOOKUP(O36,[1]ResourceLevelConfig!$A:$E,L36-998,FALSE)*2)","v":5560},103,null,"21012;1003","1;5560"]
[33,1,33,null,"第33层",null,1,2033,"1402;21012",null,21012,1402,1,{"$f":"IF(L37>1400,1,VLOOKUP(O37,[1]ResourceLevelConfig!$A:$E,L37-998,FALSE)*2)","v":1},106,null,"21012;1402","1;1"]
[34,1,34,null,"第34层",null,1,2034,"1001;21012",null,21012,1001,1,{"$f":"IF(L38>1400,1,VLOOKUP(O38,[1]ResourceLevelConfig!$A:$E,L38-998,FALSE)*2)","v":59016},109,null,"21012;1001","1;59016"]
[35,1,35,null,"第35层",null,1,2035,"1003;21012",null,21012,1003,1,{"$f":"IF(L39>1400,1,VLOOKUP(O39,[1]ResourceLevelConfig!$A:$E,L39-998,FALSE)*2)","v":6080},112,null,"21012;1003","1;6080"]
[36,1,36,null,"第36层",null,1,2036,"1001;21012",null,21012,1001,1,{"$f":"IF(L40>1400,1,VLOOKUP(O40,[1]ResourceLevelConfig!$A:$E,L40-998,FALSE)*2)","v":62672},115,null,"21012;1001","1;62672"]
[37,1,37,null,"第37层",null,1,2037,"1003;21012",null,21012,1003,1,{"$f":"IF(L41>1400,1,VLOOKUP(O41,[1]ResourceLevelConfig!$A:$E,L41-998,FALSE)*2)","v":6460},118,null,"21012;1003","1;6460"]
[38,1,38,null,"第38层",null,1,2038,"1402;21012",null,21012,1402,1,{"$f":"IF(L42>1400,1,VLOOKUP(O42,[1]ResourceLevelConfig!$A:$E,L42-998,FALSE)*2)","v":1},121,null,"21012;1402","1;1"]
[39,1,39,null,"第39层",null,1,2039,"1001;21012",null,21012,1001,1,{"$f":"IF(L43>1400,1,VLOOKUP(O43,[1]ResourceLevelConfig!$A:$E,L43-998,FALSE)*2)","v":68586},124,null,"21012;1001","1;68586"]
[40,1,40,null,"第40层",null,1,2040,"1003;21012",null,21012,1003,1,{"$f":"IF(L44>1400,1,VLOOKUP(O44,[1]ResourceLevelConfig!$A:$E,L44-998,FALSE)*2)","v":7060},127,null,"21012;1003","1;7060"]
[41,1,41,null,"第41层",null,1,2041,"1001;21012",null,21012,1001,1,{"$f":"IF(L45>1400,1,VLOOKUP(O45,[1]ResourceLevelConfig!$A:$E,L45-998,FALSE)*2)","v":72836},130,null,"21012;1001","1;72836"]
[42,1,42,null,"第42层",null,1,2042,"1003;21012",null,21012,1003,1,{"$f":"IF(L46>1400,1,VLOOKUP(O46,[1]ResourceLevelConfig!$A:$E,L46-998,FALSE)*2)","v":7500},133,null,"21012;1003","1;7500"]
[43,1,43,null,"第43层",null,1,2043,"1402;21012",null,21012,1402,1,{"$f":"IF(L47>1400,1,VLOOKUP(O47,[1]ResourceLevelConfig!$A:$E,L47-998,FALSE)*2)","v":1},136,null,"21012;1402","1;1"]
[44,1,44,null,"第44层",null,1,2044,"1001;21012",null,21012,1001,1,{"$f":"IF(L48>1400,1,VLOOKUP(O48,[1]ResourceLevelConfig!$A:$E,L48-998,FALSE)*2)","v":79708},139,null,"21012;1001","1;79708"]
[45,1,45,null,"第45层",null,1,2045,"1003;21012",null,21012,1003,1,{"$f":"IF(L49>1400,1,VLOOKUP(O49,[1]ResourceLevelConfig!$A:$E,L49-998,FALSE)*2)","v":8220},142,null,"21012;1003","1;8220"]
[46,1,46,null,"第46层",null,1,2046,"1001;21012",null,21012,1001,1,{"$f":"IF(L50>1400,1,VLOOKUP(O50,[1]ResourceLevelConfig!$A:$E,L50-998,FALSE)*2)","v":84648},145,null,"21012;1001","1;84648"]
[47,1,47,null,"第47层",null,1,2047,"1003;21012",null,21012,1003,1,{"$f":"IF(L51>1400,1,VLOOKUP(O51,[1]ResourceLevelConfig!$A:$E,L51-998,FALSE)*2)","v":8720},148,null,"21012;1003","1;8720"]
[48,1,48,null,"第48层",null,1,2048,"1402;21012",null,21012,1402,1,{"$f":"IF(L52>1400,1,VLOOKUP(O52,[1]ResourceLevelConfig!$A:$E,L52-998,FALSE)*2)","v":1},151,null,"21012;1402","1;1"]
[49,1,49,null,"第49层",null,1,2049,"1001;21012",null,21012,1001,1,{"$f":"IF(L53>1400,1,VLOOKUP(O53,[1]ResourceLevelConfig!$A:$E,L53-998,FALSE)*2)","v":92634},154,null,"21012;1001","1;92634"]
[50,1,50,null,"第50层",null,1,2050,"1003;21012",null,21012,1003,1,{"$f":"IF(L54>1400,1,VLOOKUP(O54,[1]ResourceLevelConfig!$A:$E,L54-998,FALSE)*2)","v":9540},157,null,"21012;1003","1;9540"]
[51,1,51,null,"第51层",null,1,2051,"1001;21012",null,21012,1001,1,{"$f":"IF(L55>1400,1,VLOOKUP(O55,[1]ResourceLevelConfig!$A:$E,L55-998,FALSE)*2)","v":98374},160,null,"21012;1001","1;98374"]
[52,1,52,null,"第52层",null,1,2052,"1003;21012",null,21012,1003,1,{"$f":"IF(L56>1400,1,VLOOKUP(O56,[1]ResourceLevelConfig!$A:$E,L56-998,FALSE)*2)","v":10140},163,null,"21012;1003","1;10140"]
[53,1,53,null,"第53层",null,1,2053,"1403;21012",null,21012,1403,1,{"$f":"IF(L57>1400,1,VLOOKUP(O57,[1]ResourceLevelConfig!$A:$E,L57-998,FALSE)*2)","v":1},166,null,"21012;1403","1;1"]
[54,1,54,null,"第54层",null,1,2054,"1001;21012",null,21012,1001,1,{"$f":"IF(L58>1400,1,VLOOKUP(O58,[1]ResourceLevelConfig!$A:$E,L58-998,FALSE)*2)","v":107658},169,null,"21012;1001","1;107658"]
[55,1,55,null,"第55层",null,1,2055,"1003;21012",null,21012,1003,1,{"$f":"IF(L59>1400,1,VLOOKUP(O59,[1]ResourceLevelConfig!$A:$E,L59-998,FALSE)*2)","v":11100},172,null,"21012;1003","1;11100"]
[56,1,56,null,"第56层",null,1,2056,"1001;21012",null,21012,1001,1,{"$f":"IF(L60>1400,1,VLOOKUP(O60,[1]ResourceLevelConfig!$A:$E,L60-998,FALSE)*2)","v":114328},175,null,"21012;1001","1;114328"]
[57,1,57,null,"第57层",null,1,2057,"1003;21012",null,21012,1003,1,{"$f":"IF(L61>1400,1,VLOOKUP(O61,[1]ResourceLevelConfig!$A:$E,L61-998,FALSE)*2)","v":11780},178,null,"21012;1003","1;11780"]
[58,1,58,null,"第58层",null,1,2058,"1403;21012",null,21012,1403,1,{"$f":"IF(L62>1400,1,VLOOKUP(O62,[1]ResourceLevelConfig!$A:$E,L62-998,FALSE)*2)","v":1},181,null,"21012;1403","1;1"]
[59,1,59,null,"第59层",null,1,2059,"1001;21012",null,21012,1001,1,{"$f":"IF(L63>1400,1,VLOOKUP(O63,[1]ResourceLevelConfig!$A:$E,L63-998,FALSE)*2)","v":125116},184,null,"21012;1001","1;125116"]
[60,1,60,null,"第60层",null,1,2060,"1003;21012",null,21012,1003,1,{"$f":"IF(L64>1400,1,VLOOKUP(O64,[1]ResourceLevelConfig!$A:$E,L64-998,FALSE)*2)","v":12900},187,null,"21012;1003","1;12900"]
[61,1,61,null,"第61层",null,1,2061,"1001;21012",null,21012,1001,1,{"$f":"IF(L65>1400,1,VLOOKUP(O65,[1]ResourceLevelConfig!$A:$E,L65-998,FALSE)*2)","v":132868},190,null,"21012;1001","1;132868"]
[62,1,62,null,"第62层",null,1,2062,"1003;21012",null,21012,1003,1,{"$f":"IF(L66>1400,1,VLOOKUP(O66,[1]ResourceLevelConfig!$A:$E,L66-998,FALSE)*2)","v":13700},193,null,"21012;1003","1;13700"]
[63,1,63,null,"第63层",null,1,2063,"1403;21012",null,21012,1403,1,{"$f":"IF(L67>1400,1,VLOOKUP(O67,[1]ResourceLevelConfig!$A:$E,L67-998,FALSE)*2)","v":1},196,null,"21012;1403","1;1"]
[64,1,64,null,"第64层",null,1,2064,"1001;21012",null,21012,1001,1,{"$f":"IF(L68>1400,1,VLOOKUP(O68,[1]ResourceLevelConfig!$A:$E,L68-998,FALSE)*2)","v":145406},199,null,"21012;1001","1;145406"]
[65,1,65,null,"第65层",null,1,2065,"1003;21012",null,21012,1003,1,{"$f":"IF(L69>1400,1,VLOOKUP(O69,[1]ResourceLevelConfig!$A:$E,L69-998,FALSE)*2)","v":14980},202,null,"21012;1003","1;14980"]
[66,1,66,null,"第66层",null,1,2066,{"$f":"CONCATENATE(L70,\";\",K70)","v":"1001;21012"},null,21012,1001,1,{"$f":"IF(L70>1400,1,VLOOKUP(O70,[1]ResourceLevelConfig!$A:$E,L70-998,FALSE)*2)","v":154414},205,null,{"$f":"_xlfn.TEXTJOIN(\";\",1,K70:L70)","v":"21012;1001"},{"$f":"_xlfn.TEXTJOIN(\";\",1,M70:N70)","v":"1;154414"}]
[67,1,67,null,"第67层",null,1,2067,"1003;21012",null,21012,1003,1,{"$f":"IF(L71>1400,1,VLOOKUP(O71,[1]ResourceLevelConfig!$A:$E,L71-998,FALSE)*2)","v":15920},208,null,"21012;1003","1;15920"]
[68,1,68,null,"第68层",null,1,2068,"1403;21012",null,21012,1403,1,{"$f":"IF(L72>1400,1,VLOOKUP(O72,[1]ResourceLevelConfig!$A:$E,L72-998,FALSE)*2)","v":1},211,null,"21012;1403","1;1"]
[69,1,69,null,"第69层",null,1,2069,"1001;21012",null,21012,1001,1,{"$f":"IF(L73>1400,1,VLOOKUP(O73,[1]ResourceLevelConfig!$A:$E,L73-998,FALSE)*2)","v":168986},214,null,"21012;1001","1;168986"]
[70,1,70,null,"第70层",null,1,2070,"1003;21012",null,21012,1003,1,{"$f":"IF(L74>1400,1,VLOOKUP(O74,[1]ResourceLevelConfig!$A:$E,L74-998,FALSE)*2)","v":17420},217,null,"21012;1003","1;17420"]
[71,1,71,null,"第71层",null,1,2071,"1001;21012",null,21012,1001,1,{"$f":"IF(L75>1400,1,VLOOKUP(O75,[1]ResourceLevelConfig!$A:$E,L75-998,FALSE)*2)","v":179456},220,null,"21012;1001","1;179456"]
[72,1,72,null,"第72层",null,1,2072,"1003;21012",null,21012,1003,1,{"$f":"IF(L76>1400,1,VLOOKUP(O76,[1]ResourceLevelConfig!$A:$E,L76-998,FALSE)*2)","v":18500},223,null,"21012;1003","1;18500"]
[73,1,73,null,"第73层",null,1,2073,"1403;21012",null,21012,1403,1,{"$f":"IF(L77>1400,1,VLOOKUP(O77,[1]ResourceLevelConfig!$A:$E,L77-998,FALSE)*2)","v":1},226,null,"21012;1403","1;1"]
[74,1,74,null,"第74层",null,1,2074,"1001;21012",null,21012,1001,1,{"$f":"IF(L78>1400,1,VLOOKUP(O78,[1]ResourceLevelConfig!$A:$E,L78-998,FALSE)*2)","v":196390},229,null,"21012;1001","1;196390"]
[75,1,75,null,"第75层",null,1,2075,"1003;21012",null,21012,1003,1,{"$f":"IF(L79>1400,1,VLOOKUP(O79,[1]ResourceLevelConfig!$A:$E,L79-998,FALSE)*2)","v":20240},232,null,"21012;1003","1;20240"]
[76,1,76,null,"第76层",null,1,2076,"1001;21012",null,21012,1001,1,{"$f":"IF(L80>1400,1,VLOOKUP(O80,[1]ResourceLevelConfig!$A:$E,L80-998,FALSE)*2)","v":208558},235,null,"21012;1001","1;208558"]
[77,1,77,null,"第77层",null,1,2077,"1003;21012",null,21012,1003,1,{"$f":"IF(L81>1400,1,VLOOKUP(O81,[1]ResourceLevelConfig!$A:$E,L81-998,FALSE)*2)","v":21500},238,null,"21012;1003","1;21500"]
[78,1,78,null,"第78层",null,1,2078,"1404;21012",null,21012,1404,1,{"$f":"IF(L82>1400,1,VLOOKUP(O82,[1]ResourceLevelConfig!$A:$E,L82-998,FALSE)*2)","v":1},241,null,"21012;1404","1;1"]
[79,1,79,null,"第79层",null,1,2079,"1001;21012",null,21012,1001,1,{"$f":"IF(L83>1400,1,VLOOKUP(O83,[1]ResourceLevelConfig!$A:$E,L83-998,FALSE)*2)","v":228238},244,null,"21012;1001","1;228238"]
[80,1,80,null,"第80层",null,1,2080,"1003;21012",null,21012,1003,1,{"$f":"IF(L84>1400,1,VLOOKUP(O84,[1]ResourceLevelConfig!$A:$E,L84-998,FALSE)*2)","v":23520},247,null,"21012;1003","1;23520"]
[81,1,81,null,"第81层",null,1,2081,"1001;21012",null,21012,1001,1,{"$f":"IF(L85>1400,1,VLOOKUP(O85,[1]ResourceLevelConfig!$A:$E,L85-998,FALSE)*2)","v":242380},250,null,"21012;1001","1;242380"]
[82,1,82,null,"第82层",null,1,2082,"1003;21012",null,21012,1003,1,{"$f":"IF(L86>1400,1,VLOOKUP(O86,[1]ResourceLevelConfig!$A:$E,L86-998,FALSE)*2)","v":24980},253,null,"21012;1003","1;24980"]
[83,1,83,null,"第83层",null,1,2083,"1404;21012",null,21012,1404,1,{"$f":"IF(L87>1400,1,VLOOKUP(O87,[1]ResourceLevelConfig!$A:$E,L87-998,FALSE)*2)","v":1},256,null,"21012;1404","1;1"]
[84,1,84,null,"第84层",null,1,2084,"1001;21012",null,21012,1001,1,{"$f":"IF(L88>1400,1,VLOOKUP(O88,[1]ResourceLevelConfig!$A:$E,L88-998,FALSE)*2)","v":265252},259,null,"21012;1001","1;265252"]
[85,1,85,null,"第85层",null,1,2085,"1003;21012",null,21012,1003,1,{"$f":"IF(L89>1400,1,VLOOKUP(O89,[1]ResourceLevelConfig!$A:$E,L89-998,FALSE)*2)","v":27340},262,null,"21012;1003","1;27340"]
[86,1,86,null,"第86层",null,1,2086,"1001;21012",null,21012,1001,1,{"$f":"IF(L90>1400,1,VLOOKUP(O90,[1]ResourceLevelConfig!$A:$E,L90-998,FALSE)*2)","v":281686},265,null,"21012;1001","1;281686"]
[87,1,87,null,"第87层",null,1,2087,"1003;21012",null,21012,1003,1,{"$f":"IF(L91>1400,1,VLOOKUP(O91,[1]ResourceLevelConfig!$A:$E,L91-998,FALSE)*2)","v":29020},268,null,"21012;1003","1;29020"]
[88,1,88,null,"第88层",null,1,2088,"1404;21012",null,21012,1404,1,{"$f":"IF(L92>1400,1,VLOOKUP(O92,[1]ResourceLevelConfig!$A:$E,L92-998,FALSE)*2)","v":1},271,null,"21012;1404","1;1"]
[89,1,89,null,"第89层",null,1,2089,"1001;21012",null,21012,1001,1,{"$f":"IF(L93>1400,1,VLOOKUP(O93,[1]ResourceLevelConfig!$A:$E,L93-998,FALSE)*2)","v":308266},274,null,"21012;1001","1;308266"]
[90,1,90,null,"第90层",null,1,2090,"1003;21012",null,21012,1003,1,{"$f":"IF(L94>1400,1,VLOOKUP(O94,[1]ResourceLevelConfig!$A:$E,L94-998,FALSE)*2)","v":31760},277,null,"21012;1003","1;31760"]
[91,1,91,null,"第91层",null,1,2091,"1001;21012",null,21012,1001,1,{"$f":"IF(L95>1400,1,VLOOKUP(O95,[1]ResourceLevelConfig!$A:$E,L95-998,FALSE)*2)","v":327366},280,null,"21012;1001","1;327366"]
[92,1,92,null,"第92层",null,1,2092,"1003;21012",null,21012,1003,1,{"$f":"IF(L96>1400,1,VLOOKUP(O96,[1]ResourceLevelConfig!$A:$E,L96-998,FALSE)*2)","v":33740},283,null,"21012;1003","1;33740"]
[93,1,93,null,"第93层",null,1,2093,"1404;21012",null,21012,1404,1,{"$f":"IF(L97>1400,1,VLOOKUP(O97,[1]ResourceLevelConfig!$A:$E,L97-998,FALSE)*2)","v":1},286,null,"21012;1404","1;1"]
[94,1,94,null,"第94层",null,1,2094,"1001;21012",null,21012,1001,1,{"$f":"IF(L98>1400,1,VLOOKUP(O98,[1]ResourceLevelConfig!$A:$E,L98-998,FALSE)*2)","v":354686},288,null,"21012;1001","1;354686"]
[95,1,95,null,"第95层",null,1,2095,"1003;21012",null,21012,1003,1,{"$f":"IF(L99>1400,1,VLOOKUP(O99,[1]ResourceLevelConfig!$A:$E,L99-998,FALSE)*2)","v":36180},290,null,"21012;1003","1;36180"]
[96,1,96,null,"第96层",null,1,2096,"1001;21012",null,21012,1001,1,{"$f":"IF(L100>1400,1,VLOOKUP(O100,[1]ResourceLevelConfig!$A:$E,L100-998,FALSE)*2)","v":369190},292,null,"21012;1001","1;369190"]
[97,1,97,null,"第97层",null,1,2097,"1003;21012",null,21012,1003,1,{"$f":"IF(L101>1400,1,VLOOKUP(O101,[1]ResourceLevelConfig!$A:$E,L101-998,FALSE)*2)","v":37660},294,null,"21012;1003","1;37660"]
[98,1,98,null,"第98层",null,1,2098,"1404;21012",null,21012,1404,1,{"$f":"IF(L102>1400,1,VLOOKUP(O102,[1]ResourceLevelConfig!$A:$E,L102-998,FALSE)*2)","v":1},296,null,"21012;1404","1;1"]
[99,1,99,null,"第99层",null,1,2099,"1001;21012",null,21012,1001,1,{"$f":"IF(L103>1400,1,VLOOKUP(O103,[1]ResourceLevelConfig!$A:$E,L103-998,FALSE)*2)","v":392064},298,null,"21012;1001","1;392064"]
[100,1,100,null,"第100层",null,1,2100,"1003;21012",null,21012,1003,1,{"$f":"IF(L104>1400,1,VLOOKUP(O104,[1]ResourceLevelConfig!$A:$E,L104-998,FALSE)*2)","v":40000},300,null,"21012;1003","1;40000"]