{"text_format":"2","workbook":"xlsx","n_sheets":3,"sheets":["ItemConfig","ID分段","道具用途说明"],"not_rendered":{"charts":0,"images":0,"macros":0,"external_links":4,"defined_names":1,"comments":0,"pivot_tables":0},"unopened":[],"bounds":{"document_bytes":16777216,"sheet_cells":100000,"run_cost":"one","rows_first":2000,"rows_last":500,"rows_between":2000,"halvings":0,"cell_chars":16384,"cell_head_chars":4096},"cells_cut":0,"cells_raw":0,"read":"whole","date_system":"1900"}

{"sheet":"ItemConfig","index":0,"n_rows":213,"n_cols":40,"rows_kept":213,"cut":false,"hidden":false,"merged":[]}
["ID","itemName",null,"itemDesc",null,"icon","itemTag",null,"quality","stack","isSell","SkiptoID","rewardsNum","isVisible","isUse","useLimit","useLimtValue","costItemNum","rewardsItems","rewardsItemNums","stack","associateID","associateVlaue","sort","itemDesc2"]
["int","int",null,"int",null,"string","int",null,"int","int","bool","int[]","int","int","bool","int",null,"int","int[]","int[]","int","int","int[]","int","int"]
[]
["ID1","道具名称\n","道具名\n(查看)","功能说明","功能说明","道具图标","道具分类\n见ID分段",{"$f":"SUBTOTAL(3,H5:H10009)","v":191},"品质\n1.[物品]白\n2.[物品]绿\n3.[物品]蓝\n4.[物品]紫\n5.[物品]橙\n6.[物品]红","堆叠数量\n0.无限","是否出售","跳转ID","出售金额","进入背包时，是否可见","是否可用","使用限制\n0. 无\n1. 共鸣等级","限制的值","消耗道具数量","获得道具ID","获得道具的数量","堆叠数量\n0.无限","特殊功能ID\n详情见说明页","特殊功能参数\n详情见说明页","背包内排序","包装文本","包装文本","参数1","参数2","参数3","参数4","参数5",null,"跳转1","跳转2","跳转3","跳转1","跳转2","跳转3"]
[1001,169,"灵石",162,"游历仙界最基础的货币。","icon_Coin",1,{"$f":"CONCATENATE(VLOOKUP(G5,ID分段!A:B,2,FALSE),\"-\",VLOOKUP(G5,ID分段!A:C,3,FALSE))","v":"资源-货币"},2,0,0,{"$f":"_xlfn.TEXTJOIN(\";\",1,AG5:AI5)","v":"5;14"},0,1,0,null,null,0,0,0,0,{"$nulls":11},5,14,null,{"$f":"IF(AG5=\"\",\"\",VLOOKUP(AG5,[1]SkiptoConfig!$A:$H,8,FALSE))","v":"使用神识"},{"$f":"IF(AH5=\"\",\"\",VLOOKUP(AH5,[1]SkiptoConfig!$A:$H,8,FALSE))","v":"命运峰"},{"$f":"IF(AI5=\"\",\"\",VLOOKUP(AI5,[1]SkiptoConfig!$A:$H,8,FALSE))","v":""}]
[1002,170,"妖丹",163,"妖物魂魄凝结而成的丹药，一般作为较为稀有的货币。","icon_Coins_s",1,{"$f":"CONCATENATE(VLOOKUP(G6,ID分段!A:B,2,FALSE),\"-\",VLOOKUP(G6,ID分段!A:C,3,FALSE))","v":"资源-货币"},4,0,0,{"$f":"_xlfn.TEXTJOIN(\";\",1,AG6:AI6)","v":"4"},0,1,0,null,null,0,0,0,0,{"$nulls":11},4,null,null,{"$f":"IF(AG6=\"\",\"\",VLOOKUP(AG6,[1]SkiptoConfig!$A:$H,8,FALSE))","v":"兑换商店-妖丹兑换"},{"$f":"IF(AH6=\"\",\"\",VLOOKUP(AH6,[1]SkiptoConfig!$A:$H,8,FALSE))","v":""},{"$f":"IF(AI6=\"\",\"\",VLOOKUP(AI6,[1]SkiptoConfig!$A:$H,8,FALSE))","v":""}]
[1003,171,"修为",164,"英雄提升等级所必需的资源。","icon_Gem_Star_Blue",2,{"$f":"CONCATENATE(VLOOKUP(G7,ID分段!A:B,2,FALSE),\"-\",VLOOKUP(G7,ID分段!A:C,3,FALSE))","v":"资源-材料"},2,0,0,"5;14",0,1,0,null,null,0,0,0,0,13,{"$nulls":10},5,14,null,{"$f":"IF(AG7=\"\",\"\",VLOOKUP(AG7,[1]SkiptoConfig!$A:$H,8,FALSE))","v":"使用神识"},{"$f":"IF(AH7=\"\",\"\",VLOOKUP(AH7,[1]SkiptoConfig!$A:$H,8,FALSE))","v":"命运峰"},{"$f":"IF(AI7=\"\",\"\",VLOOKUP(AI7,[1]SkiptoConfig!$A:$H,8,FALSE))","v":""}]
[1004,248,"仙缘宝券",249,"仙界最为珍贵的货币。","icon_Demo_Gem04",1,{"$f":"CONCATENATE(VLOOKUP(G8,ID分段!A:B,2,FALSE),\"-\",VLOOKUP(G8,ID分段!A:C,3,FALSE))","v":"资源-货币"},5,0,0,"6",0,1,0,null,null,0,0,0,0,{"$nulls":11},6,null,null,{"$f":"IF(AG8=\"\",\"\",VLOOKUP(AG8,[1]SkiptoConfig!$A:$H,8,FALSE))","v":"白嫖代金券"},{"$f":"IF(AH8=\"\",\"\",VLOOKUP(AH8,[1]SkiptoConfig!$A:$H,8,FALSE))","v":""},{"$f":"IF(AI8=\"\",\"\",VLOOKUP(AI8,[1]SkiptoConfig!$A:$H,8,FALSE))","v":""}]
[1005,725,"灵气",726,"功法升级所必需的资源。","icon_GradeBadge_Master",2,{"$f":"CONCATENATE(VLOOKUP(G9,ID分段!A:B,2,FALSE),\"-\",VLOOKUP(G9,ID分段!A:C,3,FALSE))","v":"资源-材料"},3,0,0,"10;5",0,1,0,null,null,0,0,0,0,{"$nulls":11},10,5,null,{"$f":"IF(AG9=\"\",\"\",VLOOKUP(AG9,[1]SkiptoConfig!$A:$H,8,FALSE))","v":"探宝"},{"$f":"IF(AH9=\"\",\"\",VLOOKUP(AH9,[1]SkiptoConfig!$A:$H,8,FALSE))","v":"使用神识"},{"$f":"IF(AI9=\"\",\"\",VLOOKUP(AI9,[1]SkiptoConfig!$A:$H,8,FALSE))","v":""}]
[1006,1400,"玄晶",1401,"法宝升级所必需的资源。","icon_GradeBadge_Challenger",2,{"$f":"CONCATENATE(VLOOKUP(G10,ID分段!A:B,2,FALSE),\"-\",VLOOKUP(G10,ID分段!A:C,3,FALSE))","v":"资源-材料"},3,0,0,"10;5",0,1,0,null,null,0,0,0,0,{"$nulls":11},10,5,null,{"$f":"IF(AG10=\"\",\"\",VLOOKUP(AG10,[1]SkiptoConfig!$A:$H,8,FALSE))","v":"探宝"},{"$f":"IF(AH10=\"\",\"\",VLOOKUP(AH10,[1]SkiptoConfig!$A:$H,8,FALSE))","v":"使用神识"},{"$f":"IF(AI10=\"\",\"\",VLOOKUP(AI10,[1]SkiptoConfig!$A:$H,8,FALSE))","v":""}]
[1007,-1,"广告币",-1,null,"icon_GradeBadge_Challenger",1,{"$f":"CONCATENATE(VLOOKUP(G11,ID分段!A:B,2,FALSE),\"-\",VLOOKUP(G11,ID分段!A:C,3,FALSE))","v":"资源-货币"},4,0,0,"",0,0,0,null,null,0,0,0,0,{"$nulls":14},{"$f":"IF(AG11=\"\",\"\",VLOOKUP(AG11,[1]SkiptoConfig!$A:$H,8,FALSE))","v":""},{"$f":"IF(AH11=\"\",\"\",VLOOKUP(AH11,[1]SkiptoConfig!$A:$H,8,FALSE))","v":""},{"$f":"IF(AI11=\"\",\"\",VLOOKUP(AI11,[1]SkiptoConfig!$A:$H,8,FALSE))","v":""}]
[{"$nulls":11},"",{"$nulls":23},{"$f":"IF(AG12=\"\",\"\",VLOOKUP(AG12,[1]SkiptoConfig!$A:$H,8,FALSE))","v":""},{"$f":"IF(AH12=\"\",\"\",VLOOKUP(AH12,[1]SkiptoConfig!$A:$H,8,FALSE))","v":""},{"$f":"IF(AI12=\"\",\"\",VLOOKUP(AI12,[1]SkiptoConfig!$A:$H,8,FALSE))","v":""}]
[1101,-1,{"$f":"CONCATENATE(\"自转道具-\",VLOOKUP(AA13,A:C,3,FALSE),\"×\",AB13)","v":"自转道具-仙缘宝券×6"},-1,null,"icon_GradeBadge_Challenger",9,{"$f":"CONCATENATE(VLOOKUP(G13,ID分段!A:B,2,FALSE),\"-\",VLOOKUP(G13,ID分段!A:C,3,FALSE))","v":"资源-自动转代币"},3,0,0,"",0,0,0,null,null,0,0,0,0,9,{"$f":"_xlfn.TEXTJOIN(\";\",1,AA13:AE13)","v":"1004;6"},null,null,null,1004,6,{"$nulls":7},{"$f":"IF(AG13=\"\",\"\",VLOOKUP(AG13,[1]SkiptoConfig!$A:$H,8,FALSE))","v":""},{"$f":"IF(AH13=\"\",\"\",VLOOKUP(AH13,[1]SkiptoConfig!$A:$H,8,FALSE))","v":""},{"$f":"IF(AI13=\"\",\"\",VLOOKUP(AI13,[1]SkiptoConfig!$A:$H,8,FALSE))","v":""}]
[1102,-1,"自转道具-仙缘宝券×30",-1,null,"icon_GradeBadge_Challenger",9,{"$f":"CONCATENATE(VLOOKUP(G14,ID分段!A:B,2,FALSE),\"-\",VLOOKUP(G14,ID分段!A:C,3,FALSE))","v":"资源-自动转代币"},3,0,0,"",0,0,0,null,null,0,0,0,0,9,{"$f":"_xlfn.TEXTJOIN(\";\",1,AA14:AE14)","v":"1004;30"},null,null,null,1004,30,{"$nulls":7},{"$f":"IF(AG14=\"\",\"\",VLOOKUP(AG14,[1]SkiptoConfig!$A:$H,8,FALSE))","v":""},{"$f":"IF(AH14=\"\",\"\",VLOOKUP(AH14,[1]SkiptoConfig!$A:$H,8,FALSE))","v":""},{"$f":"IF(AI14=\"\",\"\",VLOOKUP(AI14,[1]SkiptoConfig!$A:$H,8,FALSE))","v":""}]
[1103,-1,"自转道具-仙缘宝券×98",-1,null,"icon_GradeBadge_Challenger",9,{"$f":"CONCATENATE(VLOOKUP(G15,ID分段!A:B,2,FALSE),\"-\",VLOOKUP(G15,ID分段!A:C,3,FALSE))","v":"资源-自动转代币"},4,0,0,"",0,0,0,null,null,0,0,0,0,9,"1004;98",null,null,null,1004,98,{"$nulls":7},{"$f":"IF(AG15=\"\",\"\",VLOOKUP(AG15,[1]SkiptoConfig!$A:$H,8,FALSE))","v":""},{"$f":"IF(AH15=\"\",\"\",VLOOKUP(AH15,[1]SkiptoConfig!$A:$H,8,FALSE))","v":""},{"$f":"IF(AI15=\"\",\"\",VLOOKUP(AI15,[1]SkiptoConfig!$A:$H,8,FALSE))","v":""}]
[1104,-1,"自转道具-仙缘宝券×198",-1,null,"icon_GradeBadge_Challenger",9,{"$f":"CONCATENATE(VLOOKUP(G16,ID分段!A:B,2,FALSE),\"-\",VLOOKUP(G16,ID分段!A:C,3,FALSE))","v":"资源-自动转代币"},4,0,0,"",0,0,0,null,null,0,0,0,0,9,"1004;198",null,null,null,1004,198,{"$nulls":7},{"$f":"IF(AG16=\"\",\"\",VLOOKUP(AG16,[1]SkiptoConfig!$A:$H,8,FALSE))","v":""},{"$f":"IF(AH16=\"\",\"\",VLOOKUP(AH16,[1]SkiptoConfig!$A:$H,8,FALSE))","v":""},{"$f":"IF(AI16=\"\",\"\",VLOOKUP(AI16,[1]SkiptoConfig!$A:$H,8,FALSE))","v":""}]
[1105,-1,"自转道具-仙缘宝券×328",-1,null,"icon_GradeBadge_Challenger",9,{"$f":"CONCATENATE(VLOOKUP(G17,ID分段!A:B,2,FALSE),\"-\",VLOOKUP(G17,ID分段!A:C,3,FALSE))","v":"资源-自动转代币"},5,0,0,"",0,0,0,null,null,0,0,0,0,9,"1004;328",null,null,null,1004,328,{"$nulls":7},{"$f":"IF(AG17=\"\",\"\",VLOOKUP(AG17,[1]SkiptoConfig!$A:$H,8,FALSE))","v":""},{"$f":"IF(AH17=\"\",\"\",VLOOKUP(AH17,[1]SkiptoConfig!$A:$H,8,FALSE))","v":""},{"$f":"IF(AI17=\"\",\"\",VLOOKUP(AI17,[1]SkiptoConfig!$A:$H,8,FALSE))","v":""}]
[1106,-1,"自转道具-仙缘宝券×648",-1,null,"icon_GradeBadge_Challenger",9,{"$f":"CONCATENATE(VLOOKUP(G18,ID分段!A:B,2,FALSE),\"-\",VLOOKUP(G18,ID分段!A:C,3,FALSE))","v":"资源-自动转代币"},5,0,0,"",0,0,0,null,null,0,0,0,0,9,"1004;648",null,null,null,1004,648,{"$nulls":7},{"$f":"IF(AG18=\"\",\"\",VLOOKUP(AG18,[1]SkiptoConfig!$A:$H,8,FALSE))","v":""},{"$f":"IF(AH18=\"\",\"\",VLOOKUP(AH18,[1]SkiptoConfig!$A:$H,8,FALSE))","v":""},{"$f":"IF(AI18=\"\",\"\",VLOOKUP(AI18,[1]SkiptoConfig!$A:$H,8,FALSE))","v":""}]
[{"$nulls":11},"",{"$nulls":23},{"$f":"IF(AG19=\"\",\"\",VLOOKUP(AG19,[1]SkiptoConfig!$A:$H,8,FALSE))","v":""},{"$f":"IF(AH19=\"\",\"\",VLOOKUP(AH19,[1]SkiptoConfig!$A:$H,8,FALSE))","v":""},{"$f":"IF(AI19=\"\",\"\",VLOOKUP(AI19,[1]SkiptoConfig!$A:$H,8,FALSE))","v":""}]
[1201,250,"渡劫丹",259,"最基础的渡劫丹，可提升10%渡劫成功率。","icon_dujiedan",3,{"$f":"CONCATENATE(VLOOKUP(G20,ID分段!A:B,2,FALSE),\"-\",VLOOKUP(G20,ID分段!A:C,3,FALSE))","v":"资源-渡劫丹"},3,0,0,"5;7",0,1,0,null,null,0,0,0,0,1,"1;300;10;10",null,null,null,1,300,10,10,null,null,5,7,null,{"$f":"IF(AG20=\"\",\"\",VLOOKUP(AG20,[1]SkiptoConfig!$A:$H,8,FALSE))","v":"使用神识"},{"$f":"IF(AH20=\"\",\"\",VLOOKUP(AH20,[1]SkiptoConfig!$A:$H,8,FALSE))","v":"兑换商店-每日特惠"},{"$f":"IF(AI20=\"\",\"\",VLOOKUP(AI20,[1]SkiptoConfig!$A:$H,8,FALSE))","v":""}]
[1202,251,"良品渡劫丹",260,"品相较好的渡劫丹，可提升15%渡劫成功率。","icon_dujiedan",3,{"$f":"CONCATENATE(VLOOKUP(G21,ID分段!A:B,2,FALSE),\"-\",VLOOKUP(G21,ID分段!A:C,3,FALSE))","v":"资源-渡劫丹"},4,0,0,"5;7",0,1,0,null,null,0,0,0,0,1,"1;300;15;25",null,null,null,1,300,15,25,null,null,5,7,null,{"$f":"IF(AG21=\"\",\"\",VLOOKUP(AG21,[1]SkiptoConfig!$A:$H,8,FALSE))","v":"使用神识"},{"$f":"IF(AH21=\"\",\"\",VLOOKUP(AH21,[1]SkiptoConfig!$A:$H,8,FALSE))","v":"兑换商店-每日特惠"},{"$f":"IF(AI21=\"\",\"\",VLOOKUP(AI21,[1]SkiptoConfig!$A:$H,8,FALSE))","v":""}]
[1203,252,"上品渡劫丹",261,"品相极好的渡劫丹，可提升25%渡劫成功率。","icon_dujiedan",3,{"$f":"CONCATENATE(VLOOKUP(G22,ID分段!A:B,2,FALSE),\"-\",VLOOKUP(G22,ID分段!A:C,3,FALSE))","v":"资源-渡劫丹"},5,0,0,"5",0,1,0,null,null,0,0,0,0,1,"1;300;25;50",null,null,null,1,300,25,50,null,null,5,null,null,{"$f":"IF(AG22=\"\",\"\",VLOOKUP(AG22,[1]SkiptoConfig!$A:$H,8,FALSE))","v":"使用神识"},{"$f":"IF(AH22=\"\",\"\",VLOOKUP(AH22,[1]SkiptoConfig!$A:$H,8,FALSE))","v":""},{"$f":"IF(AI22=\"\",\"\",VLOOKUP(AI22,[1]SkiptoConfig!$A:$H,8,FALSE))","v":""}]
[1204,253,"极品渡劫丹",262,"百年难得一见的渡劫丹，可提升40%渡劫成功率。","icon_dujiedan",3,{"$f":"CONCATENATE(VLOOKUP(G23,ID分段!A:B,2,FALSE),\"-\",VLOOKUP(G23,ID分段!A:C,3,FALSE))","v":"资源-渡劫丹"},6,0,0,"5",0,1,0,null,null,0,0,0,0,1,"1;300;40;80",null,null,null,1,300,40,80,null,null,5,null,null,{"$f":"IF(AG23=\"\",\"\",VLOOKUP(AG23,[1]SkiptoConfig!$A:$H,8,FALSE))","v":"使用神识"},{"$f":"IF(AH23=\"\",\"\",VLOOKUP(AH23,[1]SkiptoConfig!$A:$H,8,FALSE))","v":""},{"$f":"IF(AI23=\"\",\"\",VLOOKUP(AI23,[1]SkiptoConfig!$A:$H,8,FALSE))","v":""}]
[{"$nulls":11},"",{"$nulls":23},{"$f":"IF(AG24=\"\",\"\",VLOOKUP(AG24,[1]SkiptoConfig!$A:$H,8,FALSE))","v":""},{"$f":"IF(AH24=\"\",\"\",VLOOKUP(AH24,[1]SkiptoConfig!$A:$H,8,FALSE))","v":""},{"$f":"IF(AI24=\"\",\"\",VLOOKUP(AI24,[1]SkiptoConfig!$A:$H,8,FALSE))","v":""}]
[1301,268,"筑基丹",272,"突破练气期达到筑基期境界所必需的天材地宝。",{"$f":"\"icon_item_\"&A25","v":"icon_item_1301"},4,{"$f":"CONCATENATE(VLOOKUP(G25,ID分段!A:B,2,FALSE),\"-\",VLOOKUP(G25,ID分段!A:C,3,FALSE))","v":"资源-天材地宝"},4,0,0,"8",0,1,0,null,null,0,0,0,0,1,"1;300;45;0",null,null,null,1,300,45,0,null,null,8,null,null,{"$f":"IF(AG25=\"\",\"\",VLOOKUP(AG25,[1]SkiptoConfig!$A:$H,8,FALSE))","v":"主线剧情"},{"$f":"IF(AH25=\"\",\"\",VLOOKUP(AH25,[1]SkiptoConfig!$A:$H,8,FALSE))","v":""},{"$f":"IF(AI25=\"\",\"\",VLOOKUP(AI25,[1]SkiptoConfig!$A:$H,8,FALSE))","v":""},"练气期","筑基期"]
[1302,269,"金阳果",273,"突破筑基期达到结丹期境界所必需的天材地宝。",{"$f":"\"icon_item_\"&A26","v":"icon_item_1302"},4,{"$f":"CONCATENATE(VLOOKUP(G26,ID分段!A:B,2,FALSE),\"-\",VLOOKUP(G26,ID分段!A:C,3,FALSE))","v":"资源-天材地宝"},4,0,0,"8",0,1,0,null,null,0,0,0,0,1,"1;300;40;0",null,null,null,1,300,40,0,null,null,8,null,null,{"$f":"IF(AG26=\"\",\"\",VLOOKUP(AG26,[1]SkiptoConfig!$A:$H,8,FALSE))","v":"主线剧情"},{"$f":"IF(AH26=\"\",\"\",VLOOKUP(AH26,[1]SkiptoConfig!$A:$H,8,FALSE))","v":""},{"$f":"IF(AI26=\"\",\"\",VLOOKUP(AI26,[1]SkiptoConfig!$A:$H,8,FALSE))","v":""},"筑基期","结丹期"]
[1303,270,"九窍芝",274,"突破结丹期达到元婴期境界所必需的天材地宝。",{"$f":"\"icon_item_\"&A27","v":"icon_item_1303"},4,{"$f":"CONCATENATE(VLOOKUP(G27,ID分段!A:B,2,FALSE),\"-\",VLOOKUP(G27,ID分段!A:C,3,FALSE))","v":"资源-天材地宝"},4,0,0,"8",0,1,0,null,null,0,0,0,0,1,"1;300;35;0",null,null,null,1,300,35,0,null,null,8,null,null,{"$f":"IF(AG27=\"\",\"\",VLOOKUP(AG27,[1]SkiptoConfig!$A:$H,8,FALSE))","v":"主线剧情"},{"$f":"IF(AH27=\"\",\"\",VLOOKUP(AH27,[1]SkiptoConfig!$A:$H,8,FALSE))","v":""},{"$f":"IF(AI27=\"\",\"\",VLOOKUP(AI27,[1]SkiptoConfig!$A:$H,8,FALSE))","v":""},"结丹期","元婴期"]
[1304,271,"玄冥髓",275,"突破元婴期达到化神期境界所必需的天材地宝。",{"$f":"\"icon_item_\"&A28","v":"icon_item_1304"},4,{"$f":"CONCATENATE(VLOOKUP(G28,ID分段!A:B,2,FALSE),\"-\",VLOOKUP(G28,ID分段!A:C,3,FALSE))","v":"资源-天材地宝"},5,0,0,"8",0,1,0,null,null,0,0,0,0,1,"1;300;30;0",null,null,null,1,300,30,0,null,null,8,null,null,{"$f":"IF(AG28=\"\",\"\",VLOOKUP(AG28,[1]SkiptoConfig!$A:$H,8,FALSE))","v":"主线剧情"},{"$f":"IF(AH28=\"\",\"\",VLOOKUP(AH28,[1]SkiptoConfig!$A:$H,8,FALSE))","v":""},{"$f":"IF(AI28=\"\",\"\",VLOOKUP(AI28,[1]SkiptoConfig!$A:$H,8,FALSE))","v":""},"元婴期","化神期"]
[1305,10112,"九焰莲",10117,"突破化神期达到炼虚期境界所必需的天材地宝。","icon_item_1305",4,{"$f":"CONCATENATE(VLOOKUP(G29,ID分段!A:B,2,FALSE),\"-\",VLOOKUP(G29,ID分段!A:C,3,FALSE))","v":"资源-天材地宝"},5,0,0,{"$f":"_xlfn.TEXTJOIN(\";\",1,AG29:AI29)","v":"8"},0,1,0,null,null,0,0,0,0,1,"1;300;25;0",null,null,null,1,300,25,0,null,null,8,null,null,{"$f":"IF(AG29=\"\",\"\",VLOOKUP(AG29,[1]SkiptoConfig!$A:$H,8,FALSE))","v":"主线剧情"},{"$f":"IF(AH29=\"\",\"\",VLOOKUP(AH29,[1]SkiptoConfig!$A:$H,8,FALSE))","v":""},{"$f":"IF(AI29=\"\",\"\",VLOOKUP(AI29,[1]SkiptoConfig!$A:$H,8,FALSE))","v":""},"化神期","炼虚期"]
[1306,10113,"混沌合晶",10118,"突破炼虚期达到大乘期境界所必需的天材地宝。","icon_item_1306",4,{"$f":"CONCATENATE(VLOOKUP(G30,ID分段!A:B,2,FALSE),\"-\",VLOOKUP(G30,ID分段!A:C,3,FALSE))","v":"资源-天材地宝"},5,0,0,"8",0,1,0,null,null,0,0,0,0,1,"1;300;20;0",null,null,null,1,300,20,0,null,null,8,null,null,{"$f":"IF(AG30=\"\",\"\",VLOOKUP(AG30,[1]SkiptoConfig!$A:$H,8,FALSE))","v":"主线剧情"},{"$f":"IF(AH30=\"\",\"\",VLOOKUP(AH30,[1]SkiptoConfig!$A:$H,8,FALSE))","v":""},{"$f":"IF(AI30=\"\",\"\",VLOOKUP(AI30,[1]SkiptoConfig!$A:$H,8,FALSE))","v":""},"炼虚期","大乘期"]
[1307,10114,"鸿蒙紫华",10119,"突破大乘期达到飞升期境界所必需的天材地宝。","icon_item_1307",4,{"$f":"CONCATENATE(VLOOKUP(G31,ID分段!A:B,2,FALSE),\"-\",VLOOKUP(G31,ID分段!A:C,3,FALSE))","v":"资源-天材地宝"},6,0,0,"8",0,1,0,null,null,0,0,0,0,1,"1;300;15;0",null,null,null,1,300,15,0,null,null,8,null,null,{"$f":"IF(AG31=\"\",\"\",VLOOKUP(AG31,[1]SkiptoConfig!$A:$H,8,FALSE))","v":"主线剧情"},{"$f":"IF(AH31=\"\",\"\",VLOOKUP(AH31,[1]SkiptoConfig!$A:$H,8,FALSE))","v":""},{"$f":"IF(AI31=\"\",\"\",VLOOKUP(AI31,[1]SkiptoConfig!$A:$H,8,FALSE))","v":""},"大乘期","飞升期"]
[1308,10115,"开天古藤",10120,"突破飞升期达到逍遥期境界所必需的天材地宝。",{"$f":"\"icon_item_\"&A32","v":"icon_item_1308"},4,{"$f":"CONCATENATE(VLOOKUP(G32,ID分段!A:B,2,FALSE),\"-\",VLOOKUP(G32,ID分段!A:C,3,FALSE))","v":"资源-天材地宝"},6,0,0,"8",0,1,0,null,null,0,0,0,0,1,"1;300;10;0",null,null,null,1,300,10,0,null,null,8,null,null,{"$f":"IF(AG32=\"\",\"\",VLOOKUP(AG32,[1]SkiptoConfig!$A:$H,8,FALSE))","v":"主线剧情"},{"$f":"IF(AH32=\"\",\"\",VLOOKUP(AH32,[1]SkiptoConfig!$A:$H,8,FALSE))","v":""},{"$f":"IF(AI32=\"\",\"\",VLOOKUP(AI32,[1]SkiptoConfig!$A:$H,8,FALSE))","v":""},"飞升期","逍遥期"]
[1309,10116,"九天露华",10121,"突破逍遥期达到真神期境界所必需的天材地宝。",{"$f":"\"icon_item_\"&A33","v":"icon_item_1309"},4,{"$f":"CONCATENATE(VLOOKUP(G33,ID分段!A:B,2,FALSE),\"-\",VLOOKUP(G33,ID分段!A:C,3,FALSE))","v":"资源-天材地宝"},6,0,0,{"$f":"_xlfn.TEXTJOIN(\";\",1,AG33:AI33)","v":"8"},0,1,0,null,null,0,0,0,0,1,"1;300;5;0",null,null,null,1,300,5,0,null,null,8,null,null,{"$f":"IF(AG33=\"\",\"\",VLOOKUP(AG33,[1]SkiptoConfig!$A:$H,8,FALSE))","v":"主线剧情"},{"$f":"IF(AH33=\"\",\"\",VLOOKUP(AH33,[1]SkiptoConfig!$A:$H,8,FALSE))","v":""},{"$f":"IF(AI33=\"\",\"\",VLOOKUP(AI33,[1]SkiptoConfig!$A:$H,8,FALSE))","v":""},"逍遥期","真神期"]
[{"$nulls":11},""]
[1401,276,"增元丹",280,20,"icon_xiuweidan",5,{"$f":"CONCATENATE(VLOOKUP(G35,ID分段!A:B,2,FALSE),\"-\",VLOOKUP(G35,ID分段!A:C,3,FALSE))","v":"资源-经验丹"},2,0,0,"5;14",0,1,0,null,null,0,0,0,0,2,{"$f":"ROUND(Z35*0.001,0)*1000","v":4000},null,null,{"$f":"VLOOKUP(E35,[2]HeroPowerUpConfig!$A:$M,13,FALSE)*0.5","v":4175},{"$nulls":6},5,14,null,{"$f":"IF(AG35=\"\",\"\",VLOOKUP(AG35,[1]SkiptoConfig!$A:$H,8,FALSE))","v":"使用神识"},{"$f":"IF(AH35=\"\",\"\",VLOOKUP(AH35,[1]SkiptoConfig!$A:$H,8,FALSE))","v":"命运峰"},{"$f":"IF(AI35=\"\",\"\",VLOOKUP(AI35,[1]SkiptoConfig!$A:$H,8,FALSE))","v":""}]
[1402,277,"良品增元丹",281,50,"icon_xiuweidan",5,{"$f":"CONCATENATE(VLOOKUP(G36,ID分段!A:B,2,FALSE),\"-\",VLOOKUP(G36,ID分段!A:C,3,FALSE))","v":"资源-经验丹"},3,0,0,"5;14",0,1,0,null,null,0,0,0,0,2,{"$f":"ROUND(Z36*0.001,0)*1000","v":8000},null,null,{"$f":"VLOOKUP(E36,[2]HeroPowerUpConfig!$A:$M,13,FALSE)*0.5","v":8070},{"$nulls":6},5,14,null,{"$f":"IF(AG36=\"\",\"\",VLOOKUP(AG36,[1]SkiptoConfig!$A:$H,8,FALSE))","v":"使用神识"},{"$f":"IF(AH36=\"\",\"\",VLOOKUP(AH36,[1]SkiptoConfig!$A:$H,8,FALSE))","v":"命运峰"},{"$f":"IF(AI36=\"\",\"\",VLOOKUP(AI36,[1]SkiptoConfig!$A:$H,8,FALSE))","v":""}]
[1403,278,"上品增元丹",282,70,"icon_xiuweidan",5,{"$f":"CONCATENATE(VLOOKUP(G37,ID分段!A:B,2,FALSE),\"-\",VLOOKUP(G37,ID分段!A:C,3,FALSE))","v":"资源-经验丹"},4,0,0,"5;14",0,1,0,null,null,0,0,0,0,2,12000,null,null,{"$f":"VLOOKUP(E37,[2]HeroPowerUpConfig!$A:$M,13,FALSE)*0.5","v":11900},{"$nulls":6},5,14,null,{"$f":"IF(AG37=\"\",\"\",VLOOKUP(AG37,[1]SkiptoConfig!$A:$H,8,FALSE))","v":"使用神识"},{"$f":"IF(AH37=\"\",\"\",VLOOKUP(AH37,[1]SkiptoConfig!$A:$H,8,FALSE))","v":"命运峰"},{"$f":"IF(AI37=\"\",\"\",VLOOKUP(AI37,[1]SkiptoConfig!$A:$H,8,FALSE))","v":""}]
[1404,279,"极品增元丹",283,100,"icon_xiuweidan",5,{"$f":"CONCATENATE(VLOOKUP(G38,ID分段!A:B,2,FALSE),\"-\",VLOOKUP(G38,ID分段!A:C,3,FALSE))","v":"资源-经验丹"},5,0,0,"5;14",0,1,0,null,null,0,0,0,0,2,20000,null,null,{"$f":"VLOOKUP(E38,[2]HeroPowerUpConfig!$A:$M,13,FALSE)*0.5","v":20115},{"$nulls":6},5,14,null,{"$f":"IF(AG38=\"\",\"\",VLOOKUP(AG38,[1]SkiptoConfig!$A:$H,8,FALSE))","v":"使用神识"},{"$f":"IF(AH38=\"\",\"\",VLOOKUP(AH38,[1]SkiptoConfig!$A:$H,8,FALSE))","v":"命运峰"},{"$f":"IF(AI38=\"\",\"\",VLOOKUP(AI38,[1]SkiptoConfig!$A:$H,8,FALSE))","v":""}]
[{"$nulls":11},"",{"$nulls":23},{"$f":"IF(AG39=\"\",\"\",VLOOKUP(AG39,[1]SkiptoConfig!$A:$H,8,FALSE))","v":""},{"$f":"IF(AH39=\"\",\"\",VLOOKUP(AH39,[1]SkiptoConfig!$A:$H,8,FALSE))","v":""},{"$f":"IF(AI39=\"\",\"\",VLOOKUP(AI39,[1]SkiptoConfig!$A:$H,8,FALSE))","v":""}]
[1501,1947,"清茶",1949,{"$f":"CONCATENATE(\"道具描述_\",C40)","v":"道具描述_清茶"},"icon_haogandugift",6,{"$f":"CONCATENATE(VLOOKUP(G40,ID分段!A:B,2,FALSE),\"-\",VLOOKUP(G40,ID分段!A:C,3,FALSE))","v":"资源-好感度礼物"},3,0,0,"5",0,1,0,null,null,0,0,0,0,0,0,{"$nulls":9},5,null,null,{"$f":"IF(AG40=\"\",\"\",VLOOKUP(AG40,[1]SkiptoConfig!$A:$H,8,FALSE))","v":"使用神识"},{"$f":"IF(AH40=\"\",\"\",VLOOKUP(AH40,[1]SkiptoConfig!$A:$H,8,FALSE))","v":""},{"$f":"IF(AI40=\"\",\"\",VLOOKUP(AI40,[1]SkiptoConfig!$A:$H,8,FALSE))","v":""}]
[1502,1948,"茉莉花茶",1950,{"$f":"CONCATENATE(\"道具描述_\",C41)","v":"道具描述_茉莉花茶"},"icon_haogandugift",6,{"$f":"CONCATENATE(VLOOKUP(G41,ID分段!A:B,2,FALSE),\"-\",VLOOKUP(G41,ID分段!A:C,3,FALSE))","v":"资源-好感度礼物"},4,0,0,"5",0,1,0,null,null,0,0,0,0,0,0,{"$nulls":9},5,null,null,{"$f":"IF(AG41=\"\",\"\",VLOOKUP(AG41,[1]SkiptoConfig!$A:$H,8,FALSE))","v":"使用神识"},{"$f":"IF(AH41=\"\",\"\",VLOOKUP(AH41,[1]SkiptoConfig!$A:$H,8,FALSE))","v":""},{"$f":"IF(AI41=\"\",\"\",VLOOKUP(AI41,[1]SkiptoConfig!$A:$H,8,FALSE))","v":""}]
[{"$nulls":11},"",{"$nulls":23},{"$f":"IF(AG42=\"\",\"\",VLOOKUP(AG42,[1]SkiptoConfig!$A:$H,8,FALSE))","v":""},{"$f":"IF(AH42=\"\",\"\",VLOOKUP(AH42,[1]SkiptoConfig!$A:$H,8,FALSE))","v":""},{"$f":"IF(AI42=\"\",\"\",VLOOKUP(AI42,[1]SkiptoConfig!$A:$H,8,FALSE))","v":""}]
[1601,1951,"妃子笑",1952,{"$f":"CONCATENATE(\"道具描述_\",C43)","v":"道具描述_妃子笑"},"icon_xinqingliwu",7,{"$f":"CONCATENATE(VLOOKUP(G43,ID分段!A:B,2,FALSE),\"-\",VLOOKUP(G43,ID分段!A:C,3,FALSE))","v":"资源-心情礼物"},2,0,0,"5",0,1,0,null,null,0,0,0,0,5,10,{"$nulls":9},5,null,null,{"$f":"IF(AG43=\"\",\"\",VLOOKUP(AG43,[1]SkiptoConfig!$A:$H,8,FALSE))","v":"使用神识"},{"$f":"IF(AH43=\"\",\"\",VLOOKUP(AH43,[1]SkiptoConfig!$A:$H,8,FALSE))","v":""},{"$f":"IF(AI43=\"\",\"\",VLOOKUP(AI43,[1]SkiptoConfig!$A:$H,8,FALSE))","v":""}]
[{"$nulls":11},"",{"$nulls":23},{"$f":"IF(AG44=\"\",\"\",VLOOKUP(AG44,[1]SkiptoConfig!$A:$H,8,FALSE))","v":""},{"$f":"IF(AH44=\"\",\"\",VLOOKUP(AH44,[1]SkiptoConfig!$A:$H,8,FALSE))","v":""},{"$f":"IF(AI44=\"\",\"\",VLOOKUP(AI44,[1]SkiptoConfig!$A:$H,8,FALSE))","v":""}]
[1701,3237,"清识还元丹",3240,{"$f":"CONCATENATE(\"使用后恢复\",W45,\"点神识。\")","v":"使用后恢复100点神识。"},"icon_shenshidan",8,{"$f":"CONCATENATE(VLOOKUP(G45,ID分段!A:B,2,FALSE),\"-\",VLOOKUP(G45,ID分段!A:C,3,FALSE))","v":"资源-神识丹"},3,0,0,"8;7",0,1,0,null,null,0,0,0,0,8,100,{"$nulls":9},8,7,null,{"$f":"IF(AG45=\"\",\"\",VLOOKUP(AG45,[1]SkiptoConfig!$A:$H,8,FALSE))","v":"主线剧情"},{"$f":"IF(AH45=\"\",\"\",VLOOKUP(AH45,[1]SkiptoConfig!$A:$H,8,FALSE))","v":"兑换商店-每日特惠"},{"$f":"IF(AI45=\"\",\"\",VLOOKUP(AI45,[1]SkiptoConfig!$A:$H,8,FALSE))","v":""}]
[1702,3238,"归识还元丹",3241,{"$f":"CONCATENATE(\"使用后恢复\",W46,\"点神识。\")","v":"使用后恢复300点神识。"},"icon_shenshidan",8,{"$f":"CONCATENATE(VLOOKUP(G46,ID分段!A:B,2,FALSE),\"-\",VLOOKUP(G46,ID分段!A:C,3,FALSE))","v":"资源-神识丹"},4,0,0,"8",0,1,0,null,null,0,0,0,0,8,300,{"$nulls":9},8,null,null,{"$f":"IF(AG46=\"\",\"\",VLOOKUP(AG46,[1]SkiptoConfig!$A:$H,8,FALSE))","v":"主线剧情"},{"$f":"IF(AH46=\"\",\"\",VLOOKUP(AH46,[1]SkiptoConfig!$A:$H,8,FALSE))","v":""},{"$f":"IF(AI46=\"\",\"\",VLOOKUP(AI46,[1]SkiptoConfig!$A:$H,8,FALSE))","v":""}]
[1703,3239,"净识还元丹",3242,"使用后恢复1000点神识。","icon_shenshidan",8,{"$f":"CONCATENATE(VLOOKUP(G47,ID分段!A:B,2,FALSE),\"-\",VLOOKUP(G47,ID分段!A:C,3,FALSE))","v":"资源-神识丹"},5,0,0,"8;9",0,1,0,null,null,0,0,0,0,8,1000,{"$nulls":9},8,9,null,{"$f":"IF(AG47=\"\",\"\",VLOOKUP(AG47,[1]SkiptoConfig!$A:$H,8,FALSE))","v":"主线剧情"},{"$f":"IF(AH47=\"\",\"\",VLOOKUP(AH47,[1]SkiptoConfig!$A:$H,8,FALSE))","v":"白嫖氪金-新手礼包"},{"$f":"IF(AI47=\"\",\"\",VLOOKUP(AI47,[1]SkiptoConfig!$A:$H,8,FALSE))","v":""}]
[{"$nulls":11},"",{"$nulls":23},{"$f":"IF(AG48=\"\",\"\",VLOOKUP(AG48,[1]SkiptoConfig!$A:$H,8,FALSE))","v":""},{"$f":"IF(AH48=\"\",\"\",VLOOKUP(AH48,[1]SkiptoConfig!$A:$H,8,FALSE))","v":""},{"$f":"IF(AI48=\"\",\"\",VLOOKUP(AI48,[1]SkiptoConfig!$A:$H,8,FALSE))","v":""}]
[10001,284,"神龙鼎",292,{"$f":"VLOOKUP(C49,[3]SkillConfig!$F:$G,2,FALSE)","v":"对敌人照成{0}伤害，使敌人五行混乱。敌人的功法每次使用功法都将使用最低灵根属性作为伤害计算，持续{1}秒"},"icon_s3101",11,{"$f":"CONCATENATE(VLOOKUP(G49,ID分段!A:B,2,FALSE),\"-\",VLOOKUP(G49,ID分段!A:C,3,FALSE))","v":"法宝-本体"},4,0,0,"8;10",0,1,0,null,null,0,0,0,0,4,{"$f":"_xlfn.TEXTJOIN(\";\",1,AA49:AE49)","v":"11001;10001;10"},null,null,null,11001,10001,{"$f":"CHOOSE(I49-2,[4]抽卡!$Q$2,[4]抽卡!$Q$3,[4]抽卡!$Q$4)","v":10},null,null,null,8,10,null,{"$f":"IF(AG49=\"\",\"\",VLOOKUP(AG49,[1]SkiptoConfig!$A:$H,8,FALSE))","v":"主线剧情"},{"$f":"IF(AH49=\"\",\"\",VLOOKUP(AH49,[1]SkiptoConfig!$A:$H,8,FALSE))","v":"探宝"},{"$f":"IF(AI49=\"\",\"\",VLOOKUP(AI49,[1]SkiptoConfig!$A:$H,8,FALSE))","v":""}]
[10002,285,"噬空齿刃",293,{"$f":"VLOOKUP(C50,[3]SkillConfig!$F:$G,2,FALSE)","v":"无视敌人灵根，对敌人造成{0}%伤害，同时让五行伤势+1"},"icon_s3102",11,{"$f":"CONCATENATE(VLOOKUP(G50,ID分段!A:B,2,FALSE),\"-\",VLOOKUP(G50,ID分段!A:C,3,FALSE))","v":"法宝-本体"},5,0,0,"8;10",0,1,0,null,null,0,0,0,0,4,{"$f":"_xlfn.TEXTJOIN(\";\",1,AA50:AE50)","v":"11002;10002;30"},null,null,null,11002,10002,{"$f":"CHOOSE(I50-2,[4]抽卡!$Q$2,[4]抽卡!$Q$3,[4]抽卡!$Q$4)","v":30},null,null,null,8,10,null,{"$f":"IF(AG50=\"\",\"\",VLOOKUP(AG50,[1]SkiptoConfig!$A:$H,8,FALSE))","v":"主线剧情"},{"$f":"IF(AH50=\"\",\"\",VLOOKUP(AH50,[1]SkiptoConfig!$A:$H,8,FALSE))","v":"探宝"},{"$f":"IF(AI50=\"\",\"\",VLOOKUP(AI50,[1]SkiptoConfig!$A:$H,8,FALSE))","v":""}]
[10003,286,"翡翠葫芦",294,{"$f":"VLOOKUP(C51,[3]SkillConfig!$F:$G,2,FALSE)","v":"战场区域形成一个域。敌人的功法弹道进入域后将降低敌人{0}%的功法弹道速度，持续{1}秒"},"icon_s3201",11,{"$f":"CONCATENATE(VLOOKUP(G51,ID分段!A:B,2,FALSE),\"-\",VLOOKUP(G51,ID分段!A:C,3,FALSE))","v":"法宝-本体"},4,0,0,"8;10",0,1,0,null,null,0,0,0,0,4,"11003;10003;10",null,null,null,11003,10003,{"$f":"CHOOSE(I51-2,[4]抽卡!$Q$2,[4]抽卡!$Q$3,[4]抽卡!$Q$4)","v":10},null,null,null,8,10,null,{"$f":"IF(AG51=\"\",\"\",VLOOKUP(AG51,[1]SkiptoConfig!$A:$H,8,FALSE))","v":"主线剧情"},{"$f":"IF(AH51=\"\",\"\",VLOOKUP(AH51,[1]SkiptoConfig!$A:$H,8,FALSE))","v":"探宝"},{"$f":"IF(AI51=\"\",\"\",VLOOKUP(AI51,[1]SkiptoConfig!$A:$H,8,FALSE))","v":""}]
[10004,287,"混沌珠",295,{"$f":"VLOOKUP(C52,[3]SkillConfig!$F:$G,2,FALSE)","v":"用后{2}秒内大幅提升所有灵根{0}%，一场战斗可使用{1}次"},"icon_s3202",11,{"$f":"CONCATENATE(VLOOKUP(G52,ID分段!A:B,2,FALSE),\"-\",VLOOKUP(G52,ID分段!A:C,3,FALSE))","v":"法宝-本体"},5,0,0,"8;10",0,1,0,null,null,0,0,0,0,4,"11004;10004;30",null,null,null,11004,10004,{"$f":"CHOOSE(I52-2,[4]抽卡!$Q$2,[4]抽卡!$Q$3,[4]抽卡!$Q$4)","v":30},null,null,null,8,10,null,{"$f":"IF(AG52=\"\",\"\",VLOOKUP(AG52,[1]SkiptoConfig!$A:$H,8,FALSE))","v":"主线剧情"},{"$f":"IF(AH52=\"\",\"\",VLOOKUP(AH52,[1]SkiptoConfig!$A:$H,8,FALSE))","v":"探宝"},{"$f":"IF(AI52=\"\",\"\",VLOOKUP(AI52,[1]SkiptoConfig!$A:$H,8,FALSE))","v":""}]
[10005,288,"绝脉瓶",296,{"$f":"VLOOKUP(C53,[3]SkillConfig!$F:$G,2,FALSE)","v":"对敌人照成{0}%水系伤害，封锁敌人筋脉随机{1}个格子流动{2}秒"},"icon_s3203",11,{"$f":"CONCATENATE(VLOOKUP(G53,ID分段!A:B,2,FALSE),\"-\",VLOOKUP(G53,ID分段!A:C,3,FALSE))","v":"法宝-本体"},5,0,0,"8;10",0,1,0,null,null,0,0,0,0,4,"11005;10005;30",null,null,null,11005,10005,{"$f":"CHOOSE(I53-2,[4]抽卡!$Q$2,[4]抽卡!$Q$3,[4]抽卡!$Q$4)","v":30},null,null,null,8,10,null,{"$f":"IF(AG53=\"\",\"\",VLOOKUP(AG53,[1]SkiptoConfig!$A:$H,8,FALSE))","v":"主线剧情"},{"$f":"IF(AH53=\"\",\"\",VLOOKUP(AH53,[1]SkiptoConfig!$A:$H,8,FALSE))","v":"探宝"},{"$f":"IF(AI53=\"\",\"\",VLOOKUP(AI53,[1]SkiptoConfig!$A:$H,8,FALSE))","v":""}]
[10006,289,"九幽镇魂瓶",297,{"$f":"VLOOKUP(C54,[3]SkillConfig!$F:$G,2,FALSE)","v":"对敌人造成{2}%伤害，并随机封锁敌人{0}个法宝，让其{1}秒内不能使用"},"icon_s3301",11,{"$f":"CONCATENATE(VLOOKUP(G54,ID分段!A:B,2,FALSE),\"-\",VLOOKUP(G54,ID分段!A:C,3,FALSE))","v":"法宝-本体"},4,0,0,"8;10",0,1,0,null,null,0,0,0,0,4,"11006;10006;10",null,null,null,11006,10006,{"$f":"CHOOSE(I54-2,[4]抽卡!$Q$2,[4]抽卡!$Q$3,[4]抽卡!$Q$4)","v":10},null,null,null,8,10,null,{"$f":"IF(AG54=\"\",\"\",VLOOKUP(AG54,[1]SkiptoConfig!$A:$H,8,FALSE))","v":"主线剧情"},{"$f":"IF(AH54=\"\",\"\",VLOOKUP(AH54,[1]SkiptoConfig!$A:$H,8,FALSE))","v":"探宝"},{"$f":"IF(AI54=\"\",\"\",VLOOKUP(AI54,[1]SkiptoConfig!$A:$H,8,FALSE))","v":""}]
[10007,290,"玉莲守心灯",298,{"$f":"VLOOKUP(C55,[3]SkillConfig!$F:$G,2,FALSE)","v":"一盏明灯围绕玩家，{0}秒内抵消所有负面效果，每{1}秒触发1次。"},"icon_s3302",11,{"$f":"CONCATENATE(VLOOKUP(G55,ID分段!A:B,2,FALSE),\"-\",VLOOKUP(G55,ID分段!A:C,3,FALSE))","v":"法宝-本体"},5,0,0,"8;10",0,1,0,null,null,0,0,0,0,4,"11007;10007;30",null,null,null,11007,10007,{"$f":"CHOOSE(I55-2,[4]抽卡!$Q$2,[4]抽卡!$Q$3,[4]抽卡!$Q$4)","v":30},null,null,null,8,10,null,{"$f":"IF(AG55=\"\",\"\",VLOOKUP(AG55,[1]SkiptoConfig!$A:$H,8,FALSE))","v":"主线剧情"},{"$f":"IF(AH55=\"\",\"\",VLOOKUP(AH55,[1]SkiptoConfig!$A:$H,8,FALSE))","v":"探宝"},{"$f":"IF(AI55=\"\",\"\",VLOOKUP(AI55,[1]SkiptoConfig!$A:$H,8,FALSE))","v":""}]
[10008,291,"融灵塔",299,{"$f":"VLOOKUP(C56,[3]SkillConfig!$F:$G,2,FALSE)","v":"宝塔在英雄的头顶前往位置旋转，形成一个扇形区域，敌人的功法如果进入这个扇形区域有{0}%概率被法宝吸收，持续{1}秒"},"icon_s3401",11,{"$f":"CONCATENATE(VLOOKUP(G56,ID分段!A:B,2,FALSE),\"-\",VLOOKUP(G56,ID分段!A:C,3,FALSE))","v":"法宝-本体"},4,0,0,"8;10",0,1,0,null,null,0,0,0,0,4,"11008;10008;10",null,null,null,11008,10008,{"$f":"CHOOSE(I56-2,[4]抽卡!$Q$2,[4]抽卡!$Q$3,[4]抽卡!$Q$4)","v":10},null,null,null,8,10,null,{"$f":"IF(AG56=\"\",\"\",VLOOKUP(AG56,[1]SkiptoConfig!$A:$H,8,FALSE))","v":"主线剧情"},{"$f":"IF(AH56=\"\",\"\",VLOOKUP(AH56,[1]SkiptoConfig!$A:$H,8,FALSE))","v":"探宝"},{"$f":"IF(AI56=\"\",\"\",VLOOKUP(AI56,[1]SkiptoConfig!$A:$H,8,FALSE))","v":""}]
[10009,1402,"禁元珠",1405,{"$f":"VLOOKUP(C57,[3]SkillConfig!$F:$G,2,FALSE)","v":"打断对手当前正在生效中的法宝"},"icon_s3402",11,{"$f":"CONCATENATE(VLOOKUP(G57,ID分段!A:B,2,FALSE),\"-\",VLOOKUP(G57,ID分段!A:C,3,FALSE))","v":"法宝-本体"},5,0,0,"8;10",0,1,0,null,null,0,0,0,0,4,{"$f":"_xlfn.TEXTJOIN(\";\",1,AA57:AE57)","v":"11009;10009;30"},null,null,null,11009,10009,{"$f":"CHOOSE(I57-2,[4]抽卡!$Q$2,[4]抽卡!$Q$3,[4]抽卡!$Q$4)","v":30},null,null,null,8,10,null,{"$f":"IF(AG57=\"\",\"\",VLOOKUP(AG57,[1]SkiptoConfig!$A:$H,8,FALSE))","v":"主线剧情"},{"$f":"IF(AH57=\"\",\"\",VLOOKUP(AH57,[1]SkiptoConfig!$A:$H,8,FALSE))","v":"探宝"},{"$f":"IF(AI57=\"\",\"\",VLOOKUP(AI57,[1]SkiptoConfig!$A:$H,8,FALSE))","v":""}]
[10010,1403,"玄龟盾",1406,{"$f":"VLOOKUP(C58,[3]SkillConfig!$F:$G,2,FALSE)","v":"前方形成土系防御盾，抵挡相当于自身生命上限{0}%的伤害，持续{1}秒"},"icon_s3501",11,{"$f":"CONCATENATE(VLOOKUP(G58,ID分段!A:B,2,FALSE),\"-\",VLOOKUP(G58,ID分段!A:C,3,FALSE))","v":"法宝-本体"},4,0,0,"8;10",0,1,0,null,null,0,0,0,0,4,"11010;10010;10",null,null,null,11010,10010,{"$f":"CHOOSE(I58-2,[4]抽卡!$Q$2,[4]抽卡!$Q$3,[4]抽卡!$Q$4)","v":10},null,null,null,8,10,null,{"$f":"IF(AG58=\"\",\"\",VLOOKUP(AG58,[1]SkiptoConfig!$A:$H,8,FALSE))","v":"主线剧情"},{"$f":"IF(AH58=\"\",\"\",VLOOKUP(AH58,[1]SkiptoConfig!$A:$H,8,FALSE))","v":"探宝"},{"$f":"IF(AI58=\"\",\"\",VLOOKUP(AI58,[1]SkiptoConfig!$A:$H,8,FALSE))","v":""}]
[10011,1404,"天殇血刃剑",1407,{"$f":"VLOOKUP(C59,[3]SkillConfig!$F:$G,2,FALSE)","v":"对敌人照成土属性伤害，并封锁敌人土系经络6秒"},"icon_s3502",11,{"$f":"CONCATENATE(VLOOKUP(G59,ID分段!A:B,2,FALSE),\"-\",VLOOKUP(G59,ID分段!A:C,3,FALSE))","v":"法宝-本体"},5,0,0,"8;10",0,1,0,null,null,0,0,0,0,4,{"$f":"_xlfn.TEXTJOIN(\";\",1,AA59:AE59)","v":"11011;10011;30"},null,null,null,11011,10011,{"$f":"CHOOSE(I59-2,[4]抽卡!$Q$2,[4]抽卡!$Q$3,[4]抽卡!$Q$4)","v":30},null,null,null,8,10,null,{"$f":"IF(AG59=\"\",\"\",VLOOKUP(AG59,[1]SkiptoConfig!$A:$H,8,FALSE))","v":"主线剧情"},{"$f":"IF(AH59=\"\",\"\",VLOOKUP(AH59,[1]SkiptoConfig!$A:$H,8,FALSE))","v":"探宝"},{"$f":"IF(AI59=\"\",\"\",VLOOKUP(AI59,[1]SkiptoConfig!$A:$H,8,FALSE))","v":""}]
[{"$nulls":11},"",{"$nulls":23},{"$f":"IF(AG60=\"\",\"\",VLOOKUP(AG60,[1]SkiptoConfig!$A:$H,8,FALSE))","v":""},{"$f":"IF(AH60=\"\",\"\",VLOOKUP(AH60,[1]SkiptoConfig!$A:$H,8,FALSE))","v":""},{"$f":"IF(AI60=\"\",\"\",VLOOKUP(AI60,[1]SkiptoConfig!$A:$H,8,FALSE))","v":""}]
[11001,300,"神龙鼎碎片",308,{"$f":"CONCATENATE(\"用于法宝\",C49,\"的升星。\")","v":"用于法宝神龙鼎的升星。"},"icon_s3101",12,{"$f":"CONCATENATE(VLOOKUP(G61,ID分段!A:B,2,FALSE),\"-\",VLOOKUP(G61,ID分段!A:C,3,FALSE))","v":"法宝-碎片"},3,0,0,"10",0,1,0,null,null,0,0,0,0,12,{"$f":"_xlfn.TEXTJOIN(\";\",1,AA61:AE61)","v":"11001"},null,null,null,11001,{"$nulls":5},10,null,null,{"$f":"IF(AG61=\"\",\"\",VLOOKUP(AG61,[1]SkiptoConfig!$A:$H,8,FALSE))","v":"探宝"},{"$f":"IF(AH61=\"\",\"\",VLOOKUP(AH61,[1]SkiptoConfig!$A:$H,8,FALSE))","v":""},{"$f":"IF(AI61=\"\",\"\",VLOOKUP(AI61,[1]SkiptoConfig!$A:$H,8,FALSE))","v":""}]
[11002,301,"噬空齿刃碎片",309,{"$f":"CONCATENATE(\"用于法宝\",C50,\"的升星。\")","v":"用于法宝噬空齿刃的升星。"},"icon_s3102",12,{"$f":"CONCATENATE(VLOOKUP(G62,ID分段!A:B,2,FALSE),\"-\",VLOOKUP(G62,ID分段!A:C,3,FALSE))","v":"法宝-碎片"},4,0,0,"10",0,1,0,null,null,0,0,0,0,12,{"$f":"_xlfn.TEXTJOIN(\";\",1,AA62:AE62)","v":"11002"},null,null,null,11002,{"$nulls":5},10,null,null,{"$f":"IF(AG62=\"\",\"\",VLOOKUP(AG62,[1]SkiptoConfig!$A:$H,8,FALSE))","v":"探宝"},{"$f":"IF(AH62=\"\",\"\",VLOOKUP(AH62,[1]SkiptoConfig!$A:$H,8,FALSE))","v":""},{"$f":"IF(AI62=\"\",\"\",VLOOKUP(AI62,[1]SkiptoConfig!$A:$H,8,FALSE))","v":""}]
[11003,302,"翡翠葫芦碎片",310,"用于法宝翡翠葫芦的升星。","icon_s3201",12,{"$f":"CONCATENATE(VLOOKUP(G63,ID分段!A:B,2,FALSE),\"-\",VLOOKUP(G63,ID分段!A:C,3,FALSE))","v":"法宝-碎片"},3,0,0,"10",0,1,0,null,null,0,0,0,0,12,"11003",null,null,null,11003,{"$nulls":5},10,null,null,{"$f":"IF(AG63=\"\",\"\",VLOOKUP(AG63,[1]SkiptoConfig!$A:$H,8,FALSE))","v":"探宝"},{"$f":"IF(AH63=\"\",\"\",VLOOKUP(AH63,[1]SkiptoConfig!$A:$H,8,FALSE))","v":""},{"$f":"IF(AI63=\"\",\"\",VLOOKUP(AI63,[1]SkiptoConfig!$A:$H,8,FALSE))","v":""}]
[11004,303,"混沌珠碎片",311,"用于法宝混沌珠的升星。","icon_s3202",12,{"$f":"CONCATENATE(VLOOKUP(G64,ID分段!A:B,2,FALSE),\"-\",VLOOKUP(G64,ID分段!A:C,3,FALSE))","v":"法宝-碎片"},4,0,0,"10",0,1,0,null,null,0,0,0,0,12,"11004",null,null,null,11004,{"$nulls":5},10,null,null,{"$f":"IF(AG64=\"\",\"\",VLOOKUP(AG64,[1]SkiptoConfig!$A:$H,8,FALSE))","v":"探宝"},{"$f":"IF(AH64=\"\",\"\",VLOOKUP(AH64,[1]SkiptoConfig!$A:$H,8,FALSE))","v":""},{"$f":"IF(AI64=\"\",\"\",VLOOKUP(AI64,[1]SkiptoConfig!$A:$H,8,FALSE))","v":""}]
[11005,304,"绝脉瓶碎片",312,"用于法宝绝脉瓶的升星。","icon_s3203",12,{"$f":"CONCATENATE(VLOOKUP(G65,ID分段!A:B,2,FALSE),\"-\",VLOOKUP(G65,ID分段!A:C,3,FALSE))","v":"法宝-碎片"},5,0,0,"10",0,1,0,null,null,0,0,0,0,12,"11005",null,null,null,11005,{"$nulls":5},10,null,null,{"$f":"IF(AG65=\"\",\"\",VLOOKUP(AG65,[1]SkiptoConfig!$A:$H,8,FALSE))","v":"探宝"},{"$f":"IF(AH65=\"\",\"\",VLOOKUP(AH65,[1]SkiptoConfig!$A:$H,8,FALSE))","v":""},{"$f":"IF(AI65=\"\",\"\",VLOOKUP(AI65,[1]SkiptoConfig!$A:$H,8,FALSE))","v":""}]
[11006,305,"九幽镇魂瓶碎片",313,"用于法宝九幽镇魂瓶的升星。","icon_s3301",12,{"$f":"CONCATENATE(VLOOKUP(G66,ID分段!A:B,2,FALSE),\"-\",VLOOKUP(G66,ID分段!A:C,3,FALSE))","v":"法宝-碎片"},3,0,0,"10",0,1,0,null,null,0,0,0,0,12,"11006",null,null,null,11006,{"$nulls":5},10,null,null,{"$f":"IF(AG66=\"\",\"\",VLOOKUP(AG66,[1]SkiptoConfig!$A:$H,8,FALSE))","v":"探宝"},{"$f":"IF(AH66=\"\",\"\",VLOOKUP(AH66,[1]SkiptoConfig!$A:$H,8,FALSE))","v":""},{"$f":"IF(AI66=\"\",\"\",VLOOKUP(AI66,[1]SkiptoConfig!$A:$H,8,FALSE))","v":""}]
[11007,306,"玉莲守心灯碎片",314,"用于法宝玉莲守心灯的升星。","icon_s3302",12,{"$f":"CONCATENATE(VLOOKUP(G67,ID分段!A:B,2,FALSE),\"-\",VLOOKUP(G67,ID分段!A:C,3,FALSE))","v":"法宝-碎片"},4,0,0,"10",0,1,0,null,null,0,0,0,0,12,"11007",null,null,null,11007,{"$nulls":5},10,null,null,{"$f":"IF(AG67=\"\",\"\",VLOOKUP(AG67,[1]SkiptoConfig!$A:$H,8,FALSE))","v":"探宝"},{"$f":"IF(AH67=\"\",\"\",VLOOKUP(AH67,[1]SkiptoConfig!$A:$H,8,FALSE))","v":""},{"$f":"IF(AI67=\"\",\"\",VLOOKUP(AI67,[1]SkiptoConfig!$A:$H,8,FALSE))","v":""}]
[11008,307,"融灵塔碎片",315,"用于法宝融灵塔的升星。","icon_s3401",12,{"$f":"CONCATENATE(VLOOKUP(G68,ID分段!A:B,2,FALSE),\"-\",VLOOKUP(G68,ID分段!A:C,3,FALSE))","v":"法宝-碎片"},3,0,0,"10",0,1,0,null,null,0,0,0,0,12,"11008",null,null,null,11008,{"$nulls":5},10,null,null,{"$f":"IF(AG68=\"\",\"\",VLOOKUP(AG68,[1]SkiptoConfig!$A:$H,8,FALSE))","v":"探宝"},{"$f":"IF(AH68=\"\",\"\",VLOOKUP(AH68,[1]SkiptoConfig!$A:$H,8,FALSE))","v":""},{"$f":"IF(AI68=\"\",\"\",VLOOKUP(AI68,[1]SkiptoConfig!$A:$H,8,FALSE))","v":""}]
[11009,1408,"禁元珠碎片",1411,"用于法宝禁元珠的升星。","icon_s3402",12,{"$f":"CONCATENATE(VLOOKUP(G69,ID分段!A:B,2,FALSE),\"-\",VLOOKUP(G69,ID分段!A:C,3,FALSE))","v":"法宝-碎片"},4,0,0,"10",0,1,0,null,null,0,0,0,0,12,"11009",null,null,null,11009,{"$nulls":5},10,null,null,{"$f":"IF(AG69=\"\",\"\",VLOOKUP(AG69,[1]SkiptoConfig!$A:$H,8,FALSE))","v":"探宝"},{"$f":"IF(AH69=\"\",\"\",VLOOKUP(AH69,[1]SkiptoConfig!$A:$H,8,FALSE))","v":""},{"$f":"IF(AI69=\"\",\"\",VLOOKUP(AI69,[1]SkiptoConfig!$A:$H,8,FALSE))","v":""}]
[11010,1409,"玄龟盾碎片",1412,"用于法宝玄龟盾的升星。","icon_s3501",12,{"$f":"CONCATENATE(VLOOKUP(G70,ID分段!A:B,2,FALSE),\"-\",VLOOKUP(G70,ID分段!A:C,3,FALSE))","v":"法宝-碎片"},3,0,0,{"$f":"_xlfn.TEXTJOIN(\";\",1,AG70:AI70)","v":"10"},0,1,0,null,null,0,0,0,0,12,"11010",null,null,null,11010,{"$nulls":5},10,null,null,{"$f":"IF(AG70=\"\",\"\",VLOOKUP(AG70,[1]SkiptoConfig!$A:$H,8,FALSE))","v":"探宝"},{"$f":"IF(AH70=\"\",\"\",VLOOKUP(AH70,[1]SkiptoConfig!$A:$H,8,FALSE))","v":""},{"$f":"IF(AI70=\"\",\"\",VLOOKUP(AI70,[1]SkiptoConfig!$A:$H,8,FALSE))","v":""}]
[11011,1410,"天殇血刃剑碎片",1413,"用于法宝天殇血刃剑的升星。","icon_s3502",12,{"$f":"CONCATENATE(VLOOKUP(G71,ID分段!A:B,2,FALSE),\"-\",VLOOKUP(G71,ID分段!A:C,3,FALSE))","v":"法宝-碎片"},4,0,0,"10",0,1,0,null,null,0,0,0,0,12,"11011",null,null,null,11011,{"$nulls":5},10,null,null,{"$f":"IF(AG71=\"\",\"\",VLOOKUP(AG71,[1]SkiptoConfig!$A:$H,8,FALSE))","v":"探宝"},{"$f":"IF(AH71=\"\",\"\",VLOOKUP(AH71,[1]SkiptoConfig!$A:$H,8,FALSE))","v":""},{"$f":"IF(AI71=\"\",\"\",VLOOKUP(AI71,[1]SkiptoConfig!$A:$H,8,FALSE))","v":""}]
[{"$nulls":11},"",{"$nulls":23},{"$f":"IF(AG72=\"\",\"\",VLOOKUP(AG72,[1]SkiptoConfig!$A:$H,8,FALSE))","v":""},{"$f":"IF(AH72=\"\",\"\",VLOOKUP(AH72,[1]SkiptoConfig!$A:$H,8,FALSE))","v":""},{"$f":"IF(AI72=\"\",\"\",VLOOKUP(AI72,[1]SkiptoConfig!$A:$H,8,FALSE))","v":""}]
[12001,1414,"太虚幻剑经",1500,{"$f":"VLOOKUP(C73,[3]SkillConfig!$F:$G,2,FALSE)","v":"身体周围幻化出{0}柄细剑，每柄细剑对敌人造成{1}%伤害，并有{2}几率对敌人造成1层流血。"},{"$f":"IFERROR(VLOOKUP(AB73*10,[3]SkillConfig!$A:$I,9,FALSE),\"\")","v":"icon_s1101"},13,{"$f":"CONCATENATE(VLOOKUP(G73,ID分段!A:B,2,FALSE),\"-\",VLOOKUP(G73,ID分段!A:C,3,FALSE))","v":"功法-本体"},5,0,0,"10",0,1,0,null,null,0,0,0,0,3,{"$f":"_xlfn.TEXTJOIN(\";\",1,AA73:AE73)","v":"13001;1101;30"},null,null,null,13001,1101,{"$f":"CHOOSE(I73-2,[4]抽卡!$Q$2,[4]抽卡!$Q$3,[4]抽卡!$Q$4)","v":30},null,null,null,10,null,null,{"$f":"IF(AG73=\"\",\"\",VLOOKUP(AG73,[1]SkiptoConfig!$A:$H,8,FALSE))","v":"探宝"},{"$f":"IF(AH73=\"\",\"\",VLOOKUP(AH73,[1]SkiptoConfig!$A:$H,8,FALSE))","v":""},{"$f":"IF(AI73=\"\",\"\",VLOOKUP(AI73,[1]SkiptoConfig!$A:$H,8,FALSE))","v":""}]
[12002,1415,"天罡剑气诀",1501,{"$f":"VLOOKUP(C74,[3]SkillConfig!$F:$G,2,FALSE)","v":"吸收自身灵气凝聚{0}柄大剑，大剑旋转快速穿透敌人对敌人照成{1}%伤害"},{"$f":"IFERROR(VLOOKUP(AB74*10,[3]SkillConfig!$A:$I,9,FALSE),\"\")","v":"icon_s1102"},13,{"$f":"CONCATENATE(VLOOKUP(G74,ID分段!A:B,2,FALSE),\"-\",VLOOKUP(G74,ID分段!A:C,3,FALSE))","v":"功法-本体"},5,0,0,"10",0,1,0,null,null,0,0,0,0,3,{"$f":"_xlfn.TEXTJOIN(\";\",1,AA74:AE74)","v":"13002;1102;30"},null,null,null,13002,1102,{"$f":"CHOOSE(I74-2,[4]抽卡!$Q$2,[4]抽卡!$Q$3,[4]抽卡!$Q$4)","v":30},null,null,null,10,null,null,{"$f":"IF(AG74=\"\",\"\",VLOOKUP(AG74,[1]SkiptoConfig!$A:$H,8,FALSE))","v":"探宝"},{"$f":"IF(AH74=\"\",\"\",VLOOKUP(AH74,[1]SkiptoConfig!$A:$H,8,FALSE))","v":""},{"$f":"IF(AI74=\"\",\"\",VLOOKUP(AI74,[1]SkiptoConfig!$A:$H,8,FALSE))","v":""}]
[12003,1416,"血刃金煌功",1502,{"$f":"VLOOKUP(C75,[3]SkillConfig!$F:$G,2,FALSE)","v":"向前方挥动{0}次，每次挥动形成一道血刃刀气，对敌人{1}造成伤害，并有{2}%概率对敌人造成流血。"},{"$f":"IFERROR(VLOOKUP(AB75*10,[3]SkillConfig!$A:$I,9,FALSE),\"\")","v":"icon_s1103"},13,{"$f":"CONCATENATE(VLOOKUP(G75,ID分段!A:B,2,FALSE),\"-\",VLOOKUP(G75,ID分段!A:C,3,FALSE))","v":"功法-本体"},5,0,0,"10",0,1,0,null,null,0,0,0,0,3,"13003;1103;30",null,null,null,13003,1103,{"$f":"CHOOSE(I75-2,[4]抽卡!$Q$2,[4]抽卡!$Q$3,[4]抽卡!$Q$4)","v":30},null,null,null,10,null,null,{"$f":"IF(AG75=\"\",\"\",VLOOKUP(AG75,[1]SkiptoConfig!$A:$H,8,FALSE))","v":"探宝"},{"$f":"IF(AH75=\"\",\"\",VLOOKUP(AH75,[1]SkiptoConfig!$A:$H,8,FALSE))","v":""},{"$f":"IF(AI75=\"\",\"\",VLOOKUP(AI75,[1]SkiptoConfig!$A:$H,8,FALSE))","v":""}]
[12004,1417,"飞刃",1503,{"$f":"VLOOKUP(C76,[3]SkillConfig!$F:$G,2,FALSE)","v":"发射{0}枚飞刀，对敌人造成{1}%伤害。"},{"$f":"IFERROR(VLOOKUP(AB76*10,[3]SkillConfig!$A:$I,9,FALSE),\"\")","v":"icon_s1104"},13,{"$f":"CONCATENATE(VLOOKUP(G76,ID分段!A:B,2,FALSE),\"-\",VLOOKUP(G76,ID分段!A:C,3,FALSE))","v":"功法-本体"},4,0,0,"10;8",0,1,0,null,null,0,0,0,0,3,"13004;1104;10",null,null,null,13004,1104,{"$f":"CHOOSE(I76-2,[4]抽卡!$Q$2,[4]抽卡!$Q$3,[4]抽卡!$Q$4)","v":10},null,null,null,10,8,null,{"$f":"IF(AG76=\"\",\"\",VLOOKUP(AG76,[1]SkiptoConfig!$A:$H,8,FALSE))","v":"探宝"},{"$f":"IF(AH76=\"\",\"\",VLOOKUP(AH76,[1]SkiptoConfig!$A:$H,8,FALSE))","v":"主线剧情"},{"$f":"IF(AI76=\"\",\"\",VLOOKUP(AI76,[1]SkiptoConfig!$A:$H,8,FALSE))","v":""}]
[12005,1418,"金针",1504,{"$f":"VLOOKUP(C77,[3]SkillConfig!$F:$G,2,FALSE)","v":"手中快速发射{0}%枚金针，对敌人造成{1}%伤害，并有{2}%概率施加1层流血。"},{"$f":"IFERROR(VLOOKUP(AB77*10,[3]SkillConfig!$A:$I,9,FALSE),\"\")","v":"icon_s1105"},13,{"$f":"CONCATENATE(VLOOKUP(G77,ID分段!A:B,2,FALSE),\"-\",VLOOKUP(G77,ID分段!A:C,3,FALSE))","v":"功法-本体"},3,0,0,"10;8",0,1,0,null,null,0,0,0,0,3,"13005;1105;3",null,null,null,13005,1105,{"$f":"CHOOSE(I77-2,[4]抽卡!$Q$2,[4]抽卡!$Q$3,[4]抽卡!$Q$4)","v":3},null,null,null,10,8,null,{"$f":"IF(AG77=\"\",\"\",VLOOKUP(AG77,[1]SkiptoConfig!$A:$H,8,FALSE))","v":"探宝"},{"$f":"IF(AH77=\"\",\"\",VLOOKUP(AH77,[1]SkiptoConfig!$A:$H,8,FALSE))","v":"主线剧情"},{"$f":"IF(AI77=\"\",\"\",VLOOKUP(AI77,[1]SkiptoConfig!$A:$H,8,FALSE))","v":""}]
[12006,1419,"碧落幽冥劲",1505,{"$f":"VLOOKUP(C78,[3]SkillConfig!$F:$G,2,FALSE)","v":"发出{0}道寒气冰锥，对敌人照成{1}%伤害，每到冰锥有{2}%概率对敌人施加1层寒气"},{"$f":"IFERROR(VLOOKUP(AB78*10,[3]SkillConfig!$A:$I,9,FALSE),\"\")","v":"icon_s1201"},13,{"$f":"CONCATENATE(VLOOKUP(G78,ID分段!A:B,2,FALSE),\"-\",VLOOKUP(G78,ID分段!A:C,3,FALSE))","v":"功法-本体"},5,0,0,"10",0,1,0,null,null,0,0,0,0,3,"13006;1201;30",null,null,null,13006,1201,{"$f":"CHOOSE(I78-2,[4]抽卡!$Q$2,[4]抽卡!$Q$3,[4]抽卡!$Q$4)","v":30},null,null,null,10,null,null,{"$f":"IF(AG78=\"\",\"\",VLOOKUP(AG78,[1]SkiptoConfig!$A:$H,8,FALSE))","v":"探宝"},{"$f":"IF(AH78=\"\",\"\",VLOOKUP(AH78,[1]SkiptoConfig!$A:$H,8,FALSE))","v":""},{"$f":"IF(AI78=\"\",\"\",VLOOKUP(AI78,[1]SkiptoConfig!$A:$H,8,FALSE))","v":""}]
[12007,1420,"雾隐千流法",1506,{"$f":"VLOOKUP(C79,[3]SkillConfig!$F:$G,2,FALSE)","v":"身体散发出一团迷雾。从迷雾中飞出{0}个冰球，每个冰球对敌人照成{1}%伤害，并有{2}%概率施加1层寒气"},{"$f":"IFERROR(VLOOKUP(AB79*10,[3]SkillConfig!$A:$I,9,FALSE),\"\")","v":"icon_s1202"},13,{"$f":"CONCATENATE(VLOOKUP(G79,ID分段!A:B,2,FALSE),\"-\",VLOOKUP(G79,ID分段!A:C,3,FALSE))","v":"功法-本体"},5,0,0,"10",0,1,0,null,null,0,0,0,0,3,"13007;1202;30",null,null,null,13007,1202,{"$f":"CHOOSE(I79-2,[4]抽卡!$Q$2,[4]抽卡!$Q$3,[4]抽卡!$Q$4)","v":30},null,null,null,10,null,null,{"$f":"IF(AG79=\"\",\"\",VLOOKUP(AG79,[1]SkiptoConfig!$A:$H,8,FALSE))","v":"探宝"},{"$f":"IF(AH79=\"\",\"\",VLOOKUP(AH79,[1]SkiptoConfig!$A:$H,8,FALSE))","v":""},{"$f":"IF(AI79=\"\",\"\",VLOOKUP(AI79,[1]SkiptoConfig!$A:$H,8,FALSE))","v":""}]
[12008,1421,"功法-水3",1507,{"$f":"VLOOKUP(C80,[3]SkillConfig!$F:$G,2,FALSE)","v":{"$error":"#N/A"}},{"$f":"IFERROR(VLOOKUP(AB80*10,[3]SkillConfig!$A:$I,9,FALSE),\"\")","v":""},13,{"$f":"CONCATENATE(VLOOKUP(G80,ID分段!A:B,2,FALSE),\"-\",VLOOKUP(G80,ID分段!A:C,3,FALSE))","v":"功法-本体"},5,0,0,"10",0,1,0,null,null,0,0,0,0,3,"13008;1203;30",null,null,null,13008,1203,{"$f":"CHOOSE(I80-2,[4]抽卡!$Q$2,[4]抽卡!$Q$3,[4]抽卡!$Q$4)","v":30},null,null,null,10,null,null,{"$f":"IF(AG80=\"\",\"\",VLOOKUP(AG80,[1]SkiptoConfig!$A:$H,8,FALSE))","v":"探宝"},{"$f":"IF(AH80=\"\",\"\",VLOOKUP(AH80,[1]SkiptoConfig!$A:$H,8,FALSE))","v":""},{"$f":"IF(AI80=\"\",\"\",VLOOKUP(AI80,[1]SkiptoConfig!$A:$H,8,FALSE))","v":""}]
[12009,1422,"水球",1508,{"$f":"VLOOKUP(C81,[3]SkillConfig!$F:$G,2,FALSE)","v":"发射{0}枚水波，对敌人造成{1}%伤害。"},{"$f":"IFERROR(VLOOKUP(AB81*10,[3]SkillConfig!$A:$I,9,FALSE),\"\")","v":"icon_s1204"},13,{"$f":"CONCATENATE(VLOOKUP(G81,ID分段!A:B,2,FALSE),\"-\",VLOOKUP(G81,ID分段!A:C,3,FALSE))","v":"功法-本体"},4,0,0,"10;8",0,1,0,null,null,0,0,0,0,3,"13009;1204;10",null,null,null,13009,1204,{"$f":"CHOOSE(I81-2,[4]抽卡!$Q$2,[4]抽卡!$Q$3,[4]抽卡!$Q$4)","v":10},null,null,null,10,8,null,{"$f":"IF(AG81=\"\",\"\",VLOOKUP(AG81,[1]SkiptoConfig!$A:$H,8,FALSE))","v":"探宝"},{"$f":"IF(AH81=\"\",\"\",VLOOKUP(AH81,[1]SkiptoConfig!$A:$H,8,FALSE))","v":"主线剧情"},{"$f":"IF(AI81=\"\",\"\",VLOOKUP(AI81,[1]SkiptoConfig!$A:$H,8,FALSE))","v":""}]
[12010,1423,"冰刀",1509,{"$f":"VLOOKUP(C82,[3]SkillConfig!$F:$G,2,FALSE)","v":"发射{0}枚冰刀，对敌人造成{1}%伤害。"},{"$f":"IFERROR(VLOOKUP(AB82*10,[3]SkillConfig!$A:$I,9,FALSE),\"\")","v":"icon_s1205"},13,{"$f":"CONCATENATE(VLOOKUP(G82,ID分段!A:B,2,FALSE),\"-\",VLOOKUP(G82,ID分段!A:C,3,FALSE))","v":"功法-本体"},3,0,0,"10;8",0,1,0,null,null,0,0,0,0,3,"13010;1205;3",null,null,null,13010,1205,{"$f":"CHOOSE(I82-2,[4]抽卡!$Q$2,[4]抽卡!$Q$3,[4]抽卡!$Q$4)","v":3},null,null,null,10,8,null,{"$f":"IF(AG82=\"\",\"\",VLOOKUP(AG82,[1]SkiptoConfig!$A:$H,8,FALSE))","v":"探宝"},{"$f":"IF(AH82=\"\",\"\",VLOOKUP(AH82,[1]SkiptoConfig!$A:$H,8,FALSE))","v":"主线剧情"},{"$f":"IF(AI82=\"\",\"\",VLOOKUP(AI82,[1]SkiptoConfig!$A:$H,8,FALSE))","v":""}]
[12011,1424,"瘴影千丝术",1510,{"$f":"VLOOKUP(C83,[3]SkillConfig!$F:$G,2,FALSE)","v":"发出{0}条细细的毒针，每颗针对敌人照成{1}%金系伤害，每颗针有{2}%概率施加1层毒"},{"$f":"IFERROR(VLOOKUP(AB83*10,[3]SkillConfig!$A:$I,9,FALSE),\"\")","v":"icon_s1301"},13,{"$f":"CONCATENATE(VLOOKUP(G83,ID分段!A:B,2,FALSE),\"-\",VLOOKUP(G83,ID分段!A:C,3,FALSE))","v":"功法-本体"},5,0,0,"10",0,1,0,null,null,0,0,0,0,3,"13011;1301;30",null,null,null,13011,1301,{"$f":"CHOOSE(I83-2,[4]抽卡!$Q$2,[4]抽卡!$Q$3,[4]抽卡!$Q$4)","v":30},null,null,null,10,null,null,{"$f":"IF(AG83=\"\",\"\",VLOOKUP(AG83,[1]SkiptoConfig!$A:$H,8,FALSE))","v":"探宝"},{"$f":"IF(AH83=\"\",\"\",VLOOKUP(AH83,[1]SkiptoConfig!$A:$H,8,FALSE))","v":""},{"$f":"IF(AI83=\"\",\"\",VLOOKUP(AI83,[1]SkiptoConfig!$A:$H,8,FALSE))","v":""}]
[12012,1425,"蚀骨腐血掌",1511,{"$f":"VLOOKUP(C84,[3]SkillConfig!$F:$G,2,FALSE)","v":"快手释放{0}掌，对敌人造成{1}%伤害，并对敌人施加1层毒,每层毒额外提高{2}%伤害"},{"$f":"IFERROR(VLOOKUP(AB84*10,[3]SkillConfig!$A:$I,9,FALSE),\"\")","v":"icon_s1302"},13,{"$f":"CONCATENATE(VLOOKUP(G84,ID分段!A:B,2,FALSE),\"-\",VLOOKUP(G84,ID分段!A:C,3,FALSE))","v":"功法-本体"},5,0,0,"10",0,1,0,null,null,0,0,0,0,3,"13012;1302;30",null,null,null,13012,1302,{"$f":"CHOOSE(I84-2,[4]抽卡!$Q$2,[4]抽卡!$Q$3,[4]抽卡!$Q$4)","v":30},null,null,null,10,null,null,{"$f":"IF(AG84=\"\",\"\",VLOOKUP(AG84,[1]SkiptoConfig!$A:$H,8,FALSE))","v":"探宝"},{"$f":"IF(AH84=\"\",\"\",VLOOKUP(AH84,[1]SkiptoConfig!$A:$H,8,FALSE))","v":""},{"$f":"IF(AI84=\"\",\"\",VLOOKUP(AI84,[1]SkiptoConfig!$A:$H,8,FALSE))","v":""}]
[12013,1426,"功法-木3",1512,{"$f":"VLOOKUP(C85,[3]SkillConfig!$F:$G,2,FALSE)","v":{"$error":"#N/A"}},{"$f":"IFERROR(VLOOKUP(AB85*10,[3]SkillConfig!$A:$I,9,FALSE),\"\")","v":""},13,{"$f":"CONCATENATE(VLOOKUP(G85,ID分段!A:B,2,FALSE),\"-\",VLOOKUP(G85,ID分段!A:C,3,FALSE))","v":"功法-本体"},5,0,0,"10",0,1,0,null,null,0,0,0,0,3,{"$f":"_xlfn.TEXTJOIN(\";\",1,AA85:AE85)","v":"13013;1303;30"},null,null,null,13013,1303,{"$f":"CHOOSE(I85-2,[4]抽卡!$Q$2,[4]抽卡!$Q$3,[4]抽卡!$Q$4)","v":30},null,null,null,10,null,null,{"$f":"IF(AG85=\"\",\"\",VLOOKUP(AG85,[1]SkiptoConfig!$A:$H,8,FALSE))","v":"探宝"},{"$f":"IF(AH85=\"\",\"\",VLOOKUP(AH85,[1]SkiptoConfig!$A:$H,8,FALSE))","v":""},{"$f":"IF(AI85=\"\",\"\",VLOOKUP(AI85,[1]SkiptoConfig!$A:$H,8,FALSE))","v":""}]
[12014,1427,"竹刺",1513,{"$f":"VLOOKUP(C86,[3]SkillConfig!$F:$G,2,FALSE)","v":"发射{0}枚竹刺，对敌人造成{1}%伤害。"},{"$f":"IFERROR(VLOOKUP(AB86*10,[3]SkillConfig!$A:$I,9,FALSE),\"\")","v":"icon_s1304"},13,{"$f":"CONCATENATE(VLOOKUP(G86,ID分段!A:B,2,FALSE),\"-\",VLOOKUP(G86,ID分段!A:C,3,FALSE))","v":"功法-本体"},4,0,0,"10;8",0,1,0,null,null,0,0,0,0,3,"13014;1304;10",null,null,null,13014,1304,{"$f":"CHOOSE(I86-2,[4]抽卡!$Q$2,[4]抽卡!$Q$3,[4]抽卡!$Q$4)","v":10},null,null,null,10,8,null,{"$f":"IF(AG86=\"\",\"\",VLOOKUP(AG86,[1]SkiptoConfig!$A:$H,8,FALSE))","v":"探宝"},{"$f":"IF(AH86=\"\",\"\",VLOOKUP(AH86,[1]SkiptoConfig!$A:$H,8,FALSE))","v":"主线剧情"},{"$f":"IF(AI86=\"\",\"\",VLOOKUP(AI86,[1]SkiptoConfig!$A:$H,8,FALSE))","v":""}]
[12015,1428,"飞叶",1514,{"$f":"VLOOKUP(C87,[3]SkillConfig!$F:$G,2,FALSE)","v":"发射{0}枚飞叶，对敌人造成{1}%伤害。"},{"$f":"IFERROR(VLOOKUP(AB87*10,[3]SkillConfig!$A:$I,9,FALSE),\"\")","v":"icon_s1305"},13,{"$f":"CONCATENATE(VLOOKUP(G87,ID分段!A:B,2,FALSE),\"-\",VLOOKUP(G87,ID分段!A:C,3,FALSE))","v":"功法-本体"},3,0,0,"10;8",0,1,0,null,null,0,0,0,0,3,"13015;1305;3",null,null,null,13015,1305,{"$f":"CHOOSE(I87-2,[4]抽卡!$Q$2,[4]抽卡!$Q$3,[4]抽卡!$Q$4)","v":3},null,null,null,10,8,null,{"$f":"IF(AG87=\"\",\"\",VLOOKUP(AG87,[1]SkiptoConfig!$A:$H,8,FALSE))","v":"探宝"},{"$f":"IF(AH87=\"\",\"\",VLOOKUP(AH87,[1]SkiptoConfig!$A:$H,8,FALSE))","v":"主线剧情"},{"$f":"IF(AI87=\"\",\"\",VLOOKUP(AI87,[1]SkiptoConfig!$A:$H,8,FALSE))","v":""}]
[12016,1429,"烈焰剑",1515,{"$f":"VLOOKUP(C88,[3]SkillConfig!$F:$G,2,FALSE)","v":"向前方发出{0}柄剑，对敌人造成{1}%火系伤害，并有{2}%的概率施加1层灼烧。"},{"$f":"IFERROR(VLOOKUP(AB88*10,[3]SkillConfig!$A:$I,9,FALSE),\"\")","v":"icon_s1401"},13,{"$f":"CONCATENATE(VLOOKUP(G88,ID分段!A:B,2,FALSE),\"-\",VLOOKUP(G88,ID分段!A:C,3,FALSE))","v":"功法-本体"},5,0,0,"10",0,1,0,null,null,0,0,0,0,3,"13016;1401;30",null,null,null,13016,1401,{"$f":"CHOOSE(I88-2,[4]抽卡!$Q$2,[4]抽卡!$Q$3,[4]抽卡!$Q$4)","v":30},null,null,null,10,null,null,{"$f":"IF(AG88=\"\",\"\",VLOOKUP(AG88,[1]SkiptoConfig!$A:$H,8,FALSE))","v":"探宝"},{"$f":"IF(AH88=\"\",\"\",VLOOKUP(AH88,[1]SkiptoConfig!$A:$H,8,FALSE))","v":""},{"$f":"IF(AI88=\"\",\"\",VLOOKUP(AI88,[1]SkiptoConfig!$A:$H,8,FALSE))","v":""}]
[12017,1430,"赤焰龙吟功",1516,{"$f":"VLOOKUP(C89,[3]SkillConfig!$F:$G,2,FALSE)","v":"飞出{0}道巨龙，对敌人造成{1}火系伤害。"},{"$f":"IFERROR(VLOOKUP(AB89*10,[3]SkillConfig!$A:$I,9,FALSE),\"\")","v":"icon_s1402"},13,{"$f":"CONCATENATE(VLOOKUP(G89,ID分段!A:B,2,FALSE),\"-\",VLOOKUP(G89,ID分段!A:C,3,FALSE))","v":"功法-本体"},5,0,0,"10",0,1,0,null,null,0,0,0,0,3,"13017;1402;30",null,null,null,13017,1402,{"$f":"CHOOSE(I89-2,[4]抽卡!$Q$2,[4]抽卡!$Q$3,[4]抽卡!$Q$4)","v":30},null,null,null,10,null,null,{"$f":"IF(AG89=\"\",\"\",VLOOKUP(AG89,[1]SkiptoConfig!$A:$H,8,FALSE))","v":"探宝"},{"$f":"IF(AH89=\"\",\"\",VLOOKUP(AH89,[1]SkiptoConfig!$A:$H,8,FALSE))","v":""},{"$f":"IF(AI89=\"\",\"\",VLOOKUP(AI89,[1]SkiptoConfig!$A:$H,8,FALSE))","v":""}]
[12018,1431,"朱雀燎原指",1517,{"$f":"VLOOKUP(C90,[3]SkillConfig!$F:$G,2,FALSE)","v":"身后出现一只大手，每个手指发射{0}道烈焰，对敌人照成{1}伤害同时{2}%概率施加1层灼烧。"},{"$f":"IFERROR(VLOOKUP(AB90*10,[3]SkillConfig!$A:$I,9,FALSE),\"\")","v":"icon_s1403"},13,{"$f":"CONCATENATE(VLOOKUP(G90,ID分段!A:B,2,FALSE),\"-\",VLOOKUP(G90,ID分段!A:C,3,FALSE))","v":"功法-本体"},5,0,0,"10",0,1,0,null,null,0,0,0,0,3,"13018;1403;30",null,null,null,13018,1403,{"$f":"CHOOSE(I90-2,[4]抽卡!$Q$2,[4]抽卡!$Q$3,[4]抽卡!$Q$4)","v":30},null,null,null,10,null,null,{"$f":"IF(AG90=\"\",\"\",VLOOKUP(AG90,[1]SkiptoConfig!$A:$H,8,FALSE))","v":"探宝"},{"$f":"IF(AH90=\"\",\"\",VLOOKUP(AH90,[1]SkiptoConfig!$A:$H,8,FALSE))","v":""},{"$f":"IF(AI90=\"\",\"\",VLOOKUP(AI90,[1]SkiptoConfig!$A:$H,8,FALSE))","v":""}]
[12019,1432,"火球",1518,{"$f":"VLOOKUP(C91,[3]SkillConfig!$F:$G,2,FALSE)","v":"发射{0}枚火球，对敌人造成{1}%伤害。又{2}概率对敌人施加1成灼烧"},{"$f":"IFERROR(VLOOKUP(AB91*10,[3]SkillConfig!$A:$I,9,FALSE),\"\")","v":"icon_s1404"},13,{"$f":"CONCATENATE(VLOOKUP(G91,ID分段!A:B,2,FALSE),\"-\",VLOOKUP(G91,ID分段!A:C,3,FALSE))","v":"功法-本体"},4,0,0,"10;8",0,1,0,null,null,0,0,0,0,3,"13019;1404;10",null,null,null,13019,1404,{"$f":"CHOOSE(I91-2,[4]抽卡!$Q$2,[4]抽卡!$Q$3,[4]抽卡!$Q$4)","v":10},null,null,null,10,8,null,{"$f":"IF(AG91=\"\",\"\",VLOOKUP(AG91,[1]SkiptoConfig!$A:$H,8,FALSE))","v":"探宝"},{"$f":"IF(AH91=\"\",\"\",VLOOKUP(AH91,[1]SkiptoConfig!$A:$H,8,FALSE))","v":"主线剧情"},{"$f":"IF(AI91=\"\",\"\",VLOOKUP(AI91,[1]SkiptoConfig!$A:$H,8,FALSE))","v":""}]
[12020,1433,"火刀",1519,{"$f":"VLOOKUP(C92,[3]SkillConfig!$F:$G,2,FALSE)","v":"发射{0}枚火刃，对敌人造成{1}%伤害。"},{"$f":"IFERROR(VLOOKUP(AB92*10,[3]SkillConfig!$A:$I,9,FALSE),\"\")","v":"icon_s1405"},13,{"$f":"CONCATENATE(VLOOKUP(G92,ID分段!A:B,2,FALSE),\"-\",VLOOKUP(G92,ID分段!A:C,3,FALSE))","v":"功法-本体"},3,0,0,"10;8",0,1,0,null,null,0,0,0,0,3,"13020;1405;3",null,null,null,13020,1405,{"$f":"CHOOSE(I92-2,[4]抽卡!$Q$2,[4]抽卡!$Q$3,[4]抽卡!$Q$4)","v":3},null,null,null,10,8,null,{"$f":"IF(AG92=\"\",\"\",VLOOKUP(AG92,[1]SkiptoConfig!$A:$H,8,FALSE))","v":"探宝"},{"$f":"IF(AH92=\"\",\"\",VLOOKUP(AH92,[1]SkiptoConfig!$A:$H,8,FALSE))","v":"主线剧情"},{"$f":"IF(AI92=\"\",\"\",VLOOKUP(AI92,[1]SkiptoConfig!$A:$H,8,FALSE))","v":""}]
[12021,1434,"黄尘灭魂刺",1520,{"$f":"VLOOKUP(C93,[3]SkillConfig!$F:$G,2,FALSE)","v":"沙尘汇聚成{0}枚土刺，对敌人造成{1}%伤害，并有{2}%概率施加1层细尘。"},{"$f":"IFERROR(VLOOKUP(AB93*10,[3]SkillConfig!$A:$I,9,FALSE),\"\")","v":"icon_s1501"},13,{"$f":"CONCATENATE(VLOOKUP(G93,ID分段!A:B,2,FALSE),\"-\",VLOOKUP(G93,ID分段!A:C,3,FALSE))","v":"功法-本体"},5,0,0,"10",0,1,0,null,null,0,0,0,0,3,"13021;1501;30",null,null,null,13021,1501,{"$f":"CHOOSE(I93-2,[4]抽卡!$Q$2,[4]抽卡!$Q$3,[4]抽卡!$Q$4)","v":30},null,null,null,10,null,null,{"$f":"IF(AG93=\"\",\"\",VLOOKUP(AG93,[1]SkiptoConfig!$A:$H,8,FALSE))","v":"探宝"},{"$f":"IF(AH93=\"\",\"\",VLOOKUP(AH93,[1]SkiptoConfig!$A:$H,8,FALSE))","v":""},{"$f":"IF(AI93=\"\",\"\",VLOOKUP(AI93,[1]SkiptoConfig!$A:$H,8,FALSE))","v":""}]
[12022,1435,"地裂屠龙斩",1521,{"$f":"VLOOKUP(C94,[3]SkillConfig!$F:$G,2,FALSE)","v":"一柄虚空形成的大刀，横空挥砍形成{0}个刀气，对敌人造成{1}%伤害，并有{2}%概率叠加1层破甲"},{"$f":"IFERROR(VLOOKUP(AB94*10,[3]SkillConfig!$A:$I,9,FALSE),\"\")","v":"icon_s1502"},13,{"$f":"CONCATENATE(VLOOKUP(G94,ID分段!A:B,2,FALSE),\"-\",VLOOKUP(G94,ID分段!A:C,3,FALSE))","v":"功法-本体"},5,0,0,"10",0,1,0,null,null,0,0,0,0,3,"13022;1502;30",null,null,null,13022,1502,{"$f":"CHOOSE(I94-2,[4]抽卡!$Q$2,[4]抽卡!$Q$3,[4]抽卡!$Q$4)","v":30},null,null,null,10,null,null,{"$f":"IF(AG94=\"\",\"\",VLOOKUP(AG94,[1]SkiptoConfig!$A:$H,8,FALSE))","v":"探宝"},{"$f":"IF(AH94=\"\",\"\",VLOOKUP(AH94,[1]SkiptoConfig!$A:$H,8,FALSE))","v":""},{"$f":"IF(AI94=\"\",\"\",VLOOKUP(AI94,[1]SkiptoConfig!$A:$H,8,FALSE))","v":""}]
[12023,1436,"功法-土3",1522,{"$f":"VLOOKUP(C95,[3]SkillConfig!$F:$G,2,FALSE)","v":{"$error":"#N/A"}},{"$f":"IFERROR(VLOOKUP(AB95*10,[3]SkillConfig!$A:$I,9,FALSE),\"\")","v":""},13,{"$f":"CONCATENATE(VLOOKUP(G95,ID分段!A:B,2,FALSE),\"-\",VLOOKUP(G95,ID分段!A:C,3,FALSE))","v":"功法-本体"},5,0,0,"10",0,1,0,null,null,0,0,0,0,3,{"$f":"_xlfn.TEXTJOIN(\";\",1,AA95:AE95)","v":"13023;1503;30"},null,null,null,13023,1503,{"$f":"CHOOSE(I95-2,[4]抽卡!$Q$2,[4]抽卡!$Q$3,[4]抽卡!$Q$4)","v":30},null,null,null,10,null,null,{"$f":"IF(AG95=\"\",\"\",VLOOKUP(AG95,[1]SkiptoConfig!$A:$H,8,FALSE))","v":"探宝"},{"$f":"IF(AH95=\"\",\"\",VLOOKUP(AH95,[1]SkiptoConfig!$A:$H,8,FALSE))","v":""},{"$f":"IF(AI95=\"\",\"\",VLOOKUP(AI95,[1]SkiptoConfig!$A:$H,8,FALSE))","v":""}]
[12024,1437,"落石",1523,{"$f":"VLOOKUP(C96,[3]SkillConfig!$F:$G,2,FALSE)","v":"从天而降{0}枚落石，对敌人造成{1}%伤害。"},{"$f":"IFERROR(VLOOKUP(AB96*10,[3]SkillConfig!$A:$I,9,FALSE),\"\")","v":"icon_s1504"},13,{"$f":"CONCATENATE(VLOOKUP(G96,ID分段!A:B,2,FALSE),\"-\",VLOOKUP(G96,ID分段!A:C,3,FALSE))","v":"功法-本体"},4,0,0,"10;8",0,1,0,null,null,0,0,0,0,3,"13024;1504;10",null,null,null,13024,1504,{"$f":"CHOOSE(I96-2,[4]抽卡!$Q$2,[4]抽卡!$Q$3,[4]抽卡!$Q$4)","v":10},null,null,null,10,8,null,{"$f":"IF(AG96=\"\",\"\",VLOOKUP(AG96,[1]SkiptoConfig!$A:$H,8,FALSE))","v":"探宝"},{"$f":"IF(AH96=\"\",\"\",VLOOKUP(AH96,[1]SkiptoConfig!$A:$H,8,FALSE))","v":"主线剧情"},{"$f":"IF(AI96=\"\",\"\",VLOOKUP(AI96,[1]SkiptoConfig!$A:$H,8,FALSE))","v":""}]
[12025,1438,"小石头",1524,{"$f":"VLOOKUP(C97,[3]SkillConfig!$F:$G,2,FALSE)","v":"发射{0}枚小石头，对敌人造成{1}%伤害。"},{"$f":"IFERROR(VLOOKUP(AB97*10,[3]SkillConfig!$A:$I,9,FALSE),\"\")","v":"icon_s1505"},13,{"$f":"CONCATENATE(VLOOKUP(G97,ID分段!A:B,2,FALSE),\"-\",VLOOKUP(G97,ID分段!A:C,3,FALSE))","v":"功法-本体"},3,0,0,"10;8",0,1,0,null,null,0,0,0,0,3,"13025;1505;3",null,null,null,13025,1505,{"$f":"CHOOSE(I97-2,[4]抽卡!$Q$2,[4]抽卡!$Q$3,[4]抽卡!$Q$4)","v":3},null,null,null,10,8,null,{"$f":"IF(AG97=\"\",\"\",VLOOKUP(AG97,[1]SkiptoConfig!$A:$H,8,FALSE))","v":"探宝"},{"$f":"IF(AH97=\"\",\"\",VLOOKUP(AH97,[1]SkiptoConfig!$A:$H,8,FALSE))","v":"主线剧情"},{"$f":"IF(AI97=\"\",\"\",VLOOKUP(AI97,[1]SkiptoConfig!$A:$H,8,FALSE))","v":""}]
[{"$nulls":11},"",{"$nulls":23},{"$f":"IF(AG98=\"\",\"\",VLOOKUP(AG98,[1]SkiptoConfig!$A:$H,8,FALSE))","v":""},{"$f":"IF(AH98=\"\",\"\",VLOOKUP(AH98,[1]SkiptoConfig!$A:$H,8,FALSE))","v":""},{"$f":"IF(AI98=\"\",\"\",VLOOKUP(AI98,[1]SkiptoConfig!$A:$H,8,FALSE))","v":""}]
[12501,1800,"天衍星辰诀",1850,{"$f":"VLOOKUP(C99,[3]SkillConfig!$F:$G,2,FALSE)","v":"引星辰之力入体，增强玩家体魄，\n让后方槽位的功法无视防御性护盾（功法法宝带来的防护罩、自身护盾）"},{"$f":"IFERROR(VLOOKUP(AB99*10,[3]SkillConfig!$A:$I,9,FALSE),\"\")","v":"icon_s2001"},13,{"$f":"CONCATENATE(VLOOKUP(G99,ID分段!A:B,2,FALSE),\"-\",VLOOKUP(G99,ID分段!A:C,3,FALSE))","v":"功法-本体"},3,0,0,"10;8",0,1,0,null,null,0,0,0,0,3,{"$f":"_xlfn.TEXTJOIN(\";\",1,AA99:AE99)","v":"13501;2001;3"},null,null,null,13501,2001,{"$f":"CHOOSE(I99-2,[4]抽卡!$Q$2,[4]抽卡!$Q$3,[4]抽卡!$Q$4)","v":3},null,null,null,10,8,null,{"$f":"IF(AG99=\"\",\"\",VLOOKUP(AG99,[1]SkiptoConfig!$A:$H,8,FALSE))","v":"探宝"},{"$f":"IF(AH99=\"\",\"\",VLOOKUP(AH99,[1]SkiptoConfig!$A:$H,8,FALSE))","v":"主线剧情"},{"$f":"IF(AI99=\"\",\"\",VLOOKUP(AI99,[1]SkiptoConfig!$A:$H,8,FALSE))","v":""}]
[12502,1801,"法宝秘籍",1851,{"$f":"VLOOKUP(C100,[3]SkillConfig!$F:$G,2,FALSE)","v":"后方槽位技能在击中目标时，为法宝提供{0}%充能"},{"$f":"IFERROR(VLOOKUP(AB100*10,[3]SkillConfig!$A:$I,9,FALSE),\"\")","v":"icon_s2002"},13,{"$f":"CONCATENATE(VLOOKUP(G100,ID分段!A:B,2,FALSE),\"-\",VLOOKUP(G100,ID分段!A:C,3,FALSE))","v":"功法-本体"},3,0,0,"10;8",0,1,0,null,null,0,0,0,0,3,{"$f":"_xlfn.TEXTJOIN(\";\",1,AA100:AE100)","v":"13502;2002;3"},null,null,null,13502,2002,{"$f":"CHOOSE(I100-2,[4]抽卡!$Q$2,[4]抽卡!$Q$3,[4]抽卡!$Q$4)","v":3},null,null,null,10,8,null,{"$f":"IF(AG100=\"\",\"\",VLOOKUP(AG100,[1]SkiptoConfig!$A:$H,8,FALSE))","v":"探宝"},{"$f":"IF(AH100=\"\",\"\",VLOOKUP(AH100,[1]SkiptoConfig!$A:$H,8,FALSE))","v":"主线剧情"},{"$f":"IF(AI100=\"\",\"\",VLOOKUP(AI100,[1]SkiptoConfig!$A:$H,8,FALSE))","v":""}]
[12503,1802,"崩脉决",1852,{"$f":"VLOOKUP(C101,[3]SkillConfig!$F:$G,2,FALSE)","v":"前方功法造成伤害时有{0}%概率施加一层对应属性的伤势"},{"$f":"IFERROR(VLOOKUP(AB101*10,[3]SkillConfig!$A:$I,9,FALSE),\"\")","v":"icon_s2003"},13,{"$f":"CONCATENATE(VLOOKUP(G101,ID分段!A:B,2,FALSE),\"-\",VLOOKUP(G101,ID分段!A:C,3,FALSE))","v":"功法-本体"},3,0,0,"10;8",0,1,0,null,null,0,0,0,0,3,"13503;2003;3",null,null,null,13503,2003,{"$f":"CHOOSE(I101-2,[4]抽卡!$Q$2,[4]抽卡!$Q$3,[4]抽卡!$Q$4)","v":3},null,null,null,10,8,null,{"$f":"IF(AG101=\"\",\"\",VLOOKUP(AG101,[1]SkiptoConfig!$A:$H,8,FALSE))","v":"探宝"},{"$f":"IF(AH101=\"\",\"\",VLOOKUP(AH101,[1]SkiptoConfig!$A:$H,8,FALSE))","v":"主线剧情"},{"$f":"IF(AI101=\"\",\"\",VLOOKUP(AI101,[1]SkiptoConfig!$A:$H,8,FALSE))","v":""}]
[12504,1803,"两仪决",1853,{"$f":"VLOOKUP(C102,[3]SkillConfig!$F:$G,2,FALSE)","v":"前后方法宝如果相生则双生效果增强{0}%"},{"$f":"IFERROR(VLOOKUP(AB102*10,[3]SkillConfig!$A:$I,9,FALSE),\"\")","v":"icon_s2004"},13,{"$f":"CONCATENATE(VLOOKUP(G102,ID分段!A:B,2,FALSE),\"-\",VLOOKUP(G102,ID分段!A:C,3,FALSE))","v":"功法-本体"},3,0,0,"10;8",0,1,0,null,null,0,0,0,0,3,"13504;2004;3",null,null,null,13504,2004,{"$f":"CHOOSE(I102-2,[4]抽卡!$Q$2,[4]抽卡!$Q$3,[4]抽卡!$Q$4)","v":3},null,null,null,10,8,null,{"$f":"IF(AG102=\"\",\"\",VLOOKUP(AG102,[1]SkiptoConfig!$A:$H,8,FALSE))","v":"探宝"},{"$f":"IF(AH102=\"\",\"\",VLOOKUP(AH102,[1]SkiptoConfig!$A:$H,8,FALSE))","v":"主线剧情"},{"$f":"IF(AI102=\"\",\"\",VLOOKUP(AI102,[1]SkiptoConfig!$A:$H,8,FALSE))","v":""}]
[12505,1804,"火焰决",1854,{"$f":"VLOOKUP(C103,[3]SkillConfig!$F:$G,2,FALSE)","v":"每层经过火经脉时使火系功法伤害提升{0}%，最多叠加{1}层"},{"$f":"IFERROR(VLOOKUP(AB103*10,[3]SkillConfig!$A:$I,9,FALSE),\"\")","v":"icon_s2005"},13,{"$f":"CONCATENATE(VLOOKUP(G103,ID分段!A:B,2,FALSE),\"-\",VLOOKUP(G103,ID分段!A:C,3,FALSE))","v":"功法-本体"},3,0,0,"10;8",0,1,0,null,null,0,0,0,0,3,"13505;2005;3",null,null,null,13505,2005,{"$f":"CHOOSE(I103-2,[4]抽卡!$Q$2,[4]抽卡!$Q$3,[4]抽卡!$Q$4)","v":3},null,null,null,10,8,null,{"$f":"IF(AG103=\"\",\"\",VLOOKUP(AG103,[1]SkiptoConfig!$A:$H,8,FALSE))","v":"探宝"},{"$f":"IF(AH103=\"\",\"\",VLOOKUP(AH103,[1]SkiptoConfig!$A:$H,8,FALSE))","v":"主线剧情"},{"$f":"IF(AI103=\"\",\"\",VLOOKUP(AI103,[1]SkiptoConfig!$A:$H,8,FALSE))","v":""}]
[12506,1805,"乾坤巨灵诀",1855,{"$f":"VLOOKUP(C104,[3]SkillConfig!$F:$G,2,FALSE)","v":"后方槽位第一个技能体型巨大化，且在对碰中强度增加{0}%"},{"$f":"IFERROR(VLOOKUP(AB104*10,[3]SkillConfig!$A:$I,9,FALSE),\"\")","v":"icon_s2006"},13,{"$f":"CONCATENATE(VLOOKUP(G104,ID分段!A:B,2,FALSE),\"-\",VLOOKUP(G104,ID分段!A:C,3,FALSE))","v":"功法-本体"},4,0,0,"10;8",0,1,0,null,null,0,0,0,0,3,"13506;2006;10",null,null,null,13506,2006,{"$f":"CHOOSE(I104-2,[4]抽卡!$Q$2,[4]抽卡!$Q$3,[4]抽卡!$Q$4)","v":10},null,null,null,10,8,null,{"$f":"IF(AG104=\"\",\"\",VLOOKUP(AG104,[1]SkiptoConfig!$A:$H,8,FALSE))","v":"探宝"},{"$f":"IF(AH104=\"\",\"\",VLOOKUP(AH104,[1]SkiptoConfig!$A:$H,8,FALSE))","v":"主线剧情"},{"$f":"IF(AI104=\"\",\"\",VLOOKUP(AI104,[1]SkiptoConfig!$A:$H,8,FALSE))","v":""}]
[12507,1806,"极速齿轮",1856,{"$f":"VLOOKUP(C105,[3]SkillConfig!$F:$G,2,FALSE)","v":"后槽位技能在催动时获得转盘加速{0}%,持续{1}秒"},{"$f":"IFERROR(VLOOKUP(AB105*10,[3]SkillConfig!$A:$I,9,FALSE),\"\")","v":"icon_s2007"},13,{"$f":"CONCATENATE(VLOOKUP(G105,ID分段!A:B,2,FALSE),\"-\",VLOOKUP(G105,ID分段!A:C,3,FALSE))","v":"功法-本体"},4,0,0,"10;8",0,1,0,null,null,0,0,0,0,3,"13507;2007;10",null,null,null,13507,2007,{"$f":"CHOOSE(I105-2,[4]抽卡!$Q$2,[4]抽卡!$Q$3,[4]抽卡!$Q$4)","v":10},null,null,null,10,8,null,{"$f":"IF(AG105=\"\",\"\",VLOOKUP(AG105,[1]SkiptoConfig!$A:$H,8,FALSE))","v":"探宝"},{"$f":"IF(AH105=\"\",\"\",VLOOKUP(AH105,[1]SkiptoConfig!$A:$H,8,FALSE))","v":"主线剧情"},{"$f":"IF(AI105=\"\",\"\",VLOOKUP(AI105,[1]SkiptoConfig!$A:$H,8,FALSE))","v":""}]
[12508,1807,"太虚剑意",1857,{"$f":"VLOOKUP(C106,[3]SkillConfig!$F:$G,2,FALSE)","v":"后方槽位如果是剑功法，在释放功法时额外释放{0}道剑气，对敌人造成{1}%伤害，并无视护盾类效果"},{"$f":"IFERROR(VLOOKUP(AB106*10,[3]SkillConfig!$A:$I,9,FALSE),\"\")","v":"icon_s2008"},13,{"$f":"CONCATENATE(VLOOKUP(G106,ID分段!A:B,2,FALSE),\"-\",VLOOKUP(G106,ID分段!A:C,3,FALSE))","v":"功法-本体"},4,0,0,"10;8",0,1,0,null,null,0,0,0,0,3,"13508;2008;10",null,null,null,13508,2008,{"$f":"CHOOSE(I106-2,[4]抽卡!$Q$2,[4]抽卡!$Q$3,[4]抽卡!$Q$4)","v":10},null,null,null,10,8,null,{"$f":"IF(AG106=\"\",\"\",VLOOKUP(AG106,[1]SkiptoConfig!$A:$H,8,FALSE))","v":"探宝"},{"$f":"IF(AH106=\"\",\"\",VLOOKUP(AH106,[1]SkiptoConfig!$A:$H,8,FALSE))","v":"主线剧情"},{"$f":"IF(AI106=\"\",\"\",VLOOKUP(AI106,[1]SkiptoConfig!$A:$H,8,FALSE))","v":""}]
[12509,1808,"青莲净体诀",1858,{"$f":"VLOOKUP(C107,[3]SkillConfig!$F:$G,2,FALSE)","v":"前方槽位功法在命中目标时会获得青莲之气，青莲气体达到{0}层时有{1}%概率清除自己1个随机debuff,并恢复{2}%攻击力伤害"},{"$f":"IFERROR(VLOOKUP(AB107*10,[3]SkillConfig!$A:$I,9,FALSE),\"\")","v":"icon_s2009"},13,{"$f":"CONCATENATE(VLOOKUP(G107,ID分段!A:B,2,FALSE),\"-\",VLOOKUP(G107,ID分段!A:C,3,FALSE))","v":"功法-本体"},4,0,0,"10;8",0,1,0,null,null,0,0,0,0,3,{"$f":"_xlfn.TEXTJOIN(\";\",1,AA107:AE107)","v":"13509;2009;10"},null,null,null,13509,2009,{"$f":"CHOOSE(I107-2,[4]抽卡!$Q$2,[4]抽卡!$Q$3,[4]抽卡!$Q$4)","v":10},null,null,null,10,8,null,{"$f":"IF(AG107=\"\",\"\",VLOOKUP(AG107,[1]SkiptoConfig!$A:$H,8,FALSE))","v":"探宝"},{"$f":"IF(AH107=\"\",\"\",VLOOKUP(AH107,[1]SkiptoConfig!$A:$H,8,FALSE))","v":"主线剧情"},{"$f":"IF(AI107=\"\",\"\",VLOOKUP(AI107,[1]SkiptoConfig!$A:$H,8,FALSE))","v":""}]
[12510,1809,"碧霄回春术",1859,{"$f":"VLOOKUP(C108,[3]SkillConfig!$F:$G,2,FALSE)","v":"功法在经过木系区域时会触发生机，为角色治疗{0}%最大攻击力伤害"},{"$f":"IFERROR(VLOOKUP(AB108*10,[3]SkillConfig!$A:$I,9,FALSE),\"\")","v":"icon_s2010"},13,{"$f":"CONCATENATE(VLOOKUP(G108,ID分段!A:B,2,FALSE),\"-\",VLOOKUP(G108,ID分段!A:C,3,FALSE))","v":"功法-本体"},4,0,0,"10;8",0,1,0,null,null,0,0,0,0,3,"13510;2010;10",null,null,null,13510,2010,{"$f":"CHOOSE(I108-2,[4]抽卡!$Q$2,[4]抽卡!$Q$3,[4]抽卡!$Q$4)","v":10},null,null,null,10,8,null,{"$f":"IF(AG108=\"\",\"\",VLOOKUP(AG108,[1]SkiptoConfig!$A:$H,8,FALSE))","v":"探宝"},{"$f":"IF(AH108=\"\",\"\",VLOOKUP(AH108,[1]SkiptoConfig!$A:$H,8,FALSE))","v":"主线剧情"},{"$f":"IF(AI108=\"\",\"\",VLOOKUP(AI108,[1]SkiptoConfig!$A:$H,8,FALSE))","v":""}]
[12511,1810,"血祭神通",1860,{"$f":"VLOOKUP(C109,[3]SkillConfig!$F:$G,2,FALSE)","v":"所有流血状态照成的伤害会转换成充能值，2圈后对全体敌人造成{0}%充能值的伤害"},{"$f":"IFERROR(VLOOKUP(AB109*10,[3]SkillConfig!$A:$I,9,FALSE),\"\")","v":"icon_s2011"},13,{"$f":"CONCATENATE(VLOOKUP(G109,ID分段!A:B,2,FALSE),\"-\",VLOOKUP(G109,ID分段!A:C,3,FALSE))","v":"功法-本体"},5,0,0,"10",0,1,0,null,null,0,0,0,0,3,"13511;2011;30",null,null,null,13511,2011,{"$f":"CHOOSE(I109-2,[4]抽卡!$Q$2,[4]抽卡!$Q$3,[4]抽卡!$Q$4)","v":30},null,null,null,10,null,null,{"$f":"IF(AG109=\"\",\"\",VLOOKUP(AG109,[1]SkiptoConfig!$A:$H,8,FALSE))","v":"探宝"},{"$f":"IF(AH109=\"\",\"\",VLOOKUP(AH109,[1]SkiptoConfig!$A:$H,8,FALSE))","v":""},{"$f":"IF(AI109=\"\",\"\",VLOOKUP(AI109,[1]SkiptoConfig!$A:$H,8,FALSE))","v":""}]
[12512,1811,"金煞决",1861,{"$f":"VLOOKUP(C110,[3]SkillConfig!$F:$G,2,FALSE)","v":"前方功法对敌人照成伤害时额施加一层流血"},{"$f":"IFERROR(VLOOKUP(AB110*10,[3]SkillConfig!$A:$I,9,FALSE),\"\")","v":"icon_s2012"},13,{"$f":"CONCATENATE(VLOOKUP(G110,ID分段!A:B,2,FALSE),\"-\",VLOOKUP(G110,ID分段!A:C,3,FALSE))","v":"功法-本体"},5,0,0,"10",0,1,0,null,null,0,0,0,0,3,"13512;2012;30",null,null,null,13512,2012,{"$f":"CHOOSE(I110-2,[4]抽卡!$Q$2,[4]抽卡!$Q$3,[4]抽卡!$Q$4)","v":30},null,null,null,10,null,null,{"$f":"IF(AG110=\"\",\"\",VLOOKUP(AG110,[1]SkiptoConfig!$A:$H,8,FALSE))","v":"探宝"},{"$f":"IF(AH110=\"\",\"\",VLOOKUP(AH110,[1]SkiptoConfig!$A:$H,8,FALSE))","v":""},{"$f":"IF(AI110=\"\",\"\",VLOOKUP(AI110,[1]SkiptoConfig!$A:$H,8,FALSE))","v":""}]
[12513,1812,"毒瘴领域",1862,{"$f":"VLOOKUP(C111,[3]SkillConfig!$F:$G,2,FALSE)","v":"前方功法击中目标时额外施加一层毒，对流血中的敌人再额外施加一层"},{"$f":"IFERROR(VLOOKUP(AB111*10,[3]SkillConfig!$A:$I,9,FALSE),\"\")","v":"icon_s2013"},13,{"$f":"CONCATENATE(VLOOKUP(G111,ID分段!A:B,2,FALSE),\"-\",VLOOKUP(G111,ID分段!A:C,3,FALSE))","v":"功法-本体"},5,0,0,"10",0,1,0,null,null,0,0,0,0,3,"13513;2013;30",null,null,null,13513,2013,{"$f":"CHOOSE(I111-2,[4]抽卡!$Q$2,[4]抽卡!$Q$3,[4]抽卡!$Q$4)","v":30},null,null,null,10,null,null,{"$f":"IF(AG111=\"\",\"\",VLOOKUP(AG111,[1]SkiptoConfig!$A:$H,8,FALSE))","v":"探宝"},{"$f":"IF(AH111=\"\",\"\",VLOOKUP(AH111,[1]SkiptoConfig!$A:$H,8,FALSE))","v":""},{"$f":"IF(AI111=\"\",\"\",VLOOKUP(AI111,[1]SkiptoConfig!$A:$H,8,FALSE))","v":""}]
[12514,1813,"毒爆",1863,{"$f":"VLOOKUP(C112,[3]SkillConfig!$F:$G,2,FALSE)","v":"后方功法击中目标后，如果目标升上有{0}层毒时对目标额外照成{1}%伤害的伤害，并对周围的敌人照成该伤害的{2}伤害"},{"$f":"IFERROR(VLOOKUP(AB112*10,[3]SkillConfig!$A:$I,9,FALSE),\"\")","v":"icon_s2014"},13,{"$f":"CONCATENATE(VLOOKUP(G112,ID分段!A:B,2,FALSE),\"-\",VLOOKUP(G112,ID分段!A:C,3,FALSE))","v":"功法-本体"},5,0,0,"10",0,1,0,null,null,0,0,0,0,3,"13514;2014;30",null,null,null,13514,2014,{"$f":"CHOOSE(I112-2,[4]抽卡!$Q$2,[4]抽卡!$Q$3,[4]抽卡!$Q$4)","v":30},null,null,null,10,null,null,{"$f":"IF(AG112=\"\",\"\",VLOOKUP(AG112,[1]SkiptoConfig!$A:$H,8,FALSE))","v":"探宝"},{"$f":"IF(AH112=\"\",\"\",VLOOKUP(AH112,[1]SkiptoConfig!$A:$H,8,FALSE))","v":""},{"$f":"IF(AI112=\"\",\"\",VLOOKUP(AI112,[1]SkiptoConfig!$A:$H,8,FALSE))","v":""}]
[12515,1814,"异常转移",1864,{"$f":"VLOOKUP(C113,[3]SkillConfig!$F:$G,2,FALSE)","v":"对目标造成的异常状态有{0}%概率转移到下一个目标，不会来回转移"},{"$f":"IFERROR(VLOOKUP(AB113*10,[3]SkillConfig!$A:$I,9,FALSE),\"\")","v":"icon_s2015"},13,{"$f":"CONCATENATE(VLOOKUP(G113,ID分段!A:B,2,FALSE),\"-\",VLOOKUP(G113,ID分段!A:C,3,FALSE))","v":"功法-本体"},5,0,0,"10",0,1,0,null,null,0,0,0,0,3,"13515;2015;30",null,null,null,13515,2015,{"$f":"CHOOSE(I113-2,[4]抽卡!$Q$2,[4]抽卡!$Q$3,[4]抽卡!$Q$4)","v":30},null,null,null,10,null,null,{"$f":"IF(AG113=\"\",\"\",VLOOKUP(AG113,[1]SkiptoConfig!$A:$H,8,FALSE))","v":"探宝"},{"$f":"IF(AH113=\"\",\"\",VLOOKUP(AH113,[1]SkiptoConfig!$A:$H,8,FALSE))","v":""},{"$f":"IF(AI113=\"\",\"\",VLOOKUP(AI113,[1]SkiptoConfig!$A:$H,8,FALSE))","v":""}]
[12516,1815,"阴水",1865,{"$f":"VLOOKUP(C114,[3]SkillConfig!$F:$G,2,FALSE)","v":"前方功法会让目标扎染上阴水。如果目标身上有寒气则会将阴水转换为冰冻值(冰冻值到达一定程度会冰冻敌人)"},{"$f":"IFERROR(VLOOKUP(AB114*10,[3]SkillConfig!$A:$I,9,FALSE),\"\")","v":"icon_s2016"},13,{"$f":"CONCATENATE(VLOOKUP(G114,ID分段!A:B,2,FALSE),\"-\",VLOOKUP(G114,ID分段!A:C,3,FALSE))","v":"功法-本体"},5,0,0,"10",0,1,0,null,null,0,0,0,0,3,"13516;2016;30",null,null,null,13516,2016,{"$f":"CHOOSE(I114-2,[4]抽卡!$Q$2,[4]抽卡!$Q$3,[4]抽卡!$Q$4)","v":30},null,null,null,10,null,null,{"$f":"IF(AG114=\"\",\"\",VLOOKUP(AG114,[1]SkiptoConfig!$A:$H,8,FALSE))","v":"探宝"},{"$f":"IF(AH114=\"\",\"\",VLOOKUP(AH114,[1]SkiptoConfig!$A:$H,8,FALSE))","v":""},{"$f":"IF(AI114=\"\",\"\",VLOOKUP(AI114,[1]SkiptoConfig!$A:$H,8,FALSE))","v":""}]
[12517,1816,"灵油",1866,{"$f":"VLOOKUP(C115,[3]SkillConfig!$F:$G,2,FALSE)","v":"前方功法附加上灵气汇聚而成的可燃物质，火属性伤害提升{0}%并额外施加一层灼烧"},{"$f":"IFERROR(VLOOKUP(AB115*10,[3]SkillConfig!$A:$I,9,FALSE),\"\")","v":"icon_s2017"},13,{"$f":"CONCATENATE(VLOOKUP(G115,ID分段!A:B,2,FALSE),\"-\",VLOOKUP(G115,ID分段!A:C,3,FALSE))","v":"功法-本体"},5,0,0,"10",0,1,0,null,null,0,0,0,0,3,"13517;2017;30",null,null,null,13517,2017,{"$f":"CHOOSE(I115-2,[4]抽卡!$Q$2,[4]抽卡!$Q$3,[4]抽卡!$Q$4)","v":30},null,null,null,10,null,null,{"$f":"IF(AG115=\"\",\"\",VLOOKUP(AG115,[1]SkiptoConfig!$A:$H,8,FALSE))","v":"探宝"},{"$f":"IF(AH115=\"\",\"\",VLOOKUP(AH115,[1]SkiptoConfig!$A:$H,8,FALSE))","v":""},{"$f":"IF(AI115=\"\",\"\",VLOOKUP(AI115,[1]SkiptoConfig!$A:$H,8,FALSE))","v":""}]
[12518,1817,"厚土护体",1867,{"$f":"VLOOKUP(C116,[3]SkillConfig!$F:$G,2,FALSE)","v":"每使用一个土系功法时获得{0}点土系值，达到100时获得{1}%防御。持续{2}秒，每对敌人施加一次细尘额外获得{3}点"},{"$f":"IFERROR(VLOOKUP(AB116*10,[3]SkillConfig!$A:$I,9,FALSE),\"\")","v":"icon_s2018"},13,{"$f":"CONCATENATE(VLOOKUP(G116,ID分段!A:B,2,FALSE),\"-\",VLOOKUP(G116,ID分段!A:C,3,FALSE))","v":"功法-本体"},5,0,0,"10",0,1,0,null,null,0,0,0,0,3,{"$f":"_xlfn.TEXTJOIN(\";\",1,AA116:AE116)","v":"13518;2018;30"},null,null,null,13518,2018,{"$f":"CHOOSE(I116-2,[4]抽卡!$Q$2,[4]抽卡!$Q$3,[4]抽卡!$Q$4)","v":30},null,null,null,10,null,null,{"$f":"IF(AG116=\"\",\"\",VLOOKUP(AG116,[1]SkiptoConfig!$A:$H,8,FALSE))","v":"探宝"},{"$f":"IF(AH116=\"\",\"\",VLOOKUP(AH116,[1]SkiptoConfig!$A:$H,8,FALSE))","v":""},{"$f":"IF(AI116=\"\",\"\",VLOOKUP(AI116,[1]SkiptoConfig!$A:$H,8,FALSE))","v":""}]
[12519,1818,"金沙",1868,{"$f":"VLOOKUP(C117,[3]SkillConfig!$F:$G,2,FALSE)","v":"前方功法命中目标时额外施加1层细尘。并将细尘的的\n品质提升为金沙，效果提升{0}%"},{"$f":"IFERROR(VLOOKUP(AB117*10,[3]SkillConfig!$A:$I,9,FALSE),\"\")","v":"icon_s2019"},13,{"$f":"CONCATENATE(VLOOKUP(G117,ID分段!A:B,2,FALSE),\"-\",VLOOKUP(G117,ID分段!A:C,3,FALSE))","v":"功法-本体"},5,0,0,"10",0,1,0,null,null,0,0,0,0,3,"13519;2019;30",null,null,null,13519,2019,{"$f":"CHOOSE(I117-2,[4]抽卡!$Q$2,[4]抽卡!$Q$3,[4]抽卡!$Q$4)","v":30},null,null,null,10,null,null,{"$f":"IF(AG117=\"\",\"\",VLOOKUP(AG117,[1]SkiptoConfig!$A:$H,8,FALSE))","v":"探宝"},{"$f":"IF(AH117=\"\",\"\",VLOOKUP(AH117,[1]SkiptoConfig!$A:$H,8,FALSE))","v":""},{"$f":"IF(AI117=\"\",\"\",VLOOKUP(AI117,[1]SkiptoConfig!$A:$H,8,FALSE))","v":""}]
[{"$nulls":11},"",{"$nulls":23},{"$f":"IF(AG118=\"\",\"\",VLOOKUP(AG118,[1]SkiptoConfig!$A:$H,8,FALSE))","v":""},{"$f":"IF(AH118=\"\",\"\",VLOOKUP(AH118,[1]SkiptoConfig!$A:$H,8,FALSE))","v":""},{"$f":"IF(AI118=\"\",\"\",VLOOKUP(AI118,[1]SkiptoConfig!$A:$H,8,FALSE))","v":""}]
[13001,1600,{"$f":"CONCATENATE(C73,\"碎片\")","v":"太虚幻剑经碎片"},1700,"用于主动功法太虚幻剑经的升星。",{"$f":"F73","v":"icon_s1101"},14,{"$f":"CONCATENATE(VLOOKUP(G119,ID分段!A:B,2,FALSE),\"-\",VLOOKUP(G119,ID分段!A:C,3,FALSE))","v":"功法-碎片"},5,0,0,"10",0,1,0,null,null,0,0,0,0,11,{"$f":"_xlfn.TEXTJOIN(\";\",1,AA119:AE119)","v":"12001"},null,null,null,12001,{"$nulls":5},10,null,null,{"$f":"IF(AG119=\"\",\"\",VLOOKUP(AG119,[1]SkiptoConfig!$A:$H,8,FALSE))","v":"探宝"},{"$f":"IF(AH119=\"\",\"\",VLOOKUP(AH119,[1]SkiptoConfig!$A:$H,8,FALSE))","v":""},{"$f":"IF(AI119=\"\",\"\",VLOOKUP(AI119,[1]SkiptoConfig!$A:$H,8,FALSE))","v":""}]
[13002,1601,"天罡剑气诀碎片",1701,"用于主动功法天罡剑气诀的升星。",{"$f":"F74","v":"icon_s1102"},14,{"$f":"CONCATENATE(VLOOKUP(G120,ID分段!A:B,2,FALSE),\"-\",VLOOKUP(G120,ID分段!A:C,3,FALSE))","v":"功法-碎片"},5,0,0,"10",0,1,0,null,null,0,0,0,0,11,{"$f":"_xlfn.TEXTJOIN(\";\",1,AA120:AE120)","v":"12002"},null,null,null,12002,{"$nulls":5},10,null,null,{"$f":"IF(AG120=\"\",\"\",VLOOKUP(AG120,[1]SkiptoConfig!$A:$H,8,FALSE))","v":"探宝"},{"$f":"IF(AH120=\"\",\"\",VLOOKUP(AH120,[1]SkiptoConfig!$A:$H,8,FALSE))","v":""},{"$f":"IF(AI120=\"\",\"\",VLOOKUP(AI120,[1]SkiptoConfig!$A:$H,8,FALSE))","v":""}]
[13003,1602,"血刃金煌功碎片",1702,"用于主动功法血刃金煌功的升星。","icon_s1103",14,{"$f":"CONCATENATE(VLOOKUP(G121,ID分段!A:B,2,FALSE),\"-\",VLOOKUP(G121,ID分段!A:C,3,FALSE))","v":"功法-碎片"},5,0,0,"10",0,1,0,null,null,0,0,0,0,11,"12003",null,null,null,12003,{"$nulls":5},10,null,null,{"$f":"IF(AG121=\"\",\"\",VLOOKUP(AG121,[1]SkiptoConfig!$A:$H,8,FALSE))","v":"探宝"},{"$f":"IF(AH121=\"\",\"\",VLOOKUP(AH121,[1]SkiptoConfig!$A:$H,8,FALSE))","v":""},{"$f":"IF(AI121=\"\",\"\",VLOOKUP(AI121,[1]SkiptoConfig!$A:$H,8,FALSE))","v":""}]
[13004,1603,"飞刃碎片",1703,"用于主动功法飞刃的升星。","icon_s1104",14,{"$f":"CONCATENATE(VLOOKUP(G122,ID分段!A:B,2,FALSE),\"-\",VLOOKUP(G122,ID分段!A:C,3,FALSE))","v":"功法-碎片"},4,0,0,"10;8",0,1,0,null,null,0,0,0,0,11,"12004",null,null,null,12004,{"$nulls":5},10,8,null,{"$f":"IF(AG122=\"\",\"\",VLOOKUP(AG122,[1]SkiptoConfig!$A:$H,8,FALSE))","v":"探宝"},{"$f":"IF(AH122=\"\",\"\",VLOOKUP(AH122,[1]SkiptoConfig!$A:$H,8,FALSE))","v":"主线剧情"},{"$f":"IF(AI122=\"\",\"\",VLOOKUP(AI122,[1]SkiptoConfig!$A:$H,8,FALSE))","v":""}]
[13005,1604,"金针碎片",1704,"用于主动功法金针的升星。","icon_s1105",14,{"$f":"CONCATENATE(VLOOKUP(G123,ID分段!A:B,2,FALSE),\"-\",VLOOKUP(G123,ID分段!A:C,3,FALSE))","v":"功法-碎片"},3,0,0,"10;8",0,1,0,null,null,0,0,0,0,11,"12005",null,null,null,12005,{"$nulls":5},10,8,null,{"$f":"IF(AG123=\"\",\"\",VLOOKUP(AG123,[1]SkiptoConfig!$A:$H,8,FALSE))","v":"探宝"},{"$f":"IF(AH123=\"\",\"\",VLOOKUP(AH123,[1]SkiptoConfig!$A:$H,8,FALSE))","v":"主线剧情"},{"$f":"IF(AI123=\"\",\"\",VLOOKUP(AI123,[1]SkiptoConfig!$A:$H,8,FALSE))","v":""}]
[13006,1605,"碧落幽冥劲碎片",1705,"用于主动功法碧落幽冥劲的升星。","icon_s1201",14,{"$f":"CONCATENATE(VLOOKUP(G124,ID分段!A:B,2,FALSE),\"-\",VLOOKUP(G124,ID分段!A:C,3,FALSE))","v":"功法-碎片"},5,0,0,"10",0,1,0,null,null,0,0,0,0,11,"12006",null,null,null,12006,{"$nulls":5},10,null,null,{"$f":"IF(AG124=\"\",\"\",VLOOKUP(AG124,[1]SkiptoConfig!$A:$H,8,FALSE))","v":"探宝"},{"$f":"IF(AH124=\"\",\"\",VLOOKUP(AH124,[1]SkiptoConfig!$A:$H,8,FALSE))","v":""},{"$f":"IF(AI124=\"\",\"\",VLOOKUP(AI124,[1]SkiptoConfig!$A:$H,8,FALSE))","v":""}]
[13007,1606,"雾隐千流法碎片",1706,"用于主动功法雾隐千流法的升星。","icon_s1202",14,{"$f":"CONCATENATE(VLOOKUP(G125,ID分段!A:B,2,FALSE),\"-\",VLOOKUP(G125,ID分段!A:C,3,FALSE))","v":"功法-碎片"},5,0,0,"10",0,1,0,null,null,0,0,0,0,11,"12007",null,null,null,12007,{"$nulls":5},10,null,null,{"$f":"IF(AG125=\"\",\"\",VLOOKUP(AG125,[1]SkiptoConfig!$A:$H,8,FALSE))","v":"探宝"},{"$f":"IF(AH125=\"\",\"\",VLOOKUP(AH125,[1]SkiptoConfig!$A:$H,8,FALSE))","v":""},{"$f":"IF(AI125=\"\",\"\",VLOOKUP(AI125,[1]SkiptoConfig!$A:$H,8,FALSE))","v":""}]
[13008,1607,"功法-水3碎片",1707,"用于主动功法功法-水3的升星。","",14,{"$f":"CONCATENATE(VLOOKUP(G126,ID分段!A:B,2,FALSE),\"-\",VLOOKUP(G126,ID分段!A:C,3,FALSE))","v":"功法-碎片"},5,0,0,"10",0,1,0,null,null,0,0,0,0,11,"12008",null,null,null,12008,{"$nulls":5},10,null,null,{"$f":"IF(AG126=\"\",\"\",VLOOKUP(AG126,[1]SkiptoConfig!$A:$H,8,FALSE))","v":"探宝"},{"$f":"IF(AH126=\"\",\"\",VLOOKUP(AH126,[1]SkiptoConfig!$A:$H,8,FALSE))","v":""},{"$f":"IF(AI126=\"\",\"\",VLOOKUP(AI126,[1]SkiptoConfig!$A:$H,8,FALSE))","v":""}]
[13009,1608,"水球碎片",1708,"用于主动功法水球的升星。","icon_s1204",14,{"$f":"CONCATENATE(VLOOKUP(G127,ID分段!A:B,2,FALSE),\"-\",VLOOKUP(G127,ID分段!A:C,3,FALSE))","v":"功法-碎片"},4,0,0,"10;8",0,1,0,null,null,0,0,0,0,11,"12009",null,null,null,12009,{"$nulls":5},10,8,null,{"$f":"IF(AG127=\"\",\"\",VLOOKUP(AG127,[1]SkiptoConfig!$A:$H,8,FALSE))","v":"探宝"},{"$f":"IF(AH127=\"\",\"\",VLOOKUP(AH127,[1]SkiptoConfig!$A:$H,8,FALSE))","v":"主线剧情"},{"$f":"IF(AI127=\"\",\"\",VLOOKUP(AI127,[1]SkiptoConfig!$A:$H,8,FALSE))","v":""}]
[13010,1609,"冰刀碎片",1709,"用于主动功法冰刀的升星。","icon_s1205",14,{"$f":"CONCATENATE(VLOOKUP(G128,ID分段!A:B,2,FALSE),\"-\",VLOOKUP(G128,ID分段!A:C,3,FALSE))","v":"功法-碎片"},3,0,0,"10;8",0,1,0,null,null,0,0,0,0,11,"12010",null,null,null,12010,{"$nulls":5},10,8,null,{"$f":"IF(AG128=\"\",\"\",VLOOKUP(AG128,[1]SkiptoConfig!$A:$H,8,FALSE))","v":"探宝"},{"$f":"IF(AH128=\"\",\"\",VLOOKUP(AH128,[1]SkiptoConfig!$A:$H,8,FALSE))","v":"主线剧情"},{"$f":"IF(AI128=\"\",\"\",VLOOKUP(AI128,[1]SkiptoConfig!$A:$H,8,FALSE))","v":""}]
[13011,1610,"瘴影千丝术碎片",1710,"用于主动功法瘴影千丝术的升星。","icon_s1301",14,{"$f":"CONCATENATE(VLOOKUP(G129,ID分段!A:B,2,FALSE),\"-\",VLOOKUP(G129,ID分段!A:C,3,FALSE))","v":"功法-碎片"},5,0,0,"10",0,1,0,null,null,0,0,0,0,11,"12011",null,null,null,12011,{"$nulls":5},10,null,null,{"$f":"IF(AG129=\"\",\"\",VLOOKUP(AG129,[1]SkiptoConfig!$A:$H,8,FALSE))","v":"探宝"},{"$f":"IF(AH129=\"\",\"\",VLOOKUP(AH129,[1]SkiptoConfig!$A:$H,8,FALSE))","v":""},{"$f":"IF(AI129=\"\",\"\",VLOOKUP(AI129,[1]SkiptoConfig!$A:$H,8,FALSE))","v":""}]
[13012,1611,"蚀骨腐血掌碎片",1711,"用于主动功法蚀骨腐血掌的升星。","icon_s1302",14,{"$f":"CONCATENATE(VLOOKUP(G130,ID分段!A:B,2,FALSE),\"-\",VLOOKUP(G130,ID分段!A:C,3,FALSE))","v":"功法-碎片"},5,0,0,"10",0,1,0,null,null,0,0,0,0,11,"12012",null,null,null,12012,{"$nulls":5},10,null,null,{"$f":"IF(AG130=\"\",\"\",VLOOKUP(AG130,[1]SkiptoConfig!$A:$H,8,FALSE))","v":"探宝"},{"$f":"IF(AH130=\"\",\"\",VLOOKUP(AH130,[1]SkiptoConfig!$A:$H,8,FALSE))","v":""},{"$f":"IF(AI130=\"\",\"\",VLOOKUP(AI130,[1]SkiptoConfig!$A:$H,8,FALSE))","v":""}]
[13013,1612,"功法-木3碎片",1712,"用于主动功法功法-木3的升星。","",14,{"$f":"CONCATENATE(VLOOKUP(G131,ID分段!A:B,2,FALSE),\"-\",VLOOKUP(G131,ID分段!A:C,3,FALSE))","v":"功法-碎片"},5,0,0,"10",0,1,0,null,null,0,0,0,0,11,"12013",null,null,null,12013,{"$nulls":5},10,null,null,{"$f":"IF(AG131=\"\",\"\",VLOOKUP(AG131,[1]SkiptoConfig!$A:$H,8,FALSE))","v":"探宝"},{"$f":"IF(AH131=\"\",\"\",VLOOKUP(AH131,[1]SkiptoConfig!$A:$H,8,FALSE))","v":""},{"$f":"IF(AI131=\"\",\"\",VLOOKUP(AI131,[1]SkiptoConfig!$A:$H,8,FALSE))","v":""}]
[13014,1613,"竹刺碎片",1713,"用于主动功法竹刺的升星。","icon_s1304",14,{"$f":"CONCATENATE(VLOOKUP(G132,ID分段!A:B,2,FALSE),\"-\",VLOOKUP(G132,ID分段!A:C,3,FALSE))","v":"功法-碎片"},4,0,0,"10;8",0,1,0,null,null,0,0,0,0,11,"12014",null,null,null,12014,{"$nulls":5},10,8,null,{"$f":"IF(AG132=\"\",\"\",VLOOKUP(AG132,[1]SkiptoConfig!$A:$H,8,FALSE))","v":"探宝"},{"$f":"IF(AH132=\"\",\"\",VLOOKUP(AH132,[1]SkiptoConfig!$A:$H,8,FALSE))","v":"主线剧情"},{"$f":"IF(AI132=\"\",\"\",VLOOKUP(AI132,[1]SkiptoConfig!$A:$H,8,FALSE))","v":""}]
[13015,1614,"飞叶碎片",1714,"用于主动功法飞叶的升星。","icon_s1305",14,{"$f":"CONCATENATE(VLOOKUP(G133,ID分段!A:B,2,FALSE),\"-\",VLOOKUP(G133,ID分段!A:C,3,FALSE))","v":"功法-碎片"},3,0,0,"10;8",0,1,0,null,null,0,0,0,0,11,"12015",null,null,null,12015,{"$nulls":5},10,8,null,{"$f":"IF(AG133=\"\",\"\",VLOOKUP(AG133,[1]SkiptoConfig!$A:$H,8,FALSE))","v":"探宝"},{"$f":"IF(AH133=\"\",\"\",VLOOKUP(AH133,[1]SkiptoConfig!$A:$H,8,FALSE))","v":"主线剧情"},{"$f":"IF(AI133=\"\",\"\",VLOOKUP(AI133,[1]SkiptoConfig!$A:$H,8,FALSE))","v":""}]
[13016,1615,"烈焰剑碎片",1715,"用于主动功法烈焰剑的升星。","icon_s1401",14,{"$f":"CONCATENATE(VLOOKUP(G134,ID分段!A:B,2,FALSE),\"-\",VLOOKUP(G134,ID分段!A:C,3,FALSE))","v":"功法-碎片"},5,0,0,{"$f":"_xlfn.TEXTJOIN(\";\",1,AG134:AI134)","v":"10"},0,1,0,null,null,0,0,0,0,11,"12016",null,null,null,12016,{"$nulls":5},10,null,null,{"$f":"IF(AG134=\"\",\"\",VLOOKUP(AG134,[1]SkiptoConfig!$A:$H,8,FALSE))","v":"探宝"},{"$f":"IF(AH134=\"\",\"\",VLOOKUP(AH134,[1]SkiptoConfig!$A:$H,8,FALSE))","v":""},{"$f":"IF(AI134=\"\",\"\",VLOOKUP(AI134,[1]SkiptoConfig!$A:$H,8,FALSE))","v":""}]
[13017,1616,"赤焰龙吟功碎片",1716,"用于主动功法赤焰龙吟功的升星。","icon_s1402",14,{"$f":"CONCATENATE(VLOOKUP(G135,ID分段!A:B,2,FALSE),\"-\",VLOOKUP(G135,ID分段!A:C,3,FALSE))","v":"功法-碎片"},5,0,0,"10",0,1,0,null,null,0,0,0,0,11,"12017",null,null,null,12017,{"$nulls":5},10,null,null,{"$f":"IF(AG135=\"\",\"\",VLOOKUP(AG135,[1]SkiptoConfig!$A:$H,8,FALSE))","v":"探宝"},{"$f":"IF(AH135=\"\",\"\",VLOOKUP(AH135,[1]SkiptoConfig!$A:$H,8,FALSE))","v":""},{"$f":"IF(AI135=\"\",\"\",VLOOKUP(AI135,[1]SkiptoConfig!$A:$H,8,FALSE))","v":""}]
[13018,1617,"朱雀燎原指碎片",1717,"用于主动功法朱雀燎原指的升星。","icon_s1403",14,{"$f":"CONCATENATE(VLOOKUP(G136,ID分段!A:B,2,FALSE),\"-\",VLOOKUP(G136,ID分段!A:C,3,FALSE))","v":"功法-碎片"},5,0,0,"10",0,1,0,null,null,0,0,0,0,11,"12018",null,null,null,12018,{"$nulls":5},10,null,null,{"$f":"IF(AG136=\"\",\"\",VLOOKUP(AG136,[1]SkiptoConfig!$A:$H,8,FALSE))","v":"探宝"},{"$f":"IF(AH136=\"\",\"\",VLOOKUP(AH136,[1]SkiptoConfig!$A:$H,8,FALSE))","v":""},{"$f":"IF(AI136=\"\",\"\",VLOOKUP(AI136,[1]SkiptoConfig!$A:$H,8,FALSE))","v":""}]
[13019,1618,"火球碎片",1718,"用于主动功法火球的升星。","icon_s1404",14,{"$f":"CONCATENATE(VLOOKUP(G137,ID分段!A:B,2,FALSE),\"-\",VLOOKUP(G137,ID分段!A:C,3,FALSE))","v":"功法-碎片"},4,0,0,"10;8",0,1,0,null,null,0,0,0,0,11,"12019",null,null,null,12019,{"$nulls":5},10,8,null,{"$f":"IF(AG137=\"\",\"\",VLOOKUP(AG137,[1]SkiptoConfig!$A:$H,8,FALSE))","v":"探宝"},{"$f":"IF(AH137=\"\",\"\",VLOOKUP(AH137,[1]SkiptoConfig!$A:$H,8,FALSE))","v":"主线剧情"},{"$f":"IF(AI137=\"\",\"\",VLOOKUP(AI137,[1]SkiptoConfig!$A:$H,8,FALSE))","v":""}]
[13020,1619,"火刀碎片",1719,"用于主动功法火刀的升星。","icon_s1405",14,{"$f":"CONCATENATE(VLOOKUP(G138,ID分段!A:B,2,FALSE),\"-\",VLOOKUP(G138,ID分段!A:C,3,FALSE))","v":"功法-碎片"},3,0,0,"10;8",0,1,0,null,null,0,0,0,0,11,"12020",null,null,null,12020,{"$nulls":5},10,8,null,{"$f":"IF(AG138=\"\",\"\",VLOOKUP(AG138,[1]SkiptoConfig!$A:$H,8,FALSE))","v":"探宝"},{"$f":"IF(AH138=\"\",\"\",VLOOKUP(AH138,[1]SkiptoConfig!$A:$H,8,FALSE))","v":"主线剧情"},{"$f":"IF(AI138=\"\",\"\",VLOOKUP(AI138,[1]SkiptoConfig!$A:$H,8,FALSE))","v":""}]
[13021,1620,"黄尘灭魂刺碎片",1720,"用于主动功法黄尘灭魂刺的升星。","icon_s1501",14,{"$f":"CONCATENATE(VLOOKUP(G139,ID分段!A:B,2,FALSE),\"-\",VLOOKUP(G139,ID分段!A:C,3,FALSE))","v":"功法-碎片"},5,0,0,"10",0,1,0,null,null,0,0,0,0,11,"12021",null,null,null,12021,{"$nulls":5},10,null,null,{"$f":"IF(AG139=\"\",\"\",VLOOKUP(AG139,[1]SkiptoConfig!$A:$H,8,FALSE))","v":"探宝"},{"$f":"IF(AH139=\"\",\"\",VLOOKUP(AH139,[1]SkiptoConfig!$A:$H,8,FALSE))","v":""},{"$f":"IF(AI139=\"\",\"\",VLOOKUP(AI139,[1]SkiptoConfig!$A:$H,8,FALSE))","v":""}]
[13022,1621,"地裂屠龙斩碎片",1721,"用于主动功法地裂屠龙斩的升星。","icon_s1502",14,{"$f":"CONCATENATE(VLOOKUP(G140,ID分段!A:B,2,FALSE),\"-\",VLOOKUP(G140,ID分段!A:C,3,FALSE))","v":"功法-碎片"},5,0,0,"10",0,1,0,null,null,0,0,0,0,11,"12022",null,null,null,12022,{"$nulls":5},10,null,null,{"$f":"IF(AG140=\"\",\"\",VLOOKUP(AG140,[1]SkiptoConfig!$A:$H,8,FALSE))","v":"探宝"},{"$f":"IF(AH140=\"\",\"\",VLOOKUP(AH140,[1]SkiptoConfig!$A:$H,8,FALSE))","v":""},{"$f":"IF(AI140=\"\",\"\",VLOOKUP(AI140,[1]SkiptoConfig!$A:$H,8,FALSE))","v":""}]
[13023,1622,"功法-土3碎片",1722,"用于主动功法功法-土3的升星。","",14,{"$f":"CONCATENATE(VLOOKUP(G141,ID分段!A:B,2,FALSE),\"-\",VLOOKUP(G141,ID分段!A:C,3,FALSE))","v":"功法-碎片"},5,0,0,"10",0,1,0,null,null,0,0,0,0,11,"12023",null,null,null,12023,{"$nulls":5},10,null,null,{"$f":"IF(AG141=\"\",\"\",VLOOKUP(AG141,[1]SkiptoConfig!$A:$H,8,FALSE))","v":"探宝"},{"$f":"IF(AH141=\"\",\"\",VLOOKUP(AH141,[1]SkiptoConfig!$A:$H,8,FALSE))","v":""},{"$f":"IF(AI141=\"\",\"\",VLOOKUP(AI141,[1]SkiptoConfig!$A:$H,8,FALSE))","v":""}]
[13024,1623,"落石碎片",1723,"用于主动功法落石的升星。","icon_s1504",14,{"$f":"CONCATENATE(VLOOKUP(G142,ID分段!A:B,2,FALSE),\"-\",VLOOKUP(G142,ID分段!A:C,3,FALSE))","v":"功法-碎片"},4,0,0,"10;8",0,1,0,null,null,0,0,0,0,11,"12024",null,null,null,12024,{"$nulls":5},10,8,null,{"$f":"IF(AG142=\"\",\"\",VLOOKUP(AG142,[1]SkiptoConfig!$A:$H,8,FALSE))","v":"探宝"},{"$f":"IF(AH142=\"\",\"\",VLOOKUP(AH142,[1]SkiptoConfig!$A:$H,8,FALSE))","v":"主线剧情"},{"$f":"IF(AI142=\"\",\"\",VLOOKUP(AI142,[1]SkiptoConfig!$A:$H,8,FALSE))","v":""}]
[13025,1624,"小石头碎片",1724,"用于主动功法小石头的升星。","icon_s1505",14,{"$f":"CONCATENATE(VLOOKUP(G143,ID分段!A:B,2,FALSE),\"-\",VLOOKUP(G143,ID分段!A:C,3,FALSE))","v":"功法-碎片"},3,0,0,"10;8",0,1,0,null,null,0,0,0,0,11,"12025",null,null,null,12025,{"$nulls":5},10,8,null,{"$f":"IF(AG143=\"\",\"\",VLOOKUP(AG143,[1]SkiptoConfig!$A:$H,8,FALSE))","v":"探宝"},{"$f":"IF(AH143=\"\",\"\",VLOOKUP(AH143,[1]SkiptoConfig!$A:$H,8,FALSE))","v":"主线剧情"},{"$f":"IF(AI143=\"\",\"\",VLOOKUP(AI143,[1]SkiptoConfig!$A:$H,8,FALSE))","v":""}]
[{"$nulls":11},"",{"$nulls":23},{"$f":"IF(AG144=\"\",\"\",VLOOKUP(AG144,[1]SkiptoConfig!$A:$H,8,FALSE))","v":""},{"$f":"IF(AH144=\"\",\"\",VLOOKUP(AH144,[1]SkiptoConfig!$A:$H,8,FALSE))","v":""},{"$f":"IF(AI144=\"\",\"\",VLOOKUP(AI144,[1]SkiptoConfig!$A:$H,8,FALSE))","v":""}]
[13501,1625,{"$f":"CONCATENATE(C99,\"碎片\")","v":"天衍星辰诀碎片"},1725,"用于辅助功法天衍星辰诀的升星。",{"$f":"F99","v":"icon_s2001"},14,{"$f":"CONCATENATE(VLOOKUP(G145,ID分段!A:B,2,FALSE),\"-\",VLOOKUP(G145,ID分段!A:C,3,FALSE))","v":"功法-碎片"},3,0,0,"10;8",0,1,0,null,null,0,0,0,0,11,"12501",null,null,null,12501,{"$nulls":5},10,8,null,{"$f":"IF(AG145=\"\",\"\",VLOOKUP(AG145,[1]SkiptoConfig!$A:$H,8,FALSE))","v":"探宝"},{"$f":"IF(AH145=\"\",\"\",VLOOKUP(AH145,[1]SkiptoConfig!$A:$H,8,FALSE))","v":"主线剧情"},{"$f":"IF(AI145=\"\",\"\",VLOOKUP(AI145,[1]SkiptoConfig!$A:$H,8,FALSE))","v":""}]
[13502,1626,"法宝秘籍碎片",1726,"用于辅助功法法宝秘籍的升星。",{"$f":"F100","v":"icon_s2002"},14,{"$f":"CONCATENATE(VLOOKUP(G146,ID分段!A:B,2,FALSE),\"-\",VLOOKUP(G146,ID分段!A:C,3,FALSE))","v":"功法-碎片"},3,0,0,"10;8",0,1,0,null,null,0,0,0,0,11,"12502",null,null,null,12502,{"$nulls":5},10,8,null,{"$f":"IF(AG146=\"\",\"\",VLOOKUP(AG146,[1]SkiptoConfig!$A:$H,8,FALSE))","v":"探宝"},{"$f":"IF(AH146=\"\",\"\",VLOOKUP(AH146,[1]SkiptoConfig!$A:$H,8,FALSE))","v":"主线剧情"},{"$f":"IF(AI146=\"\",\"\",VLOOKUP(AI146,[1]SkiptoConfig!$A:$H,8,FALSE))","v":""}]
[13503,1627,"崩脉决碎片",1727,"用于辅助功法崩脉决的升星。","icon_s2003",14,{"$f":"CONCATENATE(VLOOKUP(G147,ID分段!A:B,2,FALSE),\"-\",VLOOKUP(G147,ID分段!A:C,3,FALSE))","v":"功法-碎片"},3,0,0,"10;8",0,1,0,null,null,0,0,0,0,11,"12503",null,null,null,12503,{"$nulls":5},10,8,null,{"$f":"IF(AG147=\"\",\"\",VLOOKUP(AG147,[1]SkiptoConfig!$A:$H,8,FALSE))","v":"探宝"},{"$f":"IF(AH147=\"\",\"\",VLOOKUP(AH147,[1]SkiptoConfig!$A:$H,8,FALSE))","v":"主线剧情"},{"$f":"IF(AI147=\"\",\"\",VLOOKUP(AI147,[1]SkiptoConfig!$A:$H,8,FALSE))","v":""}]
[13504,1628,"两仪决碎片",1728,"用于辅助功法两仪决的升星。","icon_s2004",14,{"$f":"CONCATENATE(VLOOKUP(G148,ID分段!A:B,2,FALSE),\"-\",VLOOKUP(G148,ID分段!A:C,3,FALSE))","v":"功法-碎片"},3,0,0,"10;8",0,1,0,null,null,0,0,0,0,11,"12504",null,null,null,12504,{"$nulls":5},10,8,null,{"$f":"IF(AG148=\"\",\"\",VLOOKUP(AG148,[1]SkiptoConfig!$A:$H,8,FALSE))","v":"探宝"},{"$f":"IF(AH148=\"\",\"\",VLOOKUP(AH148,[1]SkiptoConfig!$A:$H,8,FALSE))","v":"主线剧情"},{"$f":"IF(AI148=\"\",\"\",VLOOKUP(AI148,[1]SkiptoConfig!$A:$H,8,FALSE))","v":""}]
[13505,1629,"火焰决碎片",1729,"用于辅助功法火焰决的升星。","icon_s2005",14,{"$f":"CONCATENATE(VLOOKUP(G149,ID分段!A:B,2,FALSE),\"-\",VLOOKUP(G149,ID分段!A:C,3,FALSE))","v":"功法-碎片"},3,0,0,"10;8",0,1,0,null,null,0,0,0,0,11,"12505",null,null,null,12505,{"$nulls":5},10,8,null,{"$f":"IF(AG149=\"\",\"\",VLOOKUP(AG149,[1]SkiptoConfig!$A:$H,8,FALSE))","v":"探宝"},{"$f":"IF(AH149=\"\",\"\",VLOOKUP(AH149,[1]SkiptoConfig!$A:$H,8,FALSE))","v":"主线剧情"},{"$f":"IF(AI149=\"\",\"\",VLOOKUP(AI149,[1]SkiptoConfig!$A:$H,8,FALSE))","v":""}]
[13506,1630,"乾坤巨灵诀碎片",1730,"用于辅助功法乾坤巨灵诀的升星。","icon_s2006",14,{"$f":"CONCATENATE(VLOOKUP(G150,ID分段!A:B,2,FALSE),\"-\",VLOOKUP(G150,ID分段!A:C,3,FALSE))","v":"功法-碎片"},4,0,0,"10;8",0,1,0,null,null,0,0,0,0,11,"12506",null,null,null,12506,{"$nulls":5},10,8,null,{"$f":"IF(AG150=\"\",\"\",VLOOKUP(AG150,[1]SkiptoConfig!$A:$H,8,FALSE))","v":"探宝"},{"$f":"IF(AH150=\"\",\"\",VLOOKUP(AH150,[1]SkiptoConfig!$A:$H,8,FALSE))","v":"主线剧情"},{"$f":"IF(AI150=\"\",\"\",VLOOKUP(AI150,[1]SkiptoConfig!$A:$H,8,FALSE))","v":""}]
[13507,1631,"极速齿轮碎片",1731,"用于辅助功法极速齿轮的升星。","icon_s2007",14,{"$f":"CONCATENATE(VLOOKUP(G151,ID分段!A:B,2,FALSE),\"-\",VLOOKUP(G151,ID分段!A:C,3,FALSE))","v":"功法-碎片"},4,0,0,"10;8",0,1,0,null,null,0,0,0,0,11,"12507",null,null,null,12507,{"$nulls":5},10,8,null,{"$f":"IF(AG151=\"\",\"\",VLOOKUP(AG151,[1]SkiptoConfig!$A:$H,8,FALSE))","v":"探宝"},{"$f":"IF(AH151=\"\",\"\",VLOOKUP(AH151,[1]SkiptoConfig!$A:$H,8,FALSE))","v":"主线剧情"},{"$f":"IF(AI151=\"\",\"\",VLOOKUP(AI151,[1]SkiptoConfig!$A:$H,8,FALSE))","v":""}]
[13508,1632,"太虚剑意碎片",1732,"用于辅助功法太虚剑意的升星。","icon_s2008",14,{"$f":"CONCATENATE(VLOOKUP(G152,ID分段!A:B,2,FALSE),\"-\",VLOOKUP(G152,ID分段!A:C,3,FALSE))","v":"功法-碎片"},4,0,0,"10;8",0,1,0,null,null,0,0,0,0,11,"12508",null,null,null,12508,{"$nulls":5},10,8,null,{"$f":"IF(AG152=\"\",\"\",VLOOKUP(AG152,[1]SkiptoConfig!$A:$H,8,FALSE))","v":"探宝"},{"$f":"IF(AH152=\"\",\"\",VLOOKUP(AH152,[1]SkiptoConfig!$A:$H,8,FALSE))","v":"主线剧情"},{"$f":"IF(AI152=\"\",\"\",VLOOKUP(AI152,[1]SkiptoConfig!$A:$H,8,FALSE))","v":""}]
[13509,1633,"青莲净体诀碎片",1733,"用于辅助功法青莲净体诀的升星。","icon_s2009",14,{"$f":"CONCATENATE(VLOOKUP(G153,ID分段!A:B,2,FALSE),\"-\",VLOOKUP(G153,ID分段!A:C,3,FALSE))","v":"功法-碎片"},4,0,0,"10;8",0,1,0,null,null,0,0,0,0,11,"12509",null,null,null,12509,{"$nulls":5},10,8,null,{"$f":"IF(AG153=\"\",\"\",VLOOKUP(AG153,[1]SkiptoConfig!$A:$H,8,FALSE))","v":"探宝"},{"$f":"IF(AH153=\"\",\"\",VLOOKUP(AH153,[1]SkiptoConfig!$A:$H,8,FALSE))","v":"主线剧情"},{"$f":"IF(AI153=\"\",\"\",VLOOKUP(AI153,[1]SkiptoConfig!$A:$H,8,FALSE))","v":""}]
[13510,1634,"碧霄回春术碎片",1734,"用于辅助功法碧霄回春术的升星。","icon_s2010",14,{"$f":"CONCATENATE(VLOOKUP(G154,ID分段!A:B,2,FALSE),\"-\",VLOOKUP(G154,ID分段!A:C,3,FALSE))","v":"功法-碎片"},4,0,0,"10;8",0,1,0,null,null,0,0,0,0,11,"12510",null,null,null,12510,{"$nulls":5},10,8,null,{"$f":"IF(AG154=\"\",\"\",VLOOKUP(AG154,[1]SkiptoConfig!$A:$H,8,FALSE))","v":"探宝"},{"$f":"IF(AH154=\"\",\"\",VLOOKUP(AH154,[1]SkiptoConfig!$A:$H,8,FALSE))","v":"主线剧情"},{"$f":"IF(AI154=\"\",\"\",VLOOKUP(AI154,[1]SkiptoConfig!$A:$H,8,FALSE))","v":""}]
[13511,1635,{"$f":"CONCATENATE(C109,\"碎片\")","v":"血祭神通碎片"},1735,"用于辅助功法血祭神通的升星。","icon_s2011",14,{"$f":"CONCATENATE(VLOOKUP(G155,ID分段!A:B,2,FALSE),\"-\",VLOOKUP(G155,ID分段!A:C,3,FALSE))","v":"功法-碎片"},5,0,0,"10",0,1,0,null,null,0,0,0,0,11,"12511",null,null,null,12511,{"$nulls":5},10,null,null,{"$f":"IF(AG155=\"\",\"\",VLOOKUP(AG155,[1]SkiptoConfig!$A:$H,8,FALSE))","v":"探宝"},{"$f":"IF(AH155=\"\",\"\",VLOOKUP(AH155,[1]SkiptoConfig!$A:$H,8,FALSE))","v":""},{"$f":"IF(AI155=\"\",\"\",VLOOKUP(AI155,[1]SkiptoConfig!$A:$H,8,FALSE))","v":""}]
[13512,1636,"金煞决碎片",1736,"用于辅助功法金煞决的升星。","icon_s2012",14,{"$f":"CONCATENATE(VLOOKUP(G156,ID分段!A:B,2,FALSE),\"-\",VLOOKUP(G156,ID分段!A:C,3,FALSE))","v":"功法-碎片"},5,0,0,"10",0,1,0,null,null,0,0,0,0,11,"12512",null,null,null,12512,{"$nulls":5},10,null,null,{"$f":"IF(AG156=\"\",\"\",VLOOKUP(AG156,[1]SkiptoConfig!$A:$H,8,FALSE))","v":"探宝"},{"$f":"IF(AH156=\"\",\"\",VLOOKUP(AH156,[1]SkiptoConfig!$A:$H,8,FALSE))","v":""},{"$f":"IF(AI156=\"\",\"\",VLOOKUP(AI156,[1]SkiptoConfig!$A:$H,8,FALSE))","v":""}]
[13513,1637,"毒瘴领域碎片",1737,"用于辅助功法毒瘴领域的升星。","icon_s2013",14,{"$f":"CONCATENATE(VLOOKUP(G157,ID分段!A:B,2,FALSE),\"-\",VLOOKUP(G157,ID分段!A:C,3,FALSE))","v":"功法-碎片"},5,0,0,"10",0,1,0,null,null,0,0,0,0,11,"12513",null,null,null,12513,{"$nulls":5},10,null,null,{"$f":"IF(AG157=\"\",\"\",VLOOKUP(AG157,[1]SkiptoConfig!$A:$H,8,FALSE))","v":"探宝"},{"$f":"IF(AH157=\"\",\"\",VLOOKUP(AH157,[1]SkiptoConfig!$A:$H,8,FALSE))","v":""},{"$f":"IF(AI157=\"\",\"\",VLOOKUP(AI157,[1]SkiptoConfig!$A:$H,8,FALSE))","v":""}]
[13514,1638,"毒爆碎片",1738,"用于辅助功法毒爆的升星。","icon_s2014",14,{"$f":"CONCATENATE(VLOOKUP(G158,ID分段!A:B,2,FALSE),\"-\",VLOOKUP(G158,ID分段!A:C,3,FALSE))","v":"功法-碎片"},5,0,0,"10",0,1,0,null,null,0,0,0,0,11,"12514",null,null,null,12514,{"$nulls":5},10,null,null,{"$f":"IF(AG158=\"\",\"\",VLOOKUP(AG158,[1]SkiptoConfig!$A:$H,8,FALSE))","v":"探宝"},{"$f":"IF(AH158=\"\",\"\",VLOOKUP(AH158,[1]SkiptoConfig!$A:$H,8,FALSE))","v":""},{"$f":"IF(AI158=\"\",\"\",VLOOKUP(AI158,[1]SkiptoConfig!$A:$H,8,FALSE))","v":""}]
[13515,1639,"异常转移碎片",1739,"用于辅助功法异常转移的升星。","icon_s2015",14,{"$f":"CONCATENATE(VLOOKUP(G159,ID分段!A:B,2,FALSE),\"-\",VLOOKUP(G159,ID分段!A:C,3,FALSE))","v":"功法-碎片"},5,0,0,"10",0,1,0,null,null,0,0,0,0,11,"12515",null,null,null,12515,{"$nulls":5},10,null,null,{"$f":"IF(AG159=\"\",\"\",VLOOKUP(AG159,[1]SkiptoConfig!$A:$H,8,FALSE))","v":"探宝"},{"$f":"IF(AH159=\"\",\"\",VLOOKUP(AH159,[1]SkiptoConfig!$A:$H,8,FALSE))","v":""},{"$f":"IF(AI159=\"\",\"\",VLOOKUP(AI159,[1]SkiptoConfig!$A:$H,8,FALSE))","v":""}]
[13516,1640,"阴水碎片",1740,"用于辅助功法阴水的升星。","icon_s2016",14,{"$f":"CONCATENATE(VLOOKUP(G160,ID分段!A:B,2,FALSE),\"-\",VLOOKUP(G160,ID分段!A:C,3,FALSE))","v":"功法-碎片"},5,0,0,"10",0,1,0,null,null,0,0,0,0,11,"12516",null,null,null,12516,{"$nulls":5},10,null,null,{"$f":"IF(AG160=\"\",\"\",VLOOKUP(AG160,[1]SkiptoConfig!$A:$H,8,FALSE))","v":"探宝"},{"$f":"IF(AH160=\"\",\"\",VLOOKUP(AH160,[1]SkiptoConfig!$A:$H,8,FALSE))","v":""},{"$f":"IF(AI160=\"\",\"\",VLOOKUP(AI160,[1]SkiptoConfig!$A:$H,8,FALSE))","v":""}]
[13517,1641,"灵油碎片",1741,"用于辅助功法灵油的升星。","icon_s2017",14,{"$f":"CONCATENATE(VLOOKUP(G161,ID分段!A:B,2,FALSE),\"-\",VLOOKUP(G161,ID分段!A:C,3,FALSE))","v":"功法-碎片"},5,0,0,"10",0,1,0,null,null,0,0,0,0,11,"12517",null,null,null,12517,{"$nulls":5},10,null,null,{"$f":"IF(AG161=\"\",\"\",VLOOKUP(AG161,[1]SkiptoConfig!$A:$H,8,FALSE))","v":"探宝"},{"$f":"IF(AH161=\"\",\"\",VLOOKUP(AH161,[1]SkiptoConfig!$A:$H,8,FALSE))","v":""},{"$f":"IF(AI161=\"\",\"\",VLOOKUP(AI161,[1]SkiptoConfig!$A:$H,8,FALSE))","v":""}]
[13518,1642,"厚土护体碎片",1742,"用于辅助功法厚土护体的升星。","icon_s2018",14,{"$f":"CONCATENATE(VLOOKUP(G162,ID分段!A:B,2,FALSE),\"-\",VLOOKUP(G162,ID分段!A:C,3,FALSE))","v":"功法-碎片"},5,0,0,"10",0,1,0,null,null,0,0,0,0,11,"12518",null,null,null,12518,{"$nulls":5},10,null,null,{"$f":"IF(AG162=\"\",\"\",VLOOKUP(AG162,[1]SkiptoConfig!$A:$H,8,FALSE))","v":"探宝"},{"$f":"IF(AH162=\"\",\"\",VLOOKUP(AH162,[1]SkiptoConfig!$A:$H,8,FALSE))","v":""},{"$f":"IF(AI162=\"\",\"\",VLOOKUP(AI162,[1]SkiptoConfig!$A:$H,8,FALSE))","v":""}]
[13519,1643,"金沙碎片",1743,"用于辅助功法金沙的升星。","icon_s2019",14,{"$f":"CONCATENATE(VLOOKUP(G163,ID分段!A:B,2,FALSE),\"-\",VLOOKUP(G163,ID分段!A:C,3,FALSE))","v":"功法-碎片"},5,0,0,"10",0,1,0,null,null,0,0,0,0,11,"12519",null,null,null,12519,{"$nulls":5},10,null,null,{"$f":"IF(AG163=\"\",\"\",VLOOKUP(AG163,[1]SkiptoConfig!$A:$H,8,FALSE))","v":"探宝"},{"$f":"IF(AH163=\"\",\"\",VLOOKUP(AH163,[1]SkiptoConfig!$A:$H,8,FALSE))","v":""},{"$f":"IF(AI163=\"\",\"\",VLOOKUP(AI163,[1]SkiptoConfig!$A:$H,8,FALSE))","v":""}]
[{"$nulls":11},"",{"$nulls":23},{"$f":"IF(AG164=\"\",\"\",VLOOKUP(AG164,[1]SkiptoConfig!$A:$H,8,FALSE))","v":""},{"$f":"IF(AH164=\"\",\"\",VLOOKUP(AH164,[1]SkiptoConfig!$A:$H,8,FALSE))","v":""},{"$f":"IF(AI164=\"\",\"\",VLOOKUP(AI164,[1]SkiptoConfig!$A:$H,8,FALSE))","v":""}]
[20001,3013,"樗木之灵的树枝",3015,"任务道具",{"$f":"\"icon_item_\"&A165","v":"icon_item_20001"},21,{"$f":"CONCATENATE(VLOOKUP(G165,ID分段!A:B,2,FALSE),\"-\",VLOOKUP(G165,ID分段!A:C,3,FALSE))","v":"道具-任务道具"},2,0,0,"8",0,1,0,null,null,0,0,0,0,{"$nulls":11},8,null,null,{"$f":"IF(AG165=\"\",\"\",VLOOKUP(AG165,[1]SkiptoConfig!$A:$H,8,FALSE))","v":"主线剧情"},{"$f":"IF(AH165=\"\",\"\",VLOOKUP(AH165,[1]SkiptoConfig!$A:$H,8,FALSE))","v":""},{"$f":"IF(AI165=\"\",\"\",VLOOKUP(AI165,[1]SkiptoConfig!$A:$H,8,FALSE))","v":""}]
[20002,3014,"飞天灵兽的翅膀",3016,"任务道具",{"$f":"\"icon_item_\"&A166","v":"icon_item_20002"},21,{"$f":"CONCATENATE(VLOOKUP(G166,ID分段!A:B,2,FALSE),\"-\",VLOOKUP(G166,ID分段!A:C,3,FALSE))","v":"道具-任务道具"},2,0,0,"8",0,1,0,null,null,0,0,0,0,{"$nulls":11},8,null,null,{"$f":"IF(AG166=\"\",\"\",VLOOKUP(AG166,[1]SkiptoConfig!$A:$H,8,FALSE))","v":"主线剧情"},{"$f":"IF(AH166=\"\",\"\",VLOOKUP(AH166,[1]SkiptoConfig!$A:$H,8,FALSE))","v":""},{"$f":"IF(AI166=\"\",\"\",VLOOKUP(AI166,[1]SkiptoConfig!$A:$H,8,FALSE))","v":""}]
[20003,3183,"灵草种子",3184,"任务道具",{"$f":"\"icon_item_\"&A167","v":"icon_item_20003"},21,{"$f":"CONCATENATE(VLOOKUP(G167,ID分段!A:B,2,FALSE),\"-\",VLOOKUP(G167,ID分段!A:C,3,FALSE))","v":"道具-任务道具"},2,0,0,"8",0,1,0,null,null,0,0,0,0,{"$nulls":11},8,null,null,{"$f":"IF(AG167=\"\",\"\",VLOOKUP(AG167,[1]SkiptoConfig!$A:$H,8,FALSE))","v":"主线剧情"},{"$f":"IF(AH167=\"\",\"\",VLOOKUP(AH167,[1]SkiptoConfig!$A:$H,8,FALSE))","v":""},{"$f":"IF(AI167=\"\",\"\",VLOOKUP(AI167,[1]SkiptoConfig!$A:$H,8,FALSE))","v":""}]
[20004,10019,"甘露",10028,"任务道具",{"$f":"\"icon_item_\"&A168","v":"icon_item_20004"},21,{"$f":"CONCATENATE(VLOOKUP(G168,ID分段!A:B,2,FALSE),\"-\",VLOOKUP(G168,ID分段!A:C,3,FALSE))","v":"道具-任务道具"},2,0,0,"8",0,1,0,null,null,0,0,0,0,{"$nulls":11},8,null,null,{"$f":"IF(AG168=\"\",\"\",VLOOKUP(AG168,[1]SkiptoConfig!$A:$H,8,FALSE))","v":"主线剧情"},{"$f":"IF(AH168=\"\",\"\",VLOOKUP(AH168,[1]SkiptoConfig!$A:$H,8,FALSE))","v":""},{"$f":"IF(AI168=\"\",\"\",VLOOKUP(AI168,[1]SkiptoConfig!$A:$H,8,FALSE))","v":""}]
[20005,10020,"风铃",10029,"任务道具",{"$f":"\"icon_item_\"&A169","v":"icon_item_20005"},21,{"$f":"CONCATENATE(VLOOKUP(G169,ID分段!A:B,2,FALSE),\"-\",VLOOKUP(G169,ID分段!A:C,3,FALSE))","v":"道具-任务道具"},2,0,0,"8",0,1,0,null,null,0,0,0,0,{"$nulls":11},8,null,null,{"$f":"IF(AG169=\"\",\"\",VLOOKUP(AG169,[1]SkiptoConfig!$A:$H,8,FALSE))","v":"主线剧情"},{"$f":"IF(AH169=\"\",\"\",VLOOKUP(AH169,[1]SkiptoConfig!$A:$H,8,FALSE))","v":""},{"$f":"IF(AI169=\"\",\"\",VLOOKUP(AI169,[1]SkiptoConfig!$A:$H,8,FALSE))","v":""}]
[20006,10021,"风灵碎片",10030,"任务道具",{"$f":"\"icon_item_\"&A170","v":"icon_item_20006"},21,{"$f":"CONCATENATE(VLOOKUP(G170,ID分段!A:B,2,FALSE),\"-\",VLOOKUP(G170,ID分段!A:C,3,FALSE))","v":"道具-任务道具"},2,0,0,"8",0,1,0,null,null,0,0,0,0,{"$nulls":11},8,null,null,{"$f":"IF(AG170=\"\",\"\",VLOOKUP(AG170,[1]SkiptoConfig!$A:$H,8,FALSE))","v":"主线剧情"},{"$f":"IF(AH170=\"\",\"\",VLOOKUP(AH170,[1]SkiptoConfig!$A:$H,8,FALSE))","v":""},{"$f":"IF(AI170=\"\",\"\",VLOOKUP(AI170,[1]SkiptoConfig!$A:$H,8,FALSE))","v":""}]
[20007,10022,"浮岛灵石",10031,"任务道具",{"$f":"\"icon_item_\"&A171","v":"icon_item_20007"},21,{"$f":"CONCATENATE(VLOOKUP(G171,ID分段!A:B,2,FALSE),\"-\",VLOOKUP(G171,ID分段!A:C,3,FALSE))","v":"道具-任务道具"},2,0,0,"8",0,1,0,null,null,0,0,0,0,{"$nulls":11},8,null,null,{"$f":"IF(AG171=\"\",\"\",VLOOKUP(AG171,[1]SkiptoConfig!$A:$H,8,FALSE))","v":"主线剧情"},{"$f":"IF(AH171=\"\",\"\",VLOOKUP(AH171,[1]SkiptoConfig!$A:$H,8,FALSE))","v":""},{"$f":"IF(AI171=\"\",\"\",VLOOKUP(AI171,[1]SkiptoConfig!$A:$H,8,FALSE))","v":""}]
[20008,10023,"云隐宗长老密信",10032,"任务道具",{"$f":"\"icon_item_\"&A172","v":"icon_item_20008"},21,{"$f":"CONCATENATE(VLOOKUP(G172,ID分段!A:B,2,FALSE),\"-\",VLOOKUP(G172,ID分段!A:C,3,FALSE))","v":"道具-任务道具"},2,0,0,"8",0,1,0,null,null,0,0,0,0,{"$nulls":11},8,null,null,{"$f":"IF(AG172=\"\",\"\",VLOOKUP(AG172,[1]SkiptoConfig!$A:$H,8,FALSE))","v":"主线剧情"},{"$f":"IF(AH172=\"\",\"\",VLOOKUP(AH172,[1]SkiptoConfig!$A:$H,8,FALSE))","v":""},{"$f":"IF(AI172=\"\",\"\",VLOOKUP(AI172,[1]SkiptoConfig!$A:$H,8,FALSE))","v":""}]
[20009,10024,"尧都玉佩",10033,"任务道具",{"$f":"\"icon_item_\"&A173","v":"icon_item_20009"},21,{"$f":"CONCATENATE(VLOOKUP(G173,ID分段!A:B,2,FALSE),\"-\",VLOOKUP(G173,ID分段!A:C,3,FALSE))","v":"道具-任务道具"},2,0,0,"8",0,1,0,null,null,0,0,0,0,{"$nulls":11},8,null,null,{"$f":"IF(AG173=\"\",\"\",VLOOKUP(AG173,[1]SkiptoConfig!$A:$H,8,FALSE))","v":"主线剧情"},{"$f":"IF(AH173=\"\",\"\",VLOOKUP(AH173,[1]SkiptoConfig!$A:$H,8,FALSE))","v":""},{"$f":"IF(AI173=\"\",\"\",VLOOKUP(AI173,[1]SkiptoConfig!$A:$H,8,FALSE))","v":""}]
[20010,10025,"山野灵草",10034,"任务道具",{"$f":"\"icon_item_\"&A174","v":"icon_item_20010"},21,{"$f":"CONCATENATE(VLOOKUP(G174,ID分段!A:B,2,FALSE),\"-\",VLOOKUP(G174,ID分段!A:C,3,FALSE))","v":"道具-任务道具"},2,0,0,"8",0,1,0,null,null,0,0,0,0,{"$nulls":11},8,null,null,{"$f":"IF(AG174=\"\",\"\",VLOOKUP(AG174,[1]SkiptoConfig!$A:$H,8,FALSE))","v":"主线剧情"},{"$f":"IF(AH174=\"\",\"\",VLOOKUP(AH174,[1]SkiptoConfig!$A:$H,8,FALSE))","v":""},{"$f":"IF(AI174=\"\",\"\",VLOOKUP(AI174,[1]SkiptoConfig!$A:$H,8,FALSE))","v":""}]
[20011,10026,"秘境种子",10035,"任务道具",{"$f":"\"icon_item_\"&A175","v":"icon_item_20011"},21,{"$f":"CONCATENATE(VLOOKUP(G175,ID分段!A:B,2,FALSE),\"-\",VLOOKUP(G175,ID分段!A:C,3,FALSE))","v":"道具-任务道具"},2,0,0,"8",0,1,0,null,null,0,0,0,0,{"$nulls":11},8,null,null,{"$f":"IF(AG175=\"\",\"\",VLOOKUP(AG175,[1]SkiptoConfig!$A:$H,8,FALSE))","v":"主线剧情"},{"$f":"IF(AH175=\"\",\"\",VLOOKUP(AH175,[1]SkiptoConfig!$A:$H,8,FALSE))","v":""},{"$f":"IF(AI175=\"\",\"\",VLOOKUP(AI175,[1]SkiptoConfig!$A:$H,8,FALSE))","v":""}]
[20012,10027,"甜蜜果实",10036,"任务道具",{"$f":"\"icon_item_\"&A176","v":"icon_item_20012"},21,{"$f":"CONCATENATE(VLOOKUP(G176,ID分段!A:B,2,FALSE),\"-\",VLOOKUP(G176,ID分段!A:C,3,FALSE))","v":"道具-任务道具"},2,0,0,"12",0,1,0,null,null,0,0,0,0,{"$nulls":11},12,null,null,{"$f":"IF(AG176=\"\",\"\",VLOOKUP(AG176,[1]SkiptoConfig!$A:$H,8,FALSE))","v":"支线剧情"},{"$f":"IF(AH176=\"\",\"\",VLOOKUP(AH176,[1]SkiptoConfig!$A:$H,8,FALSE))","v":""},{"$f":"IF(AI176=\"\",\"\",VLOOKUP(AI176,[1]SkiptoConfig!$A:$H,8,FALSE))","v":""}]
[20013,10298,"幽魂石",10300,"任务道具","icon_item_20013",21,{"$f":"CONCATENATE(VLOOKUP(G177,ID分段!A:B,2,FALSE),\"-\",VLOOKUP(G177,ID分段!A:C,3,FALSE))","v":"道具-任务道具"},2,0,0,"12",0,1,0,null,null,0,0,0,0,{"$nulls":11},12,null,null,{"$f":"IF(AG177=\"\",\"\",VLOOKUP(AG177,[1]SkiptoConfig!$A:$H,8,FALSE))","v":"支线剧情"},{"$f":"IF(AH177=\"\",\"\",VLOOKUP(AH177,[1]SkiptoConfig!$A:$H,8,FALSE))","v":""},{"$f":"IF(AI177=\"\",\"\",VLOOKUP(AI177,[1]SkiptoConfig!$A:$H,8,FALSE))","v":""}]
[20014,10299,"云雾秘钥",10301,"任务道具",{"$f":"\"icon_item_\"&A178","v":"icon_item_20014"},21,{"$f":"CONCATENATE(VLOOKUP(G178,ID分段!A:B,2,FALSE),\"-\",VLOOKUP(G178,ID分段!A:C,3,FALSE))","v":"道具-任务道具"},2,0,0,{"$f":"_xlfn.TEXTJOIN(\";\",1,AG178:AI178)","v":"12"},0,1,0,null,null,0,0,0,0,{"$nulls":11},12,null,null,{"$f":"IF(AG178=\"\",\"\",VLOOKUP(AG178,[1]SkiptoConfig!$A:$H,8,FALSE))","v":"支线剧情"},{"$f":"IF(AH178=\"\",\"\",VLOOKUP(AH178,[1]SkiptoConfig!$A:$H,8,FALSE))","v":""},{"$f":"IF(AI178=\"\",\"\",VLOOKUP(AI178,[1]SkiptoConfig!$A:$H,8,FALSE))","v":""}]
[{"$nulls":11},"",{"$nulls":23},{"$f":"IF(AG179=\"\",\"\",VLOOKUP(AG179,[1]SkiptoConfig!$A:$H,8,FALSE))","v":""},{"$f":"IF(AH179=\"\",\"\",VLOOKUP(AH179,[1]SkiptoConfig!$A:$H,8,FALSE))","v":""},{"$f":"IF(AI179=\"\",\"\",VLOOKUP(AI179,[1]SkiptoConfig!$A:$H,8,FALSE))","v":""}]
[21001,3194,"灵石神识符",3207,"探索神识时，指定获得大量灵石作为奖励。","icon_Coin",22,{"$f":"CONCATENATE(VLOOKUP(G180,ID分段!A:B,2,FALSE),\"-\",VLOOKUP(G180,ID分段!A:C,3,FALSE))","v":"道具-神识道符"},3,0,0,"11",0,1,0,null,null,0,0,0,0,7,1,{"$nulls":9},11,null,null,{"$f":"IF(AG180=\"\",\"\",VLOOKUP(AG180,[1]SkiptoConfig!$A:$H,8,FALSE))","v":"岁酬"},{"$f":"IF(AH180=\"\",\"\",VLOOKUP(AH180,[1]SkiptoConfig!$A:$H,8,FALSE))","v":""},{"$f":"IF(AI180=\"\",\"\",VLOOKUP(AI180,[1]SkiptoConfig!$A:$H,8,FALSE))","v":""}]
[21002,3195,"修为神识符",3208,"探索神识时，指定获得大量修为作为奖励。","icon_Gem_Star_Blue",22,{"$f":"CONCATENATE(VLOOKUP(G181,ID分段!A:B,2,FALSE),\"-\",VLOOKUP(G181,ID分段!A:C,3,FALSE))","v":"道具-神识道符"},3,0,0,"",0,1,0,null,null,0,0,0,0,7,2,{"$nulls":12},{"$f":"IF(AG181=\"\",\"\",VLOOKUP(AG181,[1]SkiptoConfig!$A:$H,8,FALSE))","v":""},{"$f":"IF(AH181=\"\",\"\",VLOOKUP(AH181,[1]SkiptoConfig!$A:$H,8,FALSE))","v":""},{"$f":"IF(AI181=\"\",\"\",VLOOKUP(AI181,[1]SkiptoConfig!$A:$H,8,FALSE))","v":""}]
[21003,3196,"灵气神识符",3209,"探索神识时，指定获得大量灵气作为奖励。","icon_GradeBadge_Master",22,{"$f":"CONCATENATE(VLOOKUP(G182,ID分段!A:B,2,FALSE),\"-\",VLOOKUP(G182,ID分段!A:C,3,FALSE))","v":"道具-神识道符"},3,0,0,"11",0,1,0,null,null,0,0,0,0,7,3,{"$nulls":9},11,null,null,{"$f":"IF(AG182=\"\",\"\",VLOOKUP(AG182,[1]SkiptoConfig!$A:$H,8,FALSE))","v":"岁酬"},{"$f":"IF(AH182=\"\",\"\",VLOOKUP(AH182,[1]SkiptoConfig!$A:$H,8,FALSE))","v":""},{"$f":"IF(AI182=\"\",\"\",VLOOKUP(AI182,[1]SkiptoConfig!$A:$H,8,FALSE))","v":""}]
[21004,3197,"玄晶神识符",3210,"探索神识时，指定获得大量玄晶作为奖励。","icon_GradeBadge_Challenger",22,{"$f":"CONCATENATE(VLOOKUP(G183,ID分段!A:B,2,FALSE),\"-\",VLOOKUP(G183,ID分段!A:C,3,FALSE))","v":"道具-神识道符"},3,0,0,"11",0,1,0,null,null,0,0,0,0,7,4,{"$nulls":9},11,null,null,{"$f":"IF(AG183=\"\",\"\",VLOOKUP(AG183,[1]SkiptoConfig!$A:$H,8,FALSE))","v":"岁酬"},{"$f":"IF(AH183=\"\",\"\",VLOOKUP(AH183,[1]SkiptoConfig!$A:$H,8,FALSE))","v":""},{"$f":"IF(AI183=\"\",\"\",VLOOKUP(AI183,[1]SkiptoConfig!$A:$H,8,FALSE))","v":""}]
[21005,3198,"功法神识符",3211,"探索神识时，指定获得大量功法碎片作为奖励。",{"$f":"\"icon_item_\"&A184","v":"icon_item_21005"},22,{"$f":"CONCATENATE(VLOOKUP(G184,ID分段!A:B,2,FALSE),\"-\",VLOOKUP(G184,ID分段!A:C,3,FALSE))","v":"道具-神识道符"},3,0,0,"11",0,1,0,null,null,0,0,0,0,7,5,{"$nulls":9},11,null,null,{"$f":"IF(AG184=\"\",\"\",VLOOKUP(AG184,[1]SkiptoConfig!$A:$H,8,FALSE))","v":"岁酬"},{"$f":"IF(AH184=\"\",\"\",VLOOKUP(AH184,[1]SkiptoConfig!$A:$H,8,FALSE))","v":""},{"$f":"IF(AI184=\"\",\"\",VLOOKUP(AI184,[1]SkiptoConfig!$A:$H,8,FALSE))","v":""}]
[21006,3199,"法宝神识符",3212,"探索神识时，指定获得大量法宝碎片作为奖励。","icon_item_21006",22,{"$f":"CONCATENATE(VLOOKUP(G185,ID分段!A:B,2,FALSE),\"-\",VLOOKUP(G185,ID分段!A:C,3,FALSE))","v":"道具-神识道符"},3,0,0,"11",0,1,0,null,null,0,0,0,0,7,6,{"$nulls":9},11,null,null,{"$f":"IF(AG185=\"\",\"\",VLOOKUP(AG185,[1]SkiptoConfig!$A:$H,8,FALSE))","v":"岁酬"},{"$f":"IF(AH185=\"\",\"\",VLOOKUP(AH185,[1]SkiptoConfig!$A:$H,8,FALSE))","v":""},{"$f":"IF(AI185=\"\",\"\",VLOOKUP(AI185,[1]SkiptoConfig!$A:$H,8,FALSE))","v":""}]
[21007,3200,"修为神识符",3213,"探索神识时，指定获得大量修为作为奖励。","icon_item_21007",22,{"$f":"CONCATENATE(VLOOKUP(G186,ID分段!A:B,2,FALSE),\"-\",VLOOKUP(G186,ID分段!A:C,3,FALSE))","v":"道具-神识道符"},3,0,0,"",0,1,0,null,null,0,0,0,0,7,7,{"$nulls":12},{"$f":"IF(AG186=\"\",\"\",VLOOKUP(AG186,[1]SkiptoConfig!$A:$H,8,FALSE))","v":""},{"$f":"IF(AH186=\"\",\"\",VLOOKUP(AH186,[1]SkiptoConfig!$A:$H,8,FALSE))","v":""},{"$f":"IF(AI186=\"\",\"\",VLOOKUP(AI186,[1]SkiptoConfig!$A:$H,8,FALSE))","v":""}]
[21008,3201,"天地神识符",3214,"探索神识时，指定获得大量天材地宝作为奖励。","icon_item_21008",22,{"$f":"CONCATENATE(VLOOKUP(G187,ID分段!A:B,2,FALSE),\"-\",VLOOKUP(G187,ID分段!A:C,3,FALSE))","v":"道具-神识道符"},3,0,0,"",0,1,0,null,null,0,0,0,0,7,8,{"$nulls":12},{"$f":"IF(AG187=\"\",\"\",VLOOKUP(AG187,[1]SkiptoConfig!$A:$H,8,FALSE))","v":""},{"$f":"IF(AH187=\"\",\"\",VLOOKUP(AH187,[1]SkiptoConfig!$A:$H,8,FALSE))","v":""},{"$f":"IF(AI187=\"\",\"\",VLOOKUP(AI187,[1]SkiptoConfig!$A:$H,8,FALSE))","v":""}]
[21009,3202,"渡劫神识符",3215,"探索神识时，指定获得大量渡劫丹作为奖励。","icon_item_21009",22,{"$f":"CONCATENATE(VLOOKUP(G188,ID分段!A:B,2,FALSE),\"-\",VLOOKUP(G188,ID分段!A:C,3,FALSE))","v":"道具-神识道符"},3,0,0,"",0,1,0,null,null,0,0,0,0,7,9,{"$nulls":12},{"$f":"IF(AG188=\"\",\"\",VLOOKUP(AG188,[1]SkiptoConfig!$A:$H,8,FALSE))","v":""},{"$f":"IF(AH188=\"\",\"\",VLOOKUP(AH188,[1]SkiptoConfig!$A:$H,8,FALSE))","v":""},{"$f":"IF(AI188=\"\",\"\",VLOOKUP(AI188,[1]SkiptoConfig!$A:$H,8,FALSE))","v":""}]
[21010,3203,"好感神识符",3216,"探索神识时，指定获得大量好感度礼物作为奖励。","icon_item_21010",22,{"$f":"CONCATENATE(VLOOKUP(G189,ID分段!A:B,2,FALSE),\"-\",VLOOKUP(G189,ID分段!A:C,3,FALSE))","v":"道具-神识道符"},3,0,0,"",0,1,0,null,null,0,0,0,0,7,10,{"$nulls":12},{"$f":"IF(AG189=\"\",\"\",VLOOKUP(AG189,[1]SkiptoConfig!$A:$H,8,FALSE))","v":""},{"$f":"IF(AH189=\"\",\"\",VLOOKUP(AH189,[1]SkiptoConfig!$A:$H,8,FALSE))","v":""},{"$f":"IF(AI189=\"\",\"\",VLOOKUP(AI189,[1]SkiptoConfig!$A:$H,8,FALSE))","v":""}]
[21011,3204,"心情神识符",3217,"探索神识时，指定获得大量心情礼物作为奖励。",{"$f":"\"icon_item_\"&A190","v":"icon_item_21011"},22,{"$f":"CONCATENATE(VLOOKUP(G190,ID分段!A:B,2,FALSE),\"-\",VLOOKUP(G190,ID分段!A:C,3,FALSE))","v":"道具-神识道符"},3,0,0,"",0,1,0,null,null,0,0,0,0,7,11,{"$nulls":12},{"$f":"IF(AG190=\"\",\"\",VLOOKUP(AG190,[1]SkiptoConfig!$A:$H,8,FALSE))","v":""},{"$f":"IF(AH190=\"\",\"\",VLOOKUP(AH190,[1]SkiptoConfig!$A:$H,8,FALSE))","v":""},{"$f":"IF(AI190=\"\",\"\",VLOOKUP(AI190,[1]SkiptoConfig!$A:$H,8,FALSE))","v":""}]
[21012,3205,"紫色神识符",3218,"探索神识时，大幅提升紫色品质神识的出现概率。","icon_shenshitishengfu2",22,{"$f":"CONCATENATE(VLOOKUP(G191,ID分段!A:B,2,FALSE),\"-\",VLOOKUP(G191,ID分段!A:C,3,FALSE))","v":"道具-神识道符"},4,0,0,"14",0,1,0,null,null,0,0,0,0,6,"4;1000000",{"$nulls":9},14,null,null,{"$f":"IF(AG191=\"\",\"\",VLOOKUP(AG191,[1]SkiptoConfig!$A:$H,8,FALSE))","v":"命运峰"},{"$f":"IF(AH191=\"\",\"\",VLOOKUP(AH191,[1]SkiptoConfig!$A:$H,8,FALSE))","v":""},{"$f":"IF(AI191=\"\",\"\",VLOOKUP(AI191,[1]SkiptoConfig!$A:$H,8,FALSE))","v":""}]
[21013,3206,"橙色神识符",3219,"探索神识时，大幅提升橙色品质神识的出现概率。","icon_shenshitishengfu3",22,{"$f":"CONCATENATE(VLOOKUP(G192,ID分段!A:B,2,FALSE),\"-\",VLOOKUP(G192,ID分段!A:C,3,FALSE))","v":"道具-神识道符"},5,0,0,"9",0,1,0,null,null,0,0,0,0,6,"5;1000000",{"$nulls":9},9,null,null,{"$f":"IF(AG192=\"\",\"\",VLOOKUP(AG192,[1]SkiptoConfig!$A:$H,8,FALSE))","v":"白嫖氪金-新手礼包"},{"$f":"IF(AH192=\"\",\"\",VLOOKUP(AH192,[1]SkiptoConfig!$A:$H,8,FALSE))","v":""},{"$f":"IF(AI192=\"\",\"\",VLOOKUP(AI192,[1]SkiptoConfig!$A:$H,8,FALSE))","v":""}]
[{"$nulls":11},"",{"$nulls":23},{"$f":"IF(AG193=\"\",\"\",VLOOKUP(AG193,[1]SkiptoConfig!$A:$H,8,FALSE))","v":""},{"$f":"IF(AH193=\"\",\"\",VLOOKUP(AH193,[1]SkiptoConfig!$A:$H,8,FALSE))","v":""},{"$f":"IF(AI193=\"\",\"\",VLOOKUP(AI193,[1]SkiptoConfig!$A:$H,8,FALSE))","v":""}]
[22001,3243,"主感悟点1",3250,{"$f":"CONCATENATE(\"道具描述_\",C194)","v":"道具描述_主感悟点1"},{"$f":"\"icon_item_\"&A194","v":"icon_item_22001"},23,{"$f":"CONCATENATE(VLOOKUP(G194,ID分段!A:B,2,FALSE),\"-\",VLOOKUP(G194,ID分段!A:C,3,FALSE))","v":"道具-感悟点"},5,0,0,"8",0,1,0,null,null,0,0,0,0,{"$nulls":11},8,null,null,{"$f":"IF(AG194=\"\",\"\",VLOOKUP(AG194,[1]SkiptoConfig!$A:$H,8,FALSE))","v":"主线剧情"},{"$f":"IF(AH194=\"\",\"\",VLOOKUP(AH194,[1]SkiptoConfig!$A:$H,8,FALSE))","v":""},{"$f":"IF(AI194=\"\",\"\",VLOOKUP(AI194,[1]SkiptoConfig!$A:$H,8,FALSE))","v":""}]
[22002,3244,"主感悟点2",3251,{"$f":"CONCATENATE(\"道具描述_\",C195)","v":"道具描述_主感悟点2"},"icon_item_22002",23,{"$f":"CONCATENATE(VLOOKUP(G195,ID分段!A:B,2,FALSE),\"-\",VLOOKUP(G195,ID分段!A:C,3,FALSE))","v":"道具-感悟点"},5,0,0,"8",0,1,0,null,null,0,0,0,0,{"$nulls":11},8,null,null,{"$f":"IF(AG195=\"\",\"\",VLOOKUP(AG195,[1]SkiptoConfig!$A:$H,8,FALSE))","v":"主线剧情"},{"$f":"IF(AH195=\"\",\"\",VLOOKUP(AH195,[1]SkiptoConfig!$A:$H,8,FALSE))","v":""},{"$f":"IF(AI195=\"\",\"\",VLOOKUP(AI195,[1]SkiptoConfig!$A:$H,8,FALSE))","v":""}]
[22003,3245,"主感悟点3",3252,"道具描述_主感悟点3","icon_item_22003",23,{"$f":"CONCATENATE(VLOOKUP(G196,ID分段!A:B,2,FALSE),\"-\",VLOOKUP(G196,ID分段!A:C,3,FALSE))","v":"道具-感悟点"},5,0,0,"8",0,1,0,null,null,0,0,0,0,{"$nulls":11},8,null,null,{"$f":"IF(AG196=\"\",\"\",VLOOKUP(AG196,[1]SkiptoConfig!$A:$H,8,FALSE))","v":"主线剧情"},{"$f":"IF(AH196=\"\",\"\",VLOOKUP(AH196,[1]SkiptoConfig!$A:$H,8,FALSE))","v":""},{"$f":"IF(AI196=\"\",\"\",VLOOKUP(AI196,[1]SkiptoConfig!$A:$H,8,FALSE))","v":""}]
[22004,3246,"主感悟点4",3253,"道具描述_主感悟点4","icon_item_22004",23,{"$f":"CONCATENATE(VLOOKUP(G197,ID分段!A:B,2,FALSE),\"-\",VLOOKUP(G197,ID分段!A:C,3,FALSE))","v":"道具-感悟点"},5,0,0,"8",0,1,0,null,null,0,0,0,0,{"$nulls":11},8,null,null,{"$f":"IF(AG197=\"\",\"\",VLOOKUP(AG197,[1]SkiptoConfig!$A:$H,8,FALSE))","v":"主线剧情"},{"$f":"IF(AH197=\"\",\"\",VLOOKUP(AH197,[1]SkiptoConfig!$A:$H,8,FALSE))","v":""},{"$f":"IF(AI197=\"\",\"\",VLOOKUP(AI197,[1]SkiptoConfig!$A:$H,8,FALSE))","v":""}]
[22005,3247,"主感悟点5",3254,"道具描述_主感悟点5","icon_item_22005",23,{"$f":"CONCATENATE(VLOOKUP(G198,ID分段!A:B,2,FALSE),\"-\",VLOOKUP(G198,ID分段!A:C,3,FALSE))","v":"道具-感悟点"},5,0,0,"8",0,1,0,null,null,0,0,0,0,{"$nulls":11},8,null,null,{"$f":"IF(AG198=\"\",\"\",VLOOKUP(AG198,[1]SkiptoConfig!$A:$H,8,FALSE))","v":"主线剧情"},{"$f":"IF(AH198=\"\",\"\",VLOOKUP(AH198,[1]SkiptoConfig!$A:$H,8,FALSE))","v":""},{"$f":"IF(AI198=\"\",\"\",VLOOKUP(AI198,[1]SkiptoConfig!$A:$H,8,FALSE))","v":""}]
[22006,3248,"主感悟点6",3255,"道具描述_主感悟点6","icon_item_22006",23,{"$f":"CONCATENATE(VLOOKUP(G199,ID分段!A:B,2,FALSE),\"-\",VLOOKUP(G199,ID分段!A:C,3,FALSE))","v":"道具-感悟点"},5,0,0,"8",0,1,0,null,null,0,0,0,0,{"$nulls":11},8,null,null,{"$f":"IF(AG199=\"\",\"\",VLOOKUP(AG199,[1]SkiptoConfig!$A:$H,8,FALSE))","v":"主线剧情"},{"$f":"IF(AH199=\"\",\"\",VLOOKUP(AH199,[1]SkiptoConfig!$A:$H,8,FALSE))","v":""},{"$f":"IF(AI199=\"\",\"\",VLOOKUP(AI199,[1]SkiptoConfig!$A:$H,8,FALSE))","v":""}]
[22007,3249,"主感悟点7",3256,"道具描述_主感悟点7","icon_item_22007",23,{"$f":"CONCATENATE(VLOOKUP(G200,ID分段!A:B,2,FALSE),\"-\",VLOOKUP(G200,ID分段!A:C,3,FALSE))","v":"道具-感悟点"},5,0,0,{"$f":"_xlfn.TEXTJOIN(\";\",1,AG200:AI200)","v":"8"},0,1,0,null,null,0,0,0,0,{"$nulls":11},8,null,null,{"$f":"IF(AG200=\"\",\"\",VLOOKUP(AG200,[1]SkiptoConfig!$A:$H,8,FALSE))","v":"主线剧情"},{"$f":"IF(AH200=\"\",\"\",VLOOKUP(AH200,[1]SkiptoConfig!$A:$H,8,FALSE))","v":""},{"$f":"IF(AI200=\"\",\"\",VLOOKUP(AI200,[1]SkiptoConfig!$A:$H,8,FALSE))","v":""}]
[{"$nulls":11},"",{"$nulls":23},{"$f":"IF(AG201=\"\",\"\",VLOOKUP(AG201,[1]SkiptoConfig!$A:$H,8,FALSE))","v":""},{"$f":"IF(AH201=\"\",\"\",VLOOKUP(AH201,[1]SkiptoConfig!$A:$H,8,FALSE))","v":""},{"$f":"IF(AI201=\"\",\"\",VLOOKUP(AI201,[1]SkiptoConfig!$A:$H,8,FALSE))","v":""}]
[22008,2079,"支线感悟点1",10291,{"$f":"CONCATENATE(\"道具描述_\",C202)","v":"道具描述_支线感悟点1"},{"$f":"\"icon_item_\"&A202","v":"icon_item_22008"},23,{"$f":"CONCATENATE(VLOOKUP(G202,ID分段!A:B,2,FALSE),\"-\",VLOOKUP(G202,ID分段!A:C,3,FALSE))","v":"道具-感悟点"},4,0,0,"12",0,1,0,null,null,0,0,0,0,{"$nulls":11},12,null,null,{"$f":"IF(AG202=\"\",\"\",VLOOKUP(AG202,[1]SkiptoConfig!$A:$H,8,FALSE))","v":"支线剧情"},{"$f":"IF(AH202=\"\",\"\",VLOOKUP(AH202,[1]SkiptoConfig!$A:$H,8,FALSE))","v":""},{"$f":"IF(AI202=\"\",\"\",VLOOKUP(AI202,[1]SkiptoConfig!$A:$H,8,FALSE))","v":""}]
[22009,2080,"支线感悟点2",10292,{"$f":"CONCATENATE(\"道具描述_\",C203)","v":"道具描述_支线感悟点2"},"icon_item_22009",23,{"$f":"CONCATENATE(VLOOKUP(G203,ID分段!A:B,2,FALSE),\"-\",VLOOKUP(G203,ID分段!A:C,3,FALSE))","v":"道具-感悟点"},4,0,0,"12",0,1,0,null,null,0,0,0,0,{"$nulls":11},12,null,null,{"$f":"IF(AG203=\"\",\"\",VLOOKUP(AG203,[1]SkiptoConfig!$A:$H,8,FALSE))","v":"支线剧情"},{"$f":"IF(AH203=\"\",\"\",VLOOKUP(AH203,[1]SkiptoConfig!$A:$H,8,FALSE))","v":""},{"$f":"IF(AI203=\"\",\"\",VLOOKUP(AI203,[1]SkiptoConfig!$A:$H,8,FALSE))","v":""}]
[22010,2081,"支线感悟点3",10293,"道具描述_支线感悟点3","icon_item_22010",23,{"$f":"CONCATENATE(VLOOKUP(G204,ID分段!A:B,2,FALSE),\"-\",VLOOKUP(G204,ID分段!A:C,3,FALSE))","v":"道具-感悟点"},4,0,0,"12",0,1,0,null,null,0,0,0,0,{"$nulls":11},12,null,null,{"$f":"IF(AG204=\"\",\"\",VLOOKUP(AG204,[1]SkiptoConfig!$A:$H,8,FALSE))","v":"支线剧情"},{"$f":"IF(AH204=\"\",\"\",VLOOKUP(AH204,[1]SkiptoConfig!$A:$H,8,FALSE))","v":""},{"$f":"IF(AI204=\"\",\"\",VLOOKUP(AI204,[1]SkiptoConfig!$A:$H,8,FALSE))","v":""}]
[22011,2082,"支线感悟点4",10294,"道具描述_支线感悟点4","icon_item_22011",23,{"$f":"CONCATENATE(VLOOKUP(G205,ID分段!A:B,2,FALSE),\"-\",VLOOKUP(G205,ID分段!A:C,3,FALSE))","v":"道具-感悟点"},4,0,0,"12",0,1,0,null,null,0,0,0,0,{"$nulls":11},12,null,null,{"$f":"IF(AG205=\"\",\"\",VLOOKUP(AG205,[1]SkiptoConfig!$A:$H,8,FALSE))","v":"支线剧情"},{"$f":"IF(AH205=\"\",\"\",VLOOKUP(AH205,[1]SkiptoConfig!$A:$H,8,FALSE))","v":""},{"$f":"IF(AI205=\"\",\"\",VLOOKUP(AI205,[1]SkiptoConfig!$A:$H,8,FALSE))","v":""}]
[22012,2083,"支线感悟点5",10295,"道具描述_支线感悟点5","icon_item_22012",23,{"$f":"CONCATENATE(VLOOKUP(G206,ID分段!A:B,2,FALSE),\"-\",VLOOKUP(G206,ID分段!A:C,3,FALSE))","v":"道具-感悟点"},4,0,0,"12",0,1,0,null,null,0,0,0,0,{"$nulls":11},12,null,null,{"$f":"IF(AG206=\"\",\"\",VLOOKUP(AG206,[1]SkiptoConfig!$A:$H,8,FALSE))","v":"支线剧情"},{"$f":"IF(AH206=\"\",\"\",VLOOKUP(AH206,[1]SkiptoConfig!$A:$H,8,FALSE))","v":""},{"$f":"IF(AI206=\"\",\"\",VLOOKUP(AI206,[1]SkiptoConfig!$A:$H,8,FALSE))","v":""}]
[22013,2084,"支线感悟点6",10296,"道具描述_支线感悟点6","icon_item_22013",23,{"$f":"CONCATENATE(VLOOKUP(G207,ID分段!A:B,2,FALSE),\"-\",VLOOKUP(G207,ID分段!A:C,3,FALSE))","v":"道具-感悟点"},4,0,0,"12",0,1,0,null,null,0,0,0,0,{"$nulls":11},12,null,null,{"$f":"IF(AG207=\"\",\"\",VLOOKUP(AG207,[1]SkiptoConfig!$A:$H,8,FALSE))","v":"支线剧情"},{"$f":"IF(AH207=\"\",\"\",VLOOKUP(AH207,[1]SkiptoConfig!$A:$H,8,FALSE))","v":""},{"$f":"IF(AI207=\"\",\"\",VLOOKUP(AI207,[1]SkiptoConfig!$A:$H,8,FALSE))","v":""}]
[22014,2085,"支线感悟点7",10297,"道具描述_支线感悟点7","icon_item_22014",23,{"$f":"CONCATENATE(VLOOKUP(G208,ID分段!A:B,2,FALSE),\"-\",VLOOKUP(G208,ID分段!A:C,3,FALSE))","v":"道具-感悟点"},4,0,0,{"$f":"_xlfn.TEXTJOIN(\";\",1,AG208:AI208)","v":"12"},0,1,0,null,null,0,0,0,0,{"$nulls":11},12,null,null,{"$f":"IF(AG208=\"\",\"\",VLOOKUP(AG208,[1]SkiptoConfig!$A:$H,8,FALSE))","v":"支线剧情"},{"$f":"IF(AH208=\"\",\"\",VLOOKUP(AH208,[1]SkiptoConfig!$A:$H,8,FALSE))","v":""},{"$f":"IF(AI208=\"\",\"\",VLOOKUP(AI208,[1]SkiptoConfig!$A:$H,8,FALSE))","v":""}]
[{"$nulls":35},{"$f":"IF(AG209=\"\",\"\",VLOOKUP(AG209,[1]SkiptoConfig!$A:$H,8,FALSE))","v":""},{"$f":"IF(AH209=\"\",\"\",VLOOKUP(AH209,[1]SkiptoConfig!$A:$H,8,FALSE))","v":""},{"$f":"IF(AI209=\"\",\"\",VLOOKUP(AI209,[1]SkiptoConfig!$A:$H,8,FALSE))","v":""}]
[23001,10098,"倍源净尘符",10102,"永久免去资源翻倍类广告！","icon_adcard1",24,{"$f":"CONCATENATE(VLOOKUP(G210,ID分段!A:B,2,FALSE),\"-\",VLOOKUP(G210,ID分段!A:C,3,FALSE))","v":"道具-广告卡"},4,0,0,"13",0,1,0,null,null,0,0,0,0,{"$nulls":11},13,null,null,{"$f":"IF(AG210=\"\",\"\",VLOOKUP(AG210,[1]SkiptoConfig!$A:$H,8,FALSE))","v":"探宝-200抽挑战"},{"$f":"IF(AH210=\"\",\"\",VLOOKUP(AH210,[1]SkiptoConfig!$A:$H,8,FALSE))","v":""},{"$f":"IF(AI210=\"\",\"\",VLOOKUP(AI210,[1]SkiptoConfig!$A:$H,8,FALSE))","v":""}]
[23002,10099,"全域无尘玉牌",10103,"永久免去所有广告！","icon_adcard2",24,{"$f":"CONCATENATE(VLOOKUP(G211,ID分段!A:B,2,FALSE),\"-\",VLOOKUP(G211,ID分段!A:C,3,FALSE))","v":"道具-广告卡"},5,0,0,"9;13",0,1,0,null,null,0,0,0,0,{"$nulls":11},9,13,null,{"$f":"IF(AG211=\"\",\"\",VLOOKUP(AG211,[1]SkiptoConfig!$A:$H,8,FALSE))","v":"白嫖氪金-新手礼包"},{"$f":"IF(AH211=\"\",\"\",VLOOKUP(AH211,[1]SkiptoConfig!$A:$H,8,FALSE))","v":"探宝-200抽挑战"},{"$f":"IF(AI211=\"\",\"\",VLOOKUP(AI211,[1]SkiptoConfig!$A:$H,8,FALSE))","v":""}]
[23101,10100,"倍源净尘符碎片",10104,"集齐18枚碎片可兑换免双倍广告卡","icon_adcard1",24,{"$f":"CONCATENATE(VLOOKUP(G212,ID分段!A:B,2,FALSE),\"-\",VLOOKUP(G212,ID分段!A:C,3,FALSE))","v":"道具-广告卡"},4,0,0,"13",0,1,0,null,null,0,0,0,0,10,"18;23001",{"$nulls":9},13,null,null,{"$f":"IF(AG212=\"\",\"\",VLOOKUP(AG212,[1]SkiptoConfig!$A:$H,8,FALSE))","v":"探宝-200抽挑战"},{"$f":"IF(AH212=\"\",\"\",VLOOKUP(AH212,[1]SkiptoConfig!$A:$H,8,FALSE))","v":""},{"$f":"IF(AI212=\"\",\"\",VLOOKUP(AI212,[1]SkiptoConfig!$A:$H,8,FALSE))","v":""}]
[23102,10101,"全域无尘玉牌碎片",10105,"集齐30枚碎片可兑换免所有广告卡","icon_adcard2",24,{"$f":"CONCATENATE(VLOOKUP(G213,ID分段!A:B,2,FALSE),\"-\",VLOOKUP(G213,ID分段!A:C,3,FALSE))","v":"道具-广告卡"},5,0,0,"13",0,1,0,null,null,0,0,0,0,10,"30;23002",{"$nulls":9},13,null,null,{"$f":"IF(AG213=\"\",\"\",VLOOKUP(AG213,[1]SkiptoConfig!$A:$H,8,FALSE))","v":"探宝-200抽挑战"},{"$f":"IF(AH213=\"\",\"\",VLOOKUP(AH213,[1]SkiptoConfig!$A:$H,8,FALSE))","v":""},{"$f":"IF(AI213=\"\",\"\",VLOOKUP(AI213,[1]SkiptoConfig!$A:$H,8,FALSE))","v":""}]

{"sheet":"ID分段","index":1,"n_rows":21,"n_cols":6,"rows_kept":21,"cut":false,"hidden":false,"merged":[]}
["Tag","大类","小类","起始ID","结束ID","已使用"]
[1,"资源","货币",1000,1099]
[2,"资源","材料",1100,1199]
[3,"资源","渡劫丹",1200,1299]
[4,"资源","天材地宝",1300,1399]
[5,"资源","经验丹",1400,1499]
[6,"资源","好感度礼物",1500,1599]
[7,"资源","心情礼物",1600,1699]
[8,"资源","神识丹",1700,1799]
[9,"资源","自动转代币",1800,1899]
[]
[11,"法宝","本体",10000,10999]
[12,"法宝","碎片",11000,11999]
[13,"功法","本体",12000,12999]
[14,"功法","碎片",13000,13999]
[]
[21,"道具","任务道具",20000,20999]
[22,"道具","神识道符",21000,21999]
[23,"道具","感悟点",22000,22999]
[24,"道具","广告卡",23000,23099]
[25,"道具","广告卡碎片",23100,23199]

{"sheet":"道具用途说明","index":2,"n_rows":17,"n_cols":2,"rows_kept":17,"cut":false,"hidden":false,"merged":[]}
["associateID","associateVlaue"]
["int","int[]"]
[]
["特殊功能ID\n","特殊功能参数\n"]
[1,"突破丹可用的下限修为等级（包含）；突破丹可用的上限修为等级（不包含）；突破丹增加的概率；突破失败可以降低的修为损耗%"]
[2,"经验丹增加的修为值"]
[3,"功法对应的碎片ID；功法对应的技能组ID;功法分解时获得的碎片数量"]
[4,"法宝对应的碎片ID；法宝对应的法宝表ID;法宝分解时获得的碎片数量"]
[5,"心情礼物对应增加的心情值"]
[6,"神识符：提升某个品质的刷新概率;提升的权重百分比（填110意思是将原有权重值×1.1）"]
[7,"神识符：使用后必定出现哪个PrizeType的事件"]
[8,"神识丹：使用后可恢复的神识点数"]
[9,"自动转代币：要转的代币ID；要转的代币数量"]
[10,"广告卡碎片：需要多少个碎片；合成出什么道具ID"]
[11,"功法碎片：对应的功法本体道具ID"]
[12,"法宝碎片：对应的法宝本体道具ID"]
[13,"修为会自动转成玩家经验值"]