{"text_format":"2","workbook":"xlsx","n_sheets":4,"sheets":["WorldMapConfig","BigMapConfig","PlacesConfig","SmallPlacesConfig"],"not_rendered":{"charts":0,"images":0,"macros":0,"external_links":0,"defined_names":3,"comments":0,"pivot_tables":0},"unopened":[],"bounds":{"document_bytes":16777216,"sheet_cells":100000,"run_cost":"one","rows_first":2000,"rows_last":500,"rows_between":2000,"halvings":0,"cell_chars":16384,"cell_head_chars":4096},"cells_cut":0,"cells_raw":0,"read":"whole","date_system":"1900"}

{"sheet":"WorldMapConfig","index":0,"n_rows":7,"n_cols":6,"rows_kept":7,"cut":false,"hidden":false,"merged":[]}
["ID",null,"worldName","mpDesc","bigMapPrefabName","bigMapId"]
["int",null,"int","int[]","string","int[]"]
[]
["ID","世界名称","世界名称\n(语言表)","世界介绍\n\n多个","带地图预制件名称","包含的大地图"]
[1,"人界",1918,"4;5;6","RenJieBigMapPanel","1;2;3"]
[2,"仙界",1919,"7;8;9"]
[3,"魔界",1920,"10;11;12"]

{"sheet":"BigMapConfig","index":1,"n_rows":7,"n_cols":10,"rows_kept":7,"cut":false,"hidden":false,"merged":[]}
["ID",null,"mapPrefabName","mapName","mapDesc","places","ulockFunction","extraUnlockConTyp","extraUnlockConVal"]
["int",null,"string","int","int","int[]","int[]","int","int"]
[]
["ID","区域名","大地图预制件\n(不配就做成固定)","大地图名称(语言表)","大地图介绍","包含的地点","解锁表ulockFunction","0. 无\n1. 事件解锁","根据extraUnlockConTyp填","备注"]
[1,"北海","PengLaiDaoPlacesPanel",1921,1,"1;2;3;4",0,0,null,"蓬莱岛"]
[2,"尧之都","DongHaiPlacesPanel",1922,2,"5;6;7",0,0,null,"东海"]
[3,"藐姑射山","WuLiangJiePlacesPanel",1923,3,"8;9;10;11;12",0,0,null,"无量界"]

{"sheet":"PlacesConfig","index":2,"n_rows":7,"n_cols":48,"rows_kept":7,"cut":false,"hidden":false,"merged":[]}
["ID","placeName",null,"placePrefabName","bigMapID","SmallPlacersIds","to3DPrefab","placeDesc",null,"TotalScore","MainTaskID",null,"ZhixianID","ZhixianActivatedPercentage",null,"DivineSenseGeneralProbability","SpecialTaskID",null,"GuajiEvent"]
["int","int",null,"int","int","int[]","string","int",null,"int","int[]",null,"int[]","int[]",null,"int","int[]",null,"int[]"]
[]
["ID","地点名称(语言表ID)",null,"区域预制件\n(不配就做成固定)","属于哪个大地图","包含的小地点","3D世界","3D世界",null,"总进度值","主线事件ID",null,"支线事件ID\n","触发支线的进度百分比",null,"刷该地图特定无限次事件的概率\n40=40%","该地图特定的无限次事件",null,"挂机包含的特殊事件列表",null,"主线ID1","主线ID2","主线ID3","主线ID4","主线ID5","主线ID6","主线ID7","主线ID8","主线ID9","主线ID10","主线ID11",null,"支线ID1","支线ID2","支线ID3","支线ID4","支线ID5","支线ID6","支线ID7","支线ID8","支线ID9","支线ID10",null,"特定通用1","特定通用2","特定通用3","特定通用4","特定通用5"]
[1,1924,"北海",null,1,"1;2;3;4","a",null,null,45,{"$f":"_xlfn.TEXTJOIN(\";\",1,U5:AE5)","v":"10001;10002;10003;10004;10005;10006;10007;10008;10009;10010;10011"},null,{"$f":"_xlfn.TEXTJOIN(\";\",1,AG5:AP5)","v":"3"},25,null,0,{"$f":"_xlfn.TEXTJOIN(\";\",1,AR5:AV5)","v":"1001"},null,null,null,10001,10002,10003,10004,10005,10006,10007,10008,10009,10010,10011,null,3,{"$nulls":10},1001]
[2,1925,"尧之都",null,1,"5;6;7","b",null,null,37,{"$f":"_xlfn.TEXTJOIN(\";\",1,U6:AE6)","v":"10012;10013;10014;10015;10016;10017;10018;10019;10020;10021;10022"},{"$nulls":9},10012,10013,10014,10015,10016,10017,10018,10019,10020,10021,10022]
[3,1926,"藐姑射山",null,1,"8;9;10","c",null,null,20,{"$f":"_xlfn.TEXTJOIN(\";\",1,U7:AE7)","v":"10023;10024;10025;10026;10027;10028;10029;10030;10031"},{"$nulls":9},10023,10024,10025,10026,10027,10028,10029,10030,10031]

{"sheet":"SmallPlacesConfig","index":3,"n_rows":14,"n_cols":9,"rows_kept":14,"cut":false,"hidden":false,"merged":[]}
["ID","placeName","PlacesId","CompletionEventCount","UnlockEnvetid",null,null,"scencName"]
["int","int","int","int","int",null,null,"string"]
[]
["ID","地点名称(语言表ID)","属于哪个大地点","完成多少事件解锁下一个地点","完成某个事件接下下一个地点",null,null,null,"推荐等级"]
[1,10037,1,5,10001,{"$f":"VLOOKUP(C5,PlacesConfig!A:C,3,FALSE)","v":"北海"},"海边","LevelBattle02",1]
[2,10038,1,10,10004,{"$f":"VLOOKUP(C6,PlacesConfig!A:C,3,FALSE)","v":"北海"},"秘境","LevelBattle02",5]
[3,10039,1,10,10009,{"$f":"VLOOKUP(C7,PlacesConfig!A:C,3,FALSE)","v":"北海"},"浮岛","LevelBattle01",11]
[4,10040,1,10,10012,{"$f":"VLOOKUP(C8,PlacesConfig!A:C,3,FALSE)","v":"北海"},"深处","LevelBattle02",21]
[5,10041,2,10,10013,{"$f":"VLOOKUP(C9,PlacesConfig!A:C,3,FALSE)","v":"尧之都"},"主城","LevelBattle03",31]
[6,10042,2,10,10018,{"$f":"VLOOKUP(C10,PlacesConfig!A:C,3,FALSE)","v":"尧之都"},"山林","LevelBattle02",41]
[7,10043,2,10,10022,{"$f":"VLOOKUP(C11,PlacesConfig!A:C,3,FALSE)","v":"尧之都"},"郊外","LevelBattle02",61]
[8,10044,3,10,10025,{"$f":"VLOOKUP(C12,PlacesConfig!A:C,3,FALSE)","v":"藐姑射山"},"山脚","LevelBattle02",81]
[9,10045,3,10,10028,{"$f":"VLOOKUP(C13,PlacesConfig!A:C,3,FALSE)","v":"藐姑射山"},"山径","LevelBattle02",111]
[10,10046,3,-1,-1,{"$f":"VLOOKUP(C14,PlacesConfig!A:C,3,FALSE)","v":"藐姑射山"},"山顶","LevelBattle02",131]