{"text_format":"2","workbook":"xlsx","n_sheets":3,"sheets":["ItemConfig","ID分段","道具用途说明"],"not_rendered":{"charts":0,"images":0,"macros":0,"external_links":4,"defined_names":1,"comments":0,"pivot_tables":0},"unopened":[],"bounds":{"document_bytes":16777216,"sheet_cells":100000,"run_cost":"one","rows_first":2000,"rows_last":500,"rows_between":2000,"halvings":0,"cell_chars":16384,"cell_head_chars":4096},"cells_cut":0,"cells_raw":0,"read":"whole","date_system":"1900"}

{"sheet":"ItemConfig","index":0,"n_rows":204,"n_cols":37,"rows_kept":204,"cut":false,"hidden":false,"merged":[]}
["ID","itemName",null,"itemDesc",null,"icon","itemTag",null,"quality","stack","isSell","SkiptoID","rewardsNum","isVisible","isUse","useLimit","useLimtValue","costItemNum","rewardsItems","rewardsItemNums","stack","associateID","associateVlaue","sort","itemDesc2"]
["int","int",null,"int",null,"string","int",null,"int","int","bool","int[]","int","int","bool","int",null,"int","int[]","int[]","int","int","int[]","int","int"]
[]
["ID1","道具名称\n","道具名\n(查看)","功能说明","功能说明","道具图标","道具分类\n见ID分段",{"$f":"SUBTOTAL(3,H5:H10000)","v":183},"品质\n1.[物品]白\n2.[物品]绿\n3.[物品]蓝\n4.[物品]紫\n5.[物品]橙\n6.[物品]红","堆叠数量\n0.无限","是否出售","跳转ID","出售金额","进入背包时，是否可见","是否可用","使用限制\n0. 无\n1. 共鸣等级","限制的值","消耗道具数量","获得道具ID","获得道具的数量","堆叠数量\n0.无限","特殊功能ID\n详情见说明页","特殊功能参数\n详情见说明页","背包内排序","包装文本","包装文本","参数1","参数2","参数3","参数4","参数5",null,"跳转1","跳转2","跳转3"]
[1001,169,"灵石",162,null,"icon_Coin",1,{"$f":"CONCATENATE(VLOOKUP(G5,ID分段!A:B,2,FALSE),\"-\",VLOOKUP(G5,ID分段!A:C,3,FALSE))","v":"资源-货币"},2,0,0,{"$f":"_xlfn.TEXTJOIN(\";\",1,AG5:AI5)","v":""},0,1,0,null,null,0,0,0,0]
[1002,170,"妖丹",163,null,"icon_Coins_s",1,{"$f":"CONCATENATE(VLOOKUP(G6,ID分段!A:B,2,FALSE),\"-\",VLOOKUP(G6,ID分段!A:C,3,FALSE))","v":"资源-货币"},4,0,0,{"$f":"_xlfn.TEXTJOIN(\";\",1,AG6:AI6)","v":""},0,1,0,null,null,0,0,0,0]
[1003,171,"修为",164,null,"icon_Gem_Star_Blue",2,{"$f":"CONCATENATE(VLOOKUP(G7,ID分段!A:B,2,FALSE),\"-\",VLOOKUP(G7,ID分段!A:C,3,FALSE))","v":"资源-材料"},2,0,0,"",0,1,0,null,null,0,0,0,0]
[1004,248,"仙缘宝券",249,null,"icon_Demo_Gem04",1,{"$f":"CONCATENATE(VLOOKUP(G8,ID分段!A:B,2,FALSE),\"-\",VLOOKUP(G8,ID分段!A:C,3,FALSE))","v":"资源-货币"},5,0,0,"",0,1,0,null,null,0,0,0,0]
[1005,725,"灵气",726,null,"icon_GradeBadge_Master",2,{"$f":"CONCATENATE(VLOOKUP(G9,ID分段!A:B,2,FALSE),\"-\",VLOOKUP(G9,ID分段!A:C,3,FALSE))","v":"资源-材料"},3,0,0,"",0,1,0,null,null,0,0,0,0]
[1006,1400,"玄晶",1401,null,"icon_GradeBadge_Challenger",2,{"$f":"CONCATENATE(VLOOKUP(G10,ID分段!A:B,2,FALSE),\"-\",VLOOKUP(G10,ID分段!A:C,3,FALSE))","v":"资源-材料"},3,0,0,"",0,1,0,null,null,0,0,0,0]
[1007,-1,"广告币",-1,null,"icon_GradeBadge_Challenger",1,{"$f":"CONCATENATE(VLOOKUP(G11,ID分段!A:B,2,FALSE),\"-\",VLOOKUP(G11,ID分段!A:C,3,FALSE))","v":"资源-货币"},4,0,0,"",0,0,0,null,null,0,0,0,0]
[{"$nulls":11},""]
[1101,-1,{"$f":"CONCATENATE(\"自转道具-\",VLOOKUP(AA13,A:C,3,FALSE),\"×\",AB13)","v":"自转道具-妖丹×6"},-1,null,"icon_GradeBadge_Challenger",9,{"$f":"CONCATENATE(VLOOKUP(G13,ID分段!A:B,2,FALSE),\"-\",VLOOKUP(G13,ID分段!A:C,3,FALSE))","v":"资源-自动转代币"},3,0,0,"",0,0,0,null,null,0,0,0,0,9,{"$f":"_xlfn.TEXTJOIN(\";\",1,AA13:AE13)","v":"1002;6"},null,null,null,1002,6]
[1102,-1,{"$f":"CONCATENATE(\"自转道具-\",VLOOKUP(AA14,A:C,3,FALSE),\"×\",AB14)","v":"自转道具-妖丹×30"},-1,null,"icon_GradeBadge_Challenger",9,{"$f":"CONCATENATE(VLOOKUP(G14,ID分段!A:B,2,FALSE),\"-\",VLOOKUP(G14,ID分段!A:C,3,FALSE))","v":"资源-自动转代币"},3,0,0,"",0,0,0,null,null,0,0,0,0,9,{"$f":"_xlfn.TEXTJOIN(\";\",1,AA14:AE14)","v":"1002;30"},null,null,null,1002,30]
[1103,-1,{"$f":"CONCATENATE(\"自转道具-\",VLOOKUP(AA15,A:C,3,FALSE),\"×\",AB15)","v":"自转道具-妖丹×98"},-1,null,"icon_GradeBadge_Challenger",9,{"$f":"CONCATENATE(VLOOKUP(G15,ID分段!A:B,2,FALSE),\"-\",VLOOKUP(G15,ID分段!A:C,3,FALSE))","v":"资源-自动转代币"},4,0,0,"",0,0,0,null,null,0,0,0,0,9,"1002;98",null,null,null,1002,98]
[1104,-1,{"$f":"CONCATENATE(\"自转道具-\",VLOOKUP(AA16,A:C,3,FALSE),\"×\",AB16)","v":"自转道具-妖丹×198"},-1,null,"icon_GradeBadge_Challenger",9,{"$f":"CONCATENATE(VLOOKUP(G16,ID分段!A:B,2,FALSE),\"-\",VLOOKUP(G16,ID分段!A:C,3,FALSE))","v":"资源-自动转代币"},4,0,0,"",0,0,0,null,null,0,0,0,0,9,"1002;198",null,null,null,1002,198]
[1105,-1,{"$f":"CONCATENATE(\"自转道具-\",VLOOKUP(AA17,A:C,3,FALSE),\"×\",AB17)","v":"自转道具-妖丹×328"},-1,null,"icon_GradeBadge_Challenger",9,{"$f":"CONCATENATE(VLOOKUP(G17,ID分段!A:B,2,FALSE),\"-\",VLOOKUP(G17,ID分段!A:C,3,FALSE))","v":"资源-自动转代币"},5,0,0,"",0,0,0,null,null,0,0,0,0,9,"1002;328",null,null,null,1002,328]
[1106,-1,{"$f":"CONCATENATE(\"自转道具-\",VLOOKUP(AA18,A:C,3,FALSE),\"×\",AB18)","v":"自转道具-妖丹×648"},-1,null,"icon_GradeBadge_Challenger",9,{"$f":"CONCATENATE(VLOOKUP(G18,ID分段!A:B,2,FALSE),\"-\",VLOOKUP(G18,ID分段!A:C,3,FALSE))","v":"资源-自动转代币"},5,0,0,"",0,0,0,null,null,0,0,0,0,9,"1002;648",null,null,null,1002,648]
[{"$nulls":11},""]
[1201,250,"渡劫丹",259,"最基础的渡劫丹，可提升10%渡劫成功率。",{"$f":"\"icon_item_\"&A20","v":"icon_item_1201"},3,{"$f":"CONCATENATE(VLOOKUP(G20,ID分段!A:B,2,FALSE),\"-\",VLOOKUP(G20,ID分段!A:C,3,FALSE))","v":"资源-渡劫丹"},3,0,0,"",0,1,0,null,null,0,0,0,0,1,"1;300;10;10",null,null,null,1,300,10,10]
[1202,251,"良品渡劫丹",260,"品相较好的渡劫丹，可提升15%渡劫成功率。",{"$f":"\"icon_item_\"&A21","v":"icon_item_1202"},3,{"$f":"CONCATENATE(VLOOKUP(G21,ID分段!A:B,2,FALSE),\"-\",VLOOKUP(G21,ID分段!A:C,3,FALSE))","v":"资源-渡劫丹"},4,0,0,"",0,1,0,null,null,0,0,0,0,1,"1;300;15;25",null,null,null,1,300,15,25]
[1203,252,"上品渡劫丹",261,"品相极好的渡劫丹，可提升25%渡劫成功率。","icon_item_1203",3,{"$f":"CONCATENATE(VLOOKUP(G22,ID分段!A:B,2,FALSE),\"-\",VLOOKUP(G22,ID分段!A:C,3,FALSE))","v":"资源-渡劫丹"},5,0,0,"",0,1,0,null,null,0,0,0,0,1,"1;300;25;50",null,null,null,1,300,25,50]
[1204,253,"极品渡劫丹",262,"百年难得一见的渡劫丹，可提升40%渡劫成功率。",{"$f":"\"icon_item_\"&A23","v":"icon_item_1204"},3,{"$f":"CONCATENATE(VLOOKUP(G23,ID分段!A:B,2,FALSE),\"-\",VLOOKUP(G23,ID分段!A:C,3,FALSE))","v":"资源-渡劫丹"},6,0,0,"",0,1,0,null,null,0,0,0,0,1,"1;300;40;80",null,null,null,1,300,40,80]
[{"$nulls":11},""]
[1301,268,"筑基丹",272,{"$f":"CONCATENATE(\"突破\",AJ25,\"达到\",AK25,\"境界所必需的天材地宝。\")","v":"突破练气期达到筑基期境界所必需的天材地宝。"},{"$f":"\"icon_item_\"&A25","v":"icon_item_1301"},4,{"$f":"CONCATENATE(VLOOKUP(G25,ID分段!A:B,2,FALSE),\"-\",VLOOKUP(G25,ID分段!A:C,3,FALSE))","v":"资源-天材地宝"},4,0,0,"",0,1,0,null,null,0,0,0,0,1,"1;300;45;0",null,null,null,1,300,45,0,{"$nulls":5},"练气期","筑基期"]
[1302,269,"金阳果",273,{"$f":"CONCATENATE(\"突破\",AJ26,\"达到\",AK26,\"境界所必需的天材地宝。\")","v":"突破筑基期达到结丹期境界所必需的天材地宝。"},{"$f":"\"icon_item_\"&A26","v":"icon_item_1302"},4,{"$f":"CONCATENATE(VLOOKUP(G26,ID分段!A:B,2,FALSE),\"-\",VLOOKUP(G26,ID分段!A:C,3,FALSE))","v":"资源-天材地宝"},4,0,0,"",0,1,0,null,null,0,0,0,0,1,"1;300;40;0",null,null,null,1,300,40,0,{"$nulls":5},"筑基期","结丹期"]
[1303,270,"九窍芝",274,"突破结丹期达到元婴期境界所必需的天材地宝。",{"$f":"\"icon_item_\"&A27","v":"icon_item_1303"},4,{"$f":"CONCATENATE(VLOOKUP(G27,ID分段!A:B,2,FALSE),\"-\",VLOOKUP(G27,ID分段!A:C,3,FALSE))","v":"资源-天材地宝"},4,0,0,"",0,1,0,null,null,0,0,0,0,1,"1;300;35;0",null,null,null,1,300,35,0,{"$nulls":5},"结丹期","元婴期"]
[1304,271,"玄冥髓",275,"突破元婴期达到化神期境界所必需的天材地宝。",{"$f":"\"icon_item_\"&A28","v":"icon_item_1304"},4,{"$f":"CONCATENATE(VLOOKUP(G28,ID分段!A:B,2,FALSE),\"-\",VLOOKUP(G28,ID分段!A:C,3,FALSE))","v":"资源-天材地宝"},5,0,0,"",0,1,0,null,null,0,0,0,0,1,"1;300;30;0",null,null,null,1,300,30,0,{"$nulls":5},"元婴期","化神期"]
[1305,10112,"九焰莲",10117,"突破化神期达到炼虚期境界所必需的天材地宝。","icon_item_1305",4,{"$f":"CONCATENATE(VLOOKUP(G29,ID分段!A:B,2,FALSE),\"-\",VLOOKUP(G29,ID分段!A:C,3,FALSE))","v":"资源-天材地宝"},5,0,0,{"$f":"_xlfn.TEXTJOIN(\";\",1,AG29:AI29)","v":""},0,1,0,null,null,0,0,0,0,1,"1;300;25;0",null,null,null,1,300,25,0,{"$nulls":5},"化神期","炼虚期"]
[1306,10113,"混沌合晶",10118,"突破炼虚期达到大乘期境界所必需的天材地宝。","icon_item_1306",4,{"$f":"CONCATENATE(VLOOKUP(G30,ID分段!A:B,2,FALSE),\"-\",VLOOKUP(G30,ID分段!A:C,3,FALSE))","v":"资源-天材地宝"},5,0,0,"",0,1,0,null,null,0,0,0,0,1,"1;300;20;0",null,null,null,1,300,20,0,{"$nulls":5},"炼虚期","大乘期"]
[1307,10114,"鸿蒙紫华",10119,"突破大乘期达到飞升期境界所必需的天材地宝。","icon_item_1307",4,{"$f":"CONCATENATE(VLOOKUP(G31,ID分段!A:B,2,FALSE),\"-\",VLOOKUP(G31,ID分段!A:C,3,FALSE))","v":"资源-天材地宝"},6,0,0,"",0,1,0,null,null,0,0,0,0,1,"1;300;15;0",null,null,null,1,300,15,0,{"$nulls":5},"大乘期","飞升期"]
[1308,10115,"开天古藤",10120,"突破飞升期达到逍遥期境界所必需的天材地宝。",{"$f":"\"icon_item_\"&A32","v":"icon_item_1308"},4,{"$f":"CONCATENATE(VLOOKUP(G32,ID分段!A:B,2,FALSE),\"-\",VLOOKUP(G32,ID分段!A:C,3,FALSE))","v":"资源-天材地宝"},6,0,0,"",0,1,0,null,null,0,0,0,0,1,"1;300;10;0",null,null,null,1,300,10,0,{"$nulls":5},"飞升期","逍遥期"]
[1309,10116,"九天露华",10121,"突破逍遥期达到真神期境界所必需的天材地宝。",{"$f":"\"icon_item_\"&A33","v":"icon_item_1309"},4,{"$f":"CONCATENATE(VLOOKUP(G33,ID分段!A:B,2,FALSE),\"-\",VLOOKUP(G33,ID分段!A:C,3,FALSE))","v":"资源-天材地宝"},6,0,0,{"$f":"_xlfn.TEXTJOIN(\";\",1,AG33:AI33)","v":""},0,1,0,null,null,0,0,0,0,1,"1;300;5;0",null,null,null,1,300,5,0,{"$nulls":5},"逍遥期","真神期"]
[{"$nulls":11},""]
[1401,276,"增元丹",280,30,"icon_xiuweidan",5,{"$f":"CONCATENATE(VLOOKUP(G35,ID分段!A:B,2,FALSE),\"-\",VLOOKUP(G35,ID分段!A:C,3,FALSE))","v":"资源-经验丹"},2,0,0,"",0,1,0,null,null,0,0,0,0,2,3000,null,null,{"$f":"VLOOKUP(E35,[1]ResourceLevelConfig!$A:$E,5,FALSE)*10","v":13370}]
[1402,277,"增元丹",281,60,"icon_xiuweidan",5,{"$f":"CONCATENATE(VLOOKUP(G36,ID分段!A:B,2,FALSE),\"-\",VLOOKUP(G36,ID分段!A:C,3,FALSE))","v":"资源-经验丹"},3,0,0,"",0,1,0,null,null,0,0,0,0,2,7000,null,null,{"$f":"VLOOKUP(E36,[1]ResourceLevelConfig!$A:$E,5,FALSE)*10","v":18060}]
[1403,278,"增元丹",282,90,"icon_xiuweidan",5,{"$f":"CONCATENATE(VLOOKUP(G37,ID分段!A:B,2,FALSE),\"-\",VLOOKUP(G37,ID分段!A:C,3,FALSE))","v":"资源-经验丹"},4,0,0,"",0,1,0,null,null,0,0,0,0,2,13000,null,null,{"$f":"VLOOKUP(E37,[1]ResourceLevelConfig!$A:$E,5,FALSE)*10","v":24390}]
[1404,279,"增元丹",283,120,"icon_xiuweidan",5,{"$f":"CONCATENATE(VLOOKUP(G38,ID分段!A:B,2,FALSE),\"-\",VLOOKUP(G38,ID分段!A:C,3,FALSE))","v":"资源-经验丹"},5,0,0,"",0,1,0,null,null,0,0,0,0,2,25000,null,null,{"$f":"VLOOKUP(E38,[1]ResourceLevelConfig!$A:$E,5,FALSE)*10","v":32950}]
[{"$nulls":11},""]
[1501,1947,"好感度礼物1",1949,{"$f":"CONCATENATE(\"道具描述_\",C40)","v":"道具描述_好感度礼物1"},"icon_haogandugift",6,{"$f":"CONCATENATE(VLOOKUP(G40,ID分段!A:B,2,FALSE),\"-\",VLOOKUP(G40,ID分段!A:C,3,FALSE))","v":"资源-好感度礼物"},3,0,0,"",0,1,0,null,null,0,0,0,0,0,0]
[1502,1948,"好感度礼物2",1950,{"$f":"CONCATENATE(\"道具描述_\",C41)","v":"道具描述_好感度礼物2"},"icon_haogandugift",6,{"$f":"CONCATENATE(VLOOKUP(G41,ID分段!A:B,2,FALSE),\"-\",VLOOKUP(G41,ID分段!A:C,3,FALSE))","v":"资源-好感度礼物"},4,0,0,"",0,1,0,null,null,0,0,0,0,0,0]
[{"$nulls":11},""]
[1601,1951,"心情礼物1",1952,{"$f":"CONCATENATE(\"道具描述_\",C43)","v":"道具描述_心情礼物1"},"icon_xinqingliwu",7,{"$f":"CONCATENATE(VLOOKUP(G43,ID分段!A:B,2,FALSE),\"-\",VLOOKUP(G43,ID分段!A:C,3,FALSE))","v":"资源-心情礼物"},2,0,0,"",0,1,0,null,null,0,0,0,0,5,10]
[{"$nulls":11},""]
[1701,3237,"清识还元丹",3240,{"$f":"CONCATENATE(\"使用后恢复\",W45,\"点神识。\")","v":"使用后恢复100点神识。"},"icon_shenshidan",8,{"$f":"CONCATENATE(VLOOKUP(G45,ID分段!A:B,2,FALSE),\"-\",VLOOKUP(G45,ID分段!A:C,3,FALSE))","v":"资源-神识丹"},3,0,0,"",0,1,0,null,null,0,0,0,0,8,100]
[1702,3238,"清识还元丹",3241,{"$f":"CONCATENATE(\"使用后恢复\",W46,\"点神识。\")","v":"使用后恢复300点神识。"},"icon_shenshidan",8,{"$f":"CONCATENATE(VLOOKUP(G46,ID分段!A:B,2,FALSE),\"-\",VLOOKUP(G46,ID分段!A:C,3,FALSE))","v":"资源-神识丹"},4,0,0,"",0,1,0,null,null,0,0,0,0,8,300]
[1703,3239,"清识还元丹",3242,"使用后恢复1000点神识。","icon_shenshidan",8,{"$f":"CONCATENATE(VLOOKUP(G47,ID分段!A:B,2,FALSE),\"-\",VLOOKUP(G47,ID分段!A:C,3,FALSE))","v":"资源-神识丹"},5,0,0,"",0,1,0,null,null,0,0,0,0,8,1000]
[{"$nulls":11},""]
[10001,284,"神龙鼎",292,null,"icon_s3101",11,{"$f":"CONCATENATE(VLOOKUP(G49,ID分段!A:B,2,FALSE),\"-\",VLOOKUP(G49,ID分段!A:C,3,FALSE))","v":"法宝-本体"},4,0,0,"",0,1,0,null,null,0,0,0,0,4,{"$f":"_xlfn.TEXTJOIN(\";\",1,AA49:AE49)","v":"11001;10001;10"},null,null,null,11001,10001,{"$f":"CHOOSE(I49-2,[2]抽卡!$Q$2,[2]抽卡!$Q$3,[2]抽卡!$Q$4)","v":10}]
[10002,285,"破天斧",293,null,"icon_s3102",11,{"$f":"CONCATENATE(VLOOKUP(G50,ID分段!A:B,2,FALSE),\"-\",VLOOKUP(G50,ID分段!A:C,3,FALSE))","v":"法宝-本体"},5,0,0,"",0,1,0,null,null,0,0,0,0,4,{"$f":"_xlfn.TEXTJOIN(\";\",1,AA50:AE50)","v":"11002;10002;30"},null,null,null,11002,10002,{"$f":"CHOOSE(I50-2,[2]抽卡!$Q$2,[2]抽卡!$Q$3,[2]抽卡!$Q$4)","v":30}]
[10003,286,"翡翠葫芦",294,null,"icon_s3201",11,{"$f":"CONCATENATE(VLOOKUP(G51,ID分段!A:B,2,FALSE),\"-\",VLOOKUP(G51,ID分段!A:C,3,FALSE))","v":"法宝-本体"},4,0,0,"",0,1,0,null,null,0,0,0,0,4,"11003;10003;10",null,null,null,11003,10003,{"$f":"CHOOSE(I51-2,[2]抽卡!$Q$2,[2]抽卡!$Q$3,[2]抽卡!$Q$4)","v":10}]
[10004,287,"混沌珠",295,null,"icon_s3202",11,{"$f":"CONCATENATE(VLOOKUP(G52,ID分段!A:B,2,FALSE),\"-\",VLOOKUP(G52,ID分段!A:C,3,FALSE))","v":"法宝-本体"},5,0,0,"",0,1,0,null,null,0,0,0,0,4,"11004;10004;30",null,null,null,11004,10004,{"$f":"CHOOSE(I52-2,[2]抽卡!$Q$2,[2]抽卡!$Q$3,[2]抽卡!$Q$4)","v":30}]
[10005,288,"琉璃宝塔",296,null,"icon_s3203",11,{"$f":"CONCATENATE(VLOOKUP(G53,ID分段!A:B,2,FALSE),\"-\",VLOOKUP(G53,ID分段!A:C,3,FALSE))","v":"法宝-本体"},5,0,0,"",0,1,0,null,null,0,0,0,0,4,"11005;10005;30",null,null,null,11005,10005,{"$f":"CHOOSE(I53-2,[2]抽卡!$Q$2,[2]抽卡!$Q$3,[2]抽卡!$Q$4)","v":30}]
[10006,289,"九幽镇魂瓶",297,null,"icon_s3301",11,{"$f":"CONCATENATE(VLOOKUP(G54,ID分段!A:B,2,FALSE),\"-\",VLOOKUP(G54,ID分段!A:C,3,FALSE))","v":"法宝-本体"},4,0,0,"",0,1,0,null,null,0,0,0,0,4,"11006;10006;10",null,null,null,11006,10006,{"$f":"CHOOSE(I54-2,[2]抽卡!$Q$2,[2]抽卡!$Q$3,[2]抽卡!$Q$4)","v":10}]
[10007,290,"玉莲守心灯",298,null,"icon_s3302",11,{"$f":"CONCATENATE(VLOOKUP(G55,ID分段!A:B,2,FALSE),\"-\",VLOOKUP(G55,ID分段!A:C,3,FALSE))","v":"法宝-本体"},5,0,0,"",0,1,0,null,null,0,0,0,0,4,"11007;10007;30",null,null,null,11007,10007,{"$f":"CHOOSE(I55-2,[2]抽卡!$Q$2,[2]抽卡!$Q$3,[2]抽卡!$Q$4)","v":30}]
[10008,291,"融灵塔",299,null,"icon_s3401",11,{"$f":"CONCATENATE(VLOOKUP(G56,ID分段!A:B,2,FALSE),\"-\",VLOOKUP(G56,ID分段!A:C,3,FALSE))","v":"法宝-本体"},4,0,0,"",0,1,0,null,null,0,0,0,0,4,"11008;10008;10",null,null,null,11008,10008,{"$f":"CHOOSE(I56-2,[2]抽卡!$Q$2,[2]抽卡!$Q$3,[2]抽卡!$Q$4)","v":10}]
[10009,1402,"禁元珠",1405,null,"icon_s3402",11,{"$f":"CONCATENATE(VLOOKUP(G57,ID分段!A:B,2,FALSE),\"-\",VLOOKUP(G57,ID分段!A:C,3,FALSE))","v":"法宝-本体"},5,0,0,"",0,1,0,null,null,0,0,0,0,4,{"$f":"_xlfn.TEXTJOIN(\";\",1,AA57:AE57)","v":"11009;10009;30"},null,null,null,11009,10009,{"$f":"CHOOSE(I57-2,[2]抽卡!$Q$2,[2]抽卡!$Q$3,[2]抽卡!$Q$4)","v":30}]
[10010,1403,"玄龟盾",1406,null,"icon_s3501",11,{"$f":"CONCATENATE(VLOOKUP(G58,ID分段!A:B,2,FALSE),\"-\",VLOOKUP(G58,ID分段!A:C,3,FALSE))","v":"法宝-本体"},4,0,0,"",0,1,0,null,null,0,0,0,0,4,"11010;10010;10",null,null,null,11010,10010,{"$f":"CHOOSE(I58-2,[2]抽卡!$Q$2,[2]抽卡!$Q$3,[2]抽卡!$Q$4)","v":10}]
[10011,1404,"天殇血刃剑",1407,null,"icon_s3502",11,{"$f":"CONCATENATE(VLOOKUP(G59,ID分段!A:B,2,FALSE),\"-\",VLOOKUP(G59,ID分段!A:C,3,FALSE))","v":"法宝-本体"},5,0,0,"",0,1,0,null,null,0,0,0,0,4,{"$f":"_xlfn.TEXTJOIN(\";\",1,AA59:AE59)","v":"11011;10011;30"},null,null,null,11011,10011,{"$f":"CHOOSE(I59-2,[2]抽卡!$Q$2,[2]抽卡!$Q$3,[2]抽卡!$Q$4)","v":30}]
[{"$nulls":11},""]
[11001,300,"神龙鼎碎片",308,null,"icon_s3101",12,{"$f":"CONCATENATE(VLOOKUP(G61,ID分段!A:B,2,FALSE),\"-\",VLOOKUP(G61,ID分段!A:C,3,FALSE))","v":"法宝-碎片"},3,0,0,"",0,1,0,null,null,0,0,0,0,12,{"$f":"_xlfn.TEXTJOIN(\";\",1,AA61:AE61)","v":"11001"},null,null,null,11001]
[11002,301,"破天斧碎片",309,null,"icon_s3102",12,{"$f":"CONCATENATE(VLOOKUP(G62,ID分段!A:B,2,FALSE),\"-\",VLOOKUP(G62,ID分段!A:C,3,FALSE))","v":"法宝-碎片"},4,0,0,"",0,1,0,null,null,0,0,0,0,12,{"$f":"_xlfn.TEXTJOIN(\";\",1,AA62:AE62)","v":"11002"},null,null,null,11002]
[11003,302,"翡翠葫芦碎片",310,null,"icon_s3201",12,{"$f":"CONCATENATE(VLOOKUP(G63,ID分段!A:B,2,FALSE),\"-\",VLOOKUP(G63,ID分段!A:C,3,FALSE))","v":"法宝-碎片"},3,0,0,"",0,1,0,null,null,0,0,0,0,12,"11003",null,null,null,11003]
[11004,303,"混沌珠碎片",311,null,"icon_s3202",12,{"$f":"CONCATENATE(VLOOKUP(G64,ID分段!A:B,2,FALSE),\"-\",VLOOKUP(G64,ID分段!A:C,3,FALSE))","v":"法宝-碎片"},4,0,0,"",0,1,0,null,null,0,0,0,0,12,"11004",null,null,null,11004]
[11005,304,"琉璃宝塔碎片",312,null,"icon_s3203",12,{"$f":"CONCATENATE(VLOOKUP(G65,ID分段!A:B,2,FALSE),\"-\",VLOOKUP(G65,ID分段!A:C,3,FALSE))","v":"法宝-碎片"},5,0,0,"",0,1,0,null,null,0,0,0,0,12,"11005",null,null,null,11005]
[11006,305,"九幽镇魂瓶碎片",313,null,"icon_s3301",12,{"$f":"CONCATENATE(VLOOKUP(G66,ID分段!A:B,2,FALSE),\"-\",VLOOKUP(G66,ID分段!A:C,3,FALSE))","v":"法宝-碎片"},3,0,0,"",0,1,0,null,null,0,0,0,0,12,"11006",null,null,null,11006]
[11007,306,"玉莲守心灯碎片",314,null,"icon_s3302",12,{"$f":"CONCATENATE(VLOOKUP(G67,ID分段!A:B,2,FALSE),\"-\",VLOOKUP(G67,ID分段!A:C,3,FALSE))","v":"法宝-碎片"},4,0,0,"",0,1,0,null,null,0,0,0,0,12,"11007",null,null,null,11007]
[11008,307,"融灵塔碎片",315,null,"icon_s3401",12,{"$f":"CONCATENATE(VLOOKUP(G68,ID分段!A:B,2,FALSE),\"-\",VLOOKUP(G68,ID分段!A:C,3,FALSE))","v":"法宝-碎片"},3,0,0,"",0,1,0,null,null,0,0,0,0,12,"11008",null,null,null,11008]
[11009,1408,"禁元珠碎片",1411,null,"icon_s3402",12,{"$f":"CONCATENATE(VLOOKUP(G69,ID分段!A:B,2,FALSE),\"-\",VLOOKUP(G69,ID分段!A:C,3,FALSE))","v":"法宝-碎片"},4,0,0,"",0,1,0,null,null,0,0,0,0,12,"11009",null,null,null,11009]
[11010,1409,"玄龟盾碎片",1412,null,"icon_s3501",12,{"$f":"CONCATENATE(VLOOKUP(G70,ID分段!A:B,2,FALSE),\"-\",VLOOKUP(G70,ID分段!A:C,3,FALSE))","v":"法宝-碎片"},3,0,0,{"$f":"_xlfn.TEXTJOIN(\";\",1,AG70:AI70)","v":""},0,1,0,null,null,0,0,0,0,12,"11010",null,null,null,11010]
[11011,1410,"天殇血刃剑碎片",1413,null,"icon_s3502",12,{"$f":"CONCATENATE(VLOOKUP(G71,ID分段!A:B,2,FALSE),\"-\",VLOOKUP(G71,ID分段!A:C,3,FALSE))","v":"法宝-碎片"},4,0,0,"",0,1,0,null,null,0,0,0,0,12,"11011",null,null,null,11011]
[{"$nulls":11},""]
[12001,1414,"太虚幻剑经",1500,"功法-金1",{"$f":"IFERROR(VLOOKUP(AB73*10,[3]SkillConfig!$A:$I,9,FALSE),\"\")","v":"icon_s1101"},13,{"$f":"CONCATENATE(VLOOKUP(G73,ID分段!A:B,2,FALSE),\"-\",VLOOKUP(G73,ID分段!A:C,3,FALSE))","v":"功法-本体"},5,0,0,"",0,1,0,null,null,0,0,0,0,3,{"$f":"_xlfn.TEXTJOIN(\";\",1,AA73:AE73)","v":"13001;1101;30"},null,null,null,13001,1101,{"$f":"CHOOSE(I73-2,[2]抽卡!$Q$2,[2]抽卡!$Q$3,[2]抽卡!$Q$4)","v":30}]
[12002,1415,"天罡剑气诀",1501,"功法-金2",{"$f":"IFERROR(VLOOKUP(AB74*10,[3]SkillConfig!$A:$I,9,FALSE),\"\")","v":"icon_s1102"},13,{"$f":"CONCATENATE(VLOOKUP(G74,ID分段!A:B,2,FALSE),\"-\",VLOOKUP(G74,ID分段!A:C,3,FALSE))","v":"功法-本体"},5,0,0,"",0,1,0,null,null,0,0,0,0,3,{"$f":"_xlfn.TEXTJOIN(\";\",1,AA74:AE74)","v":"13002;1102;30"},null,null,null,13002,1102,{"$f":"CHOOSE(I74-2,[2]抽卡!$Q$2,[2]抽卡!$Q$3,[2]抽卡!$Q$4)","v":30}]
[12003,1416,"血刃金煌功",1502,"功法-金3",{"$f":"IFERROR(VLOOKUP(AB75*10,[3]SkillConfig!$A:$I,9,FALSE),\"\")","v":"icon_s1103"},13,{"$f":"CONCATENATE(VLOOKUP(G75,ID分段!A:B,2,FALSE),\"-\",VLOOKUP(G75,ID分段!A:C,3,FALSE))","v":"功法-本体"},5,0,0,"",0,1,0,null,null,0,0,0,0,3,"13003;1103;30",null,null,null,13003,1103,{"$f":"CHOOSE(I75-2,[2]抽卡!$Q$2,[2]抽卡!$Q$3,[2]抽卡!$Q$4)","v":30}]
[12004,1417,"飞刃",1503,"功法-金4",{"$f":"IFERROR(VLOOKUP(AB76*10,[3]SkillConfig!$A:$I,9,FALSE),\"\")","v":"icon_s1104"},13,{"$f":"CONCATENATE(VLOOKUP(G76,ID分段!A:B,2,FALSE),\"-\",VLOOKUP(G76,ID分段!A:C,3,FALSE))","v":"功法-本体"},4,0,0,"",0,1,0,null,null,0,0,0,0,3,"13004;1104;10",null,null,null,13004,1104,{"$f":"CHOOSE(I76-2,[2]抽卡!$Q$2,[2]抽卡!$Q$3,[2]抽卡!$Q$4)","v":10}]
[12005,1418,"金针",1504,"功法-金5",{"$f":"IFERROR(VLOOKUP(AB77*10,[3]SkillConfig!$A:$I,9,FALSE),\"\")","v":"icon_s1105"},13,{"$f":"CONCATENATE(VLOOKUP(G77,ID分段!A:B,2,FALSE),\"-\",VLOOKUP(G77,ID分段!A:C,3,FALSE))","v":"功法-本体"},3,0,0,"",0,1,0,null,null,0,0,0,0,3,"13005;1105;3",null,null,null,13005,1105,{"$f":"CHOOSE(I77-2,[2]抽卡!$Q$2,[2]抽卡!$Q$3,[2]抽卡!$Q$4)","v":3}]
[12006,1419,"碧落幽冥劲",1505,"功法-水1",{"$f":"IFERROR(VLOOKUP(AB78*10,[3]SkillConfig!$A:$I,9,FALSE),\"\")","v":"icon_s1201"},13,{"$f":"CONCATENATE(VLOOKUP(G78,ID分段!A:B,2,FALSE),\"-\",VLOOKUP(G78,ID分段!A:C,3,FALSE))","v":"功法-本体"},5,0,0,"",0,1,0,null,null,0,0,0,0,3,"13006;1201;30",null,null,null,13006,1201,{"$f":"CHOOSE(I78-2,[2]抽卡!$Q$2,[2]抽卡!$Q$3,[2]抽卡!$Q$4)","v":30}]
[12007,1420,"雾隐千流法",1506,"功法-水2",{"$f":"IFERROR(VLOOKUP(AB79*10,[3]SkillConfig!$A:$I,9,FALSE),\"\")","v":"icon_s1202"},13,{"$f":"CONCATENATE(VLOOKUP(G79,ID分段!A:B,2,FALSE),\"-\",VLOOKUP(G79,ID分段!A:C,3,FALSE))","v":"功法-本体"},5,0,0,"",0,1,0,null,null,0,0,0,0,3,"13007;1202;30",null,null,null,13007,1202,{"$f":"CHOOSE(I79-2,[2]抽卡!$Q$2,[2]抽卡!$Q$3,[2]抽卡!$Q$4)","v":30}]
[12008,1421,"功法-水3",1507,"功法-水3",{"$f":"IFERROR(VLOOKUP(AB80*10,[3]SkillConfig!$A:$I,9,FALSE),\"\")","v":""},13,{"$f":"CONCATENATE(VLOOKUP(G80,ID分段!A:B,2,FALSE),\"-\",VLOOKUP(G80,ID分段!A:C,3,FALSE))","v":"功法-本体"},5,0,0,"",0,1,0,null,null,0,0,0,0,3,"13008;1203;30",null,null,null,13008,1203,{"$f":"CHOOSE(I80-2,[2]抽卡!$Q$2,[2]抽卡!$Q$3,[2]抽卡!$Q$4)","v":30}]
{"$rows_left_out":125}
{"sheet":"ID分段","index":1,"n_rows":21,"n_cols":6,"rows_kept":21,"cut":false,"hidden":false,"merged":[]}
["Tag","大类","小类","起始ID","结束ID","已使用"]
[1,"资源","货币",1000,1099]
[2,"资源","材料",1100,1199]
[3,"资源","渡劫丹",1200,1299]
[4,"资源","天材地宝",1300,1399]
[5,"资源","经验丹",1400,1499]
[6,"资源","好感度礼物",1500,1599]
[7,"资源","心情礼物",1600,1699]
[8,"资源","神识丹",1700,1799]
[9,"资源","自动转代币",1800,1899]
[]
[11,"法宝","本体",10000,10999]
[12,"法宝","碎片",11000,11999]
[13,"功法","本体",12000,12999]
[14,"功法","碎片",13000,13999]
[]
[21,"道具","任务道具",20000,20999]
[22,"道具","神识道符",21000,21999]
[23,"道具","感悟点",22000,22999]
[24,"道具","广告卡",23000,23099]
[25,"道具","广告卡碎片",23100,23199]

{"sheet":"道具用途说明","index":2,"n_rows":16,"n_cols":2,"rows_kept":16,"cut":false,"hidden":false,"merged":[]}
["associateID","associateVlaue"]
["int","int[]"]
[]
["特殊功能ID\n","特殊功能参数\n"]
[1,"突破丹可用的下限修为等级（包含）；突破丹可用的上限修为等级（不包含）；突破丹增加的概率；突破失败可以降低的修为损耗%"]
[2,"经验丹增加的修为值"]
[3,"功法对应的碎片ID；功法对应的技能组ID;功法分解时获得的碎片数量"]
[4,"法宝对应的碎片ID；法宝对应的法宝表ID;法宝分解时获得的碎片数量"]
[5,"心情礼物对应增加的心情值"]
[6,"神识符：提升某个品质的刷新概率;提升的权重百分比（填110意思是将原有权重值×1.1）"]
[7,"神识符：使用后必定出现哪个PrizeType的事件"]
[8,"神识丹：使用后可恢复的神识点数"]
[9,"自动转代币：要转的代币ID；要转的代币数量"]
[10,"广告卡碎片：需要多少个碎片；合成出什么道具ID"]
[11,"功法碎片：对应的功法本体道具ID"]
[12,"法宝碎片：对应的法宝本体道具ID"]