{"text_format":"2","workbook":"xlsx","n_sheets":2,"sheets":["HeroPowerUpConfig","HeroQiangDuAddConfig"],"not_rendered":{"charts":0,"images":0,"macros":0,"external_links":5,"defined_names":1,"comments":0,"pivot_tables":0},"unopened":[],"bounds":{"document_bytes":16777216,"sheet_cells":100000,"run_cost":"one","rows_first":2000,"rows_last":500,"rows_between":2000,"halvings":0,"cell_chars":16384,"cell_head_chars":4096},"cells_cut":0,"cells_raw":0,"read":"whole","date_system":"1900"}

{"sheet":"HeroPowerUpConfig","index":0,"n_rows":304,"n_cols":55,"rows_kept":304,"cut":false,"hidden":false,"merged":[]}
["ID","HeroLevel","jingjie1","jingjie2","jingjie3","jingjieLanIDs",{"$nulls":6},"levelUpExp","DujieLevelbattleID","DujieRateviaBattle","DujieMustItemIDs","DujieMustItemValues","DujieItemIDs","DujieItemValues","LeijieDamages","HPFactor","ATKFactor","DEFFactor","HudunFactor","defK","ShenshiMax","AutoXiuwei","FailureExpReduce","MaxActiveGongfaNum","MaxPassiveGongfaNum","MaxFabaoNum",{"$nulls":4},"MPFactor","DaoyouCount"]
["int","int","int","int","int","int[]",{"$nulls":6},"int","int","int","int[]","int[]","int[]","int[]","int[]","float","float","float","float","int","int","float","int","int","int","int",{"$nulls":4},"float","int"]
[{"$nulls":31},{"$f":"SUM(AF5:AF304)","v":1229974},{"$f":"AF3/60","v":20499.566666666666},{"$f":"AG3/60","v":341.65944444444443},{"$f":"AH3/12","v":28.471620370370371}]
["ID","玩家修为境界（等级）","大境界ID","中境界ID","小境界ID","境界语言表ID","境界名称1","境界名称2","境界名称3",null,null,null,"升级所需修为值\n（-1代表最大等级)","渡劫必须战斗ID","战斗增加渡劫几率","渡劫必需道具ID","渡劫必需道具数量","渡劫选有道具IDs","渡劫选有道具数量","雷劫伤害\n要填下限、上限、表现上几根雷","生命倍率","攻击倍率","防御倍率","护盾倍率","防御系数K","神识上限","每秒获得的修为值","雷劫失败扣除的当前等级修为百分比","主动功法可配置上限","被动功法可配置上限","法宝可配置上限","吐纳时长(s)","分钟","小时","天（每天12小时）","法力倍率","允许出现的最大挂机道友数量",null,"战斗","必须","数量","选有1","数量1","选有2","数量2","选有3","数量3","选有4","数量4","基础概率","概率1","概率2","概率3","概率4","总概率"]
[1,1,1,1,1,{"$f":"_xlfn.TEXTJOIN(\";\",1,J5:L5)","v":"225;235;238"},"练气","前期.","一重",225,235,238,{"$f":"ROUND([1]ResourceLevelConfig!$E5*[1]ResourceLevelConfig!$L5*0.1,0)*10","v":400},{"$f":"IF(E5=10,100004,-1)","v":-1},{"$f":"IF(N5=-1,-1,20)","v":-1},-1,-1,{"$f":"IF(I5=10,\"1204;1203;1202;1201\",-1)","v":-1},{"$f":"IF(R5=-1,-1,\"1;1;1;1\")","v":-1},{"$f":"IF(G5=G6,0,CONCATENATE(80*ROUND(VLOOKUP(B5,[2]MonsterPowerUpConfig!$A:$I,9,FALSE),0),\";\",120*ROUND(VLOOKUP(B5,[2]MonsterPowerUpConfig!$A:$I,9,FALSE),0)))","v":0},{"$f":"[3]主表!K3","v":5},{"$f":"[3]主表!L3","v":1},{"$f":"[3]主表!M3","v":1},{"$f":"[3]主表!N3","v":0},{"$f":"[3]主表!$G3","v":210},{"$f":"[3]升级!$H3","v":1000},{"$f":"MAX(0.1,ROUND(100/(24*3600)*VLOOKUP(B5,[1]ResourceLevelConfig!$A:$E,5,FALSE),2))","v":0.12},-1,2,1,1,{"$f":"ROUND(10^(B5*0.01+2.07),0)","v":120},null,{"$f":"50*W5","v":50},null,1,1,1]
[2,2,1,1,2,{"$f":"_xlfn.TEXTJOIN(\";\",1,J6:L6)","v":"225;235;239"},"练气","前期.","二重",225,235,239,{"$f":"ROUND([1]ResourceLevelConfig!$E6*[1]ResourceLevelConfig!$L6*0.1,0)*10","v":410},{"$f":"IF(E6=10,100004,-1)","v":-1},{"$f":"IF(N6=-1,-1,20)","v":-1},-1,-1,{"$f":"IF(I6=10,\"1204;1203;1202;1201\",-1)","v":-1},{"$f":"IF(R6=-1,-1,\"1;1;1;1\")","v":-1},{"$f":"IF(G6=G7,0,CONCATENATE(80*ROUND(VLOOKUP(B6,[2]MonsterPowerUpConfig!$A:$I,9,FALSE),0),\";\",120*ROUND(VLOOKUP(B6,[2]MonsterPowerUpConfig!$A:$I,9,FALSE),0)))","v":0},{"$f":"[3]主表!K4","v":5.4459622494945146},{"$f":"[3]主表!L4","v":1.0135018283999999},{"$f":"[3]主表!M4","v":1.0135018283999999},{"$f":"[3]主表!N4","v":0},{"$f":"[3]主表!$G4","v":213},{"$f":"[3]升级!$H4","v":1000},{"$f":"MAX(0.1,ROUND(100/(24*3600)*VLOOKUP(B6,[1]ResourceLevelConfig!$A:$E,5,FALSE),2))","v":0.12},-1,{"$f":"AC5","v":2},{"$f":"AD5","v":1},1,{"$f":"MAX(AF5+10,ROUND(10^(B6*0.01+1.405),0))","v":130},null,50.675091419999994,null,1,1,2]
[3,3,1,1,3,"225;235;240","练气","前期.","三重",225,235,240,{"$f":"ROUND([1]ResourceLevelConfig!$E7*[1]ResourceLevelConfig!$L7*0.1,0)*10","v":420},-1,-1,-1,-1,-1,-1,{"$f":"IF(G7=G8,0,CONCATENATE(80*ROUND(VLOOKUP(B7,[2]MonsterPowerUpConfig!$A:$I,9,FALSE),0),\";\",120*ROUND(VLOOKUP(B7,[2]MonsterPowerUpConfig!$A:$I,9,FALSE),0)))","v":0},{"$f":"[3]主表!K5","v":5.9030556136694194},{"$f":"[3]主表!L5","v":1.0271859561701429},{"$f":"[3]主表!M5","v":1.0271859561701429},{"$f":"[3]主表!N5","v":0},{"$f":"[3]主表!$G5","v":215},{"$f":"[3]升级!$H5","v":1000},{"$f":"MAX(0.1,ROUND(100/(24*3600)*VLOOKUP(B7,[1]ResourceLevelConfig!$A:$E,5,FALSE),2))","v":0.12},-1,{"$f":"AC6","v":2},{"$f":"AD6","v":1},{"$f":"AE6","v":1},140,null,51.359297808507144,null,1,1,3]
[4,4,1,1,4,"225;235;241","练气","前期.","四重",225,235,241,{"$f":"ROUND([1]ResourceLevelConfig!$E8*[1]ResourceLevelConfig!$L8*0.1,0)*10","v":430},-1,-1,-1,-1,-1,-1,{"$f":"IF(G8=G9,0,CONCATENATE(80*ROUND(VLOOKUP(B8,[2]MonsterPowerUpConfig!$A:$I,9,FALSE),0),\";\",120*ROUND(VLOOKUP(B8,[2]MonsterPowerUpConfig!$A:$I,9,FALSE),0)))","v":0},{"$f":"[3]主表!K6","v":6.3714993746881552},{"$f":"[3]主表!L6","v":1.0410548446852419},{"$f":"[3]主表!M6","v":1.0410548446852419},{"$f":"[3]主表!N6","v":0},{"$f":"[3]主表!$G6","v":218},{"$f":"[3]升级!$H6","v":1000},{"$f":"MAX(0.1,ROUND(100/(24*3600)*VLOOKUP(B8,[1]ResourceLevelConfig!$A:$E,5,FALSE),2))","v":0.12},-1,2,1,1,150,null,52.052742234262098,null,1,1,4]
[5,5,1,1,5,"225;235;242","练气","前期.","五重",225,235,242,{"$f":"ROUND([1]ResourceLevelConfig!$E9*[1]ResourceLevelConfig!$L9*0.1,0)*10","v":440},-1,-1,-1,-1,-1,-1,{"$f":"IF(G9=G10,0,CONCATENATE(80*ROUND(VLOOKUP(B9,[2]MonsterPowerUpConfig!$A:$I,9,FALSE),0),\";\",120*ROUND(VLOOKUP(B9,[2]MonsterPowerUpConfig!$A:$I,9,FALSE),0)))","v":0},{"$f":"[3]主表!K7","v":6.8515167069392513},{"$f":"[3]主表!L7","v":1.0551109885531706},{"$f":"[3]主表!M7","v":1.0551109885531706},{"$f":"[3]主表!N7","v":0},{"$f":"[3]主表!$G7","v":221},{"$f":"[3]升级!$H7","v":1000},{"$f":"MAX(0.1,ROUND(100/(24*3600)*VLOOKUP(B9,[1]ResourceLevelConfig!$A:$E,5,FALSE),2))","v":0.12},-1,2,1,1,160,null,52.755549427658529,null,1,1,5]
[6,6,1,1,6,"225;235;243","练气","前期.","六重",225,235,243,{"$f":"ROUND([1]ResourceLevelConfig!$E10*[1]ResourceLevelConfig!$L10*0.1,0)*10","v":500},-1,-1,-1,-1,-1,-1,{"$f":"IF(G10=G11,0,CONCATENATE(80*ROUND(VLOOKUP(B10,[2]MonsterPowerUpConfig!$A:$I,9,FALSE),0),\";\",120*ROUND(VLOOKUP(B10,[2]MonsterPowerUpConfig!$A:$I,9,FALSE),0)))","v":0},{"$f":"[3]主表!K8","v":7.3433347421656343},{"$f":"[3]主表!L8","v":1.0693569160635699},{"$f":"[3]主表!M8","v":1.0693569160635699},{"$f":"[3]主表!N8","v":0},{"$f":"[3]主表!$G8","v":224},{"$f":"[3]升级!$H8","v":1000},{"$f":"MAX(0.1,ROUND(100/(24*3600)*VLOOKUP(B10,[1]ResourceLevelConfig!$A:$E,5,FALSE),2))","v":0.13},-1,2,1,1,170,null,53.467845803178491,null,1,1,6]
[7,7,1,1,7,"225;235;244","练气","前期.","七重",225,235,244,{"$f":"ROUND([1]ResourceLevelConfig!$E11*[1]ResourceLevelConfig!$L11*0.1,0)*10","v":510},-1,-1,-1,-1,-1,-1,{"$f":"IF(G11=G12,0,CONCATENATE(80*ROUND(VLOOKUP(B11,[2]MonsterPowerUpConfig!$A:$I,9,FALSE),0),\";\",120*ROUND(VLOOKUP(B11,[2]MonsterPowerUpConfig!$A:$I,9,FALSE),0)))","v":0},{"$f":"[3]主表!K9","v":7.8471846356431243},{"$f":"[3]主表!L9","v":1.0837951896426135},{"$f":"[3]主表!M9","v":1.0837951896426135},{"$f":"[3]主表!N9","v":0},{"$f":"[3]主表!$G9","v":227},{"$f":"[3]升级!$H9","v":1000},{"$f":"MAX(0.1,ROUND(100/(24*3600)*VLOOKUP(B11,[1]ResourceLevelConfig!$A:$E,5,FALSE),2))","v":0.13},-1,2,1,1,180,null,54.189759482130675,null,1,1,7]
[8,8,1,1,8,"225;235;245","练气","前期.","八重",225,235,245,{"$f":"ROUND([1]ResourceLevelConfig!$E12*[1]ResourceLevelConfig!$L12*0.1,0)*10","v":520},-1,-1,-1,-1,-1,-1,{"$f":"IF(G12=G13,0,CONCATENATE(80*ROUND(VLOOKUP(B12,[2]MonsterPowerUpConfig!$A:$I,9,FALSE),0),\";\",120*ROUND(VLOOKUP(B12,[2]MonsterPowerUpConfig!$A:$I,9,FALSE),0)))","v":0},{"$f":"[3]主表!K10","v":8.3633016334245465},{"$f":"[3]主表!L10","v":1.0984284063139134},{"$f":"[3]主表!M10","v":1.0984284063139134},{"$f":"[3]主表!N10","v":0},{"$f":"[3]主表!$G10","v":230},{"$f":"[3]升级!$H10","v":1000},{"$f":"MAX(0.1,ROUND(100/(24*3600)*VLOOKUP(B12,[1]ResourceLevelConfig!$A:$E,5,FALSE),2))","v":0.13},-1,2,1,1,190,null,54.92142031569567,null,1,1,8]
[9,9,1,1,9,"225;235;246","练气","前期.","九重",225,235,246,{"$f":"ROUND([1]ResourceLevelConfig!$E13*[1]ResourceLevelConfig!$L13*0.1,0)*10","v":530},-1,-1,-1,-1,-1,-1,{"$f":"IF(G13=G14,0,CONCATENATE(80*ROUND(VLOOKUP(B13,[2]MonsterPowerUpConfig!$A:$I,9,FALSE),0),\";\",120*ROUND(VLOOKUP(B13,[2]MonsterPowerUpConfig!$A:$I,9,FALSE),0)))","v":0},{"$f":"[3]主表!K11","v":8.8919251406662312},{"$f":"[3]主表!L11","v":1.113259198165649},{"$f":"[3]主表!M11","v":1.113259198165649},{"$f":"[3]主表!N11","v":0},{"$f":"[3]主表!$G11","v":233},{"$f":"[3]升级!$H11","v":1000},{"$f":"MAX(0.1,ROUND(100/(24*3600)*VLOOKUP(B13,[1]ResourceLevelConfig!$A:$E,5,FALSE),2))","v":0.13},-1,2,1,1,200,null,55.662959908282453,null,1,1,9]
[10,10,1,1,10,"225;235;247","练气","前期.","十重",225,235,247,{"$f":"ROUND([1]ResourceLevelConfig!$E14*[1]ResourceLevelConfig!$L14*0.1,0)*10","v":540},100004,{"$f":"AM14","v":90},{"$f":"AN14","v":1201},{"$f":"AO14","v":1},{"$f":"_xlfn.TEXTJOIN(\";\",1,AP14,AR14,AT14,AV14)","v":"1202;1201;1201;1201"},{"$f":"_xlfn.TEXTJOIN(\";\",1,AQ14,AS14,AU14,AW14)","v":"1;1;1;1"},{"$f":"IF(G14=G15,0,CONCATENATE(80*ROUND(VLOOKUP(B14,[2]MonsterPowerUpConfig!$A:$I,9,FALSE),0),\";\",120*ROUND(VLOOKUP(B14,[2]MonsterPowerUpConfig!$A:$I,9,FALSE),0)))","v":0},{"$f":"[3]主表!K12","v":9.4332987910537938},{"$f":"[3]主表!L12","v":1.1282902328240032},{"$f":"[3]主表!M12","v":1.1282902328240032},{"$f":"[3]主表!N12","v":0},{"$f":"[3]主表!$G12","v":236},{"$f":"[3]升级!$H12","v":1000},{"$f":"MAX(0.1,ROUND(100/(24*3600)*VLOOKUP(B14,[1]ResourceLevelConfig!$A:$E,5,FALSE),2))","v":0.13},20,2,1,1,210,null,56.414511641200157,null,1,1,10,90,1201,1,1202,1,1201,1,1201,1,1201,1,{"$f":"VLOOKUP(AN14,[4]ItemConfig!$A:$AC,29,FALSE)*AO14+AM14","v":100},{"$f":"VLOOKUP(AP14,[4]ItemConfig!$A:$AC,29,FALSE)*AQ14","v":15},{"$f":"VLOOKUP(AR14,[4]ItemConfig!$A:$AC,29,FALSE)*AS14","v":10},{"$f":"VLOOKUP(AT14,[4]ItemConfig!$A:$AC,29,FALSE)*AU14","v":10},{"$f":"VLOOKUP(AV14,[4]ItemConfig!$A:$AC,29,FALSE)*AW14","v":10},{"$f":"CONCATENATE(AX14,\" + \",SUM(AY14:BB14))","v":"100 + 45"}]
[11,11,1,2,1,"225;236;238","练气","中期.","一重",225,236,238,{"$f":"ROUND([1]ResourceLevelConfig!$E15*[1]ResourceLevelConfig!$L15*0.1,0)*10","v":550},-1,-1,-1,-1,-1,-1,{"$f":"IF(G15=G16,0,CONCATENATE(80*ROUND(VLOOKUP(B15,[2]MonsterPowerUpConfig!$A:$I,9,FALSE),0),\";\",120*ROUND(VLOOKUP(B15,[2]MonsterPowerUpConfig!$A:$I,9,FALSE),0)))","v":0},{"$f":"[3]主表!K13","v":10.840076713451081},{"$f":"[3]主表!L13","v":1.2411192561064035},{"$f":"[3]主表!M13","v":1.2411192561064035},{"$f":"[3]主表!N13","v":0},{"$f":"[3]主表!$G13","v":262},{"$f":"[3]升级!$H13","v":1000},{"$f":"MAX(0.1,ROUND(100/(24*3600)*VLOOKUP(B15,[1]ResourceLevelConfig!$A:$E,5,FALSE),2))","v":0.13},-1,2,1,1,220,null,null,null,1,1,11]
[12,12,1,2,2,"225;236;239","练气","中期.","二重",225,236,239,{"$f":"ROUND([1]ResourceLevelConfig!$E16*[1]ResourceLevelConfig!$L16*0.1,0)*10","v":560},-1,-1,-1,-1,-1,-1,{"$f":"IF(G16=G17,0,CONCATENATE(80*ROUND(VLOOKUP(B16,[2]MonsterPowerUpConfig!$A:$I,9,FALSE),0),\";\",120*ROUND(VLOOKUP(B16,[2]MonsterPowerUpConfig!$A:$I,9,FALSE),0)))","v":0},{"$f":"[3]主表!K14","v":11.45614300832368},{"$f":"[3]主表!L14","v":1.2578766353262878},{"$f":"[3]主表!M14","v":1.2578766353262878},{"$f":"[3]主表!N14","v":0},{"$f":"[3]主表!$G14","v":265},{"$f":"[3]升级!$H14","v":1000},{"$f":"MAX(0.1,ROUND(100/(24*3600)*VLOOKUP(B16,[1]ResourceLevelConfig!$A:$E,5,FALSE),2))","v":0.13},-1,{"$f":"AC15","v":2},{"$f":"AD15","v":1},1,230,null,null,null,1,1,12]
[13,13,1,2,3,"225;236;240","练气","中期.","三重",225,236,240,{"$f":"ROUND([1]ResourceLevelConfig!$E17*[1]ResourceLevelConfig!$L17*0.1,0)*10","v":570},-1,-1,-1,-1,-1,-1,{"$f":"IF(G17=G18,0,CONCATENATE(80*ROUND(VLOOKUP(B17,[2]MonsterPowerUpConfig!$A:$I,9,FALSE),0),\";\",120*ROUND(VLOOKUP(B17,[2]MonsterPowerUpConfig!$A:$I,9,FALSE),0)))","v":0},{"$f":"[3]主表!K15","v":12.086869206831903},{"$f":"[3]主表!L15","v":1.2748602698048324},{"$f":"[3]主表!M15","v":1.2748602698048324},{"$f":"[3]主表!N15","v":0},{"$f":"[3]主表!$G15","v":269},{"$f":"[3]升级!$H15","v":1000},{"$f":"MAX(0.1,ROUND(100/(24*3600)*VLOOKUP(B17,[1]ResourceLevelConfig!$A:$E,5,FALSE),2))","v":0.13},-1,{"$f":"AC16","v":2},{"$f":"AD16","v":1},{"$f":"AE16","v":1},240,null,null,null,1,1,13]
[14,14,1,2,4,"225;236;241","练气","中期.","四重",225,236,241,{"$f":"ROUND([1]ResourceLevelConfig!$E18*[1]ResourceLevelConfig!$L18*0.1,0)*10","v":580},-1,-1,-1,-1,-1,-1,{"$f":"IF(G18=G19,0,CONCATENATE(80*ROUND(VLOOKUP(B18,[2]MonsterPowerUpConfig!$A:$I,9,FALSE),0),\";\",120*ROUND(VLOOKUP(B18,[2]MonsterPowerUpConfig!$A:$I,9,FALSE),0)))","v":0},{"$f":"[3]主表!K16","v":12.732538871484726},{"$f":"[3]主表!L16","v":1.2920732144017149},{"$f":"[3]主表!M16","v":1.2920732144017149},{"$f":"[3]主表!N16","v":0},{"$f":"[3]主表!$G16","v":273},{"$f":"[3]升级!$H16","v":1000},{"$f":"MAX(0.1,ROUND(100/(24*3600)*VLOOKUP(B18,[1]ResourceLevelConfig!$A:$E,5,FALSE),2))","v":0.13},-1,2,1,1,250,null,null,null,1,1,14]
[15,15,1,2,5,"225;236;242","练气","中期.","五重",225,236,242,{"$f":"ROUND([1]ResourceLevelConfig!$E19*[1]ResourceLevelConfig!$L19*0.1,0)*10","v":650},-1,-1,-1,-1,-1,-1,{"$f":"IF(G19=G20,0,CONCATENATE(80*ROUND(VLOOKUP(B19,[2]MonsterPowerUpConfig!$A:$I,9,FALSE),0),\";\",120*ROUND(VLOOKUP(B19,[2]MonsterPowerUpConfig!$A:$I,9,FALSE),0)))","v":0},{"$f":"[3]主表!K17","v":13.393440549524598},{"$f":"[3]主表!L17","v":1.3095185652228032},{"$f":"[3]主表!M17","v":1.3095185652228032},{"$f":"[3]主表!N17","v":0},{"$f":"[3]主表!$G17","v":277},{"$f":"[3]升级!$H17","v":1000},{"$f":"MAX(0.1,ROUND(100/(24*3600)*VLOOKUP(B19,[1]ResourceLevelConfig!$A:$E,5,FALSE),2))","v":0.14000000000000001},-1,2,1,1,260,null,null,null,1,1,15]
[16,16,1,2,6,"225;236;243","练气","中期.","六重",225,236,243,{"$f":"ROUND([1]ResourceLevelConfig!$E20*[1]ResourceLevelConfig!$L20*0.1,0)*10","v":660},-1,-1,-1,-1,-1,-1,{"$f":"IF(G20=G21,0,CONCATENATE(80*ROUND(VLOOKUP(B20,[2]MonsterPowerUpConfig!$A:$I,9,FALSE),0),\";\",120*ROUND(VLOOKUP(B20,[2]MonsterPowerUpConfig!$A:$I,9,FALSE),0)))","v":0},{"$f":"[3]主表!K18","v":14.069867855840208},{"$f":"[3]主表!L18","v":1.3271994601770556},{"$f":"[3]主表!M18","v":1.3271994601770556},{"$f":"[3]主表!N18","v":0},{"$f":"[3]主表!$G18","v":281},{"$f":"[3]升级!$H18","v":1000},{"$f":"MAX(0.1,ROUND(100/(24*3600)*VLOOKUP(B20,[1]ResourceLevelConfig!$A:$E,5,FALSE),2))","v":0.14000000000000001},-1,2,1,1,270,null,null,null,1,1,16]
[17,17,1,2,7,"225;236;244","练气","中期.","七重",225,236,244,{"$f":"ROUND([1]ResourceLevelConfig!$E21*[1]ResourceLevelConfig!$L21*0.1,0)*10","v":670},-1,-1,-1,-1,-1,-1,{"$f":"IF(G21=G22,0,CONCATENATE(80*ROUND(VLOOKUP(B21,[2]MonsterPowerUpConfig!$A:$I,9,FALSE),0),\";\",120*ROUND(VLOOKUP(B21,[2]MonsterPowerUpConfig!$A:$I,9,FALSE),0)))","v":0},{"$f":"[3]主表!K19","v":14.762119557209486},{"$f":"[3]主表!L19","v":1.3451190795409387},{"$f":"[3]主表!M19","v":1.3451190795409387},{"$f":"[3]主表!N19","v":0},{"$f":"[3]主表!$G19","v":285},{"$f":"[3]升级!$H19","v":1000},{"$f":"MAX(0.1,ROUND(100/(24*3600)*VLOOKUP(B21,[1]ResourceLevelConfig!$A:$E,5,FALSE),2))","v":0.14000000000000001},-1,2,1,1,280,null,null,null,1,1,17]
[18,18,1,2,8,"225;236;245","练气","中期.","八重",225,236,245,{"$f":"ROUND([1]ResourceLevelConfig!$E22*[1]ResourceLevelConfig!$L22*0.1,0)*10","v":680},-1,-1,-1,-1,-1,-1,{"$f":"IF(G22=G23,0,CONCATENATE(80*ROUND(VLOOKUP(B22,[2]MonsterPowerUpConfig!$A:$I,9,FALSE),0),\";\",120*ROUND(VLOOKUP(B22,[2]MonsterPowerUpConfig!$A:$I,9,FALSE),0)))","v":0},{"$f":"[3]主表!K20","v":15.47049965789364},{"$f":"[3]主表!L20","v":1.3632806465304663},{"$f":"[3]主表!M20","v":1.3632806465304663},{"$f":"[3]主表!N20","v":0},{"$f":"[3]主表!$G20","v":289},{"$f":"[3]升级!$H20","v":1000},{"$f":"MAX(0.1,ROUND(100/(24*3600)*VLOOKUP(B22,[1]ResourceLevelConfig!$A:$E,5,FALSE),2))","v":0.14000000000000001},-1,2,1,1,290,null,null,null,1,1,18]
[19,19,1,2,9,"225;236;246","练气","中期.","九重",225,236,246,{"$f":"ROUND([1]ResourceLevelConfig!$E23*[1]ResourceLevelConfig!$L23*0.1,0)*10","v":700},-1,-1,-1,-1,-1,-1,{"$f":"IF(G23=G24,0,CONCATENATE(80*ROUND(VLOOKUP(B23,[2]MonsterPowerUpConfig!$A:$I,9,FALSE),0),\";\",120*ROUND(VLOOKUP(B23,[2]MonsterPowerUpConfig!$A:$I,9,FALSE),0)))","v":0},{"$f":"[3]主表!K21","v":16.195317486603365},{"$f":"[3]主表!L21","v":1.3816874278809614},{"$f":"[3]主表!M21","v":1.3816874278809614},{"$f":"[3]主表!N21","v":0},{"$f":"[3]主表!$G21","v":293},{"$f":"[3]升级!$H21","v":1000},{"$f":"MAX(0.1,ROUND(100/(24*3600)*VLOOKUP(B23,[1]ResourceLevelConfig!$A:$E,5,FALSE),2))","v":0.14000000000000001},-1,2,1,1,300,null,null,null,1,1,19]
[20,20,1,2,10,"225;236;247","练气","中期.","十重",225,236,247,{"$f":"ROUND([1]ResourceLevelConfig!$E24*[1]ResourceLevelConfig!$L24*0.1,0)*10","v":710},100004,{"$f":"AM24","v":85},{"$f":"AN24","v":1201},{"$f":"AO24","v":1},{"$f":"_xlfn.TEXTJOIN(\";\",1,AP24,AR24,AT24,AV24)","v":"1202;1201;1201;1201"},{"$f":"_xlfn.TEXTJOIN(\";\",1,AQ24,AS24,AU24,AW24)","v":"1;1;1;1"},{"$f":"IF(G24=G25,0,CONCATENATE(80*ROUND(VLOOKUP(B24,[2]MonsterPowerUpConfig!$A:$I,9,FALSE),0),\";\",120*ROUND(VLOOKUP(B24,[2]MonsterPowerUpConfig!$A:$I,9,FALSE),0)))","v":0},{"$f":"[3]主表!K22","v":16.936887784858655},{"$f":"[3]主表!L22","v":1.4003427344346475},{"$f":"[3]主表!M22","v":1.4003427344346475},{"$f":"[3]主表!N22","v":0},{"$f":"[3]主表!$G22","v":298},{"$f":"[3]升级!$H22","v":1000},{"$f":"MAX(0.1,ROUND(100/(24*3600)*VLOOKUP(B24,[1]ResourceLevelConfig!$A:$E,5,FALSE),2))","v":0.14000000000000001},20,2,1,1,310,null,null,null,1,1,20,85,1201,1,1202,1,1201,1,1201,1,1201,1,{"$f":"VLOOKUP(AN24,[4]ItemConfig!$A:$AC,29,FALSE)*AO24+AM24","v":95},{"$f":"VLOOKUP(AP24,[4]ItemConfig!$A:$AC,29,FALSE)*AQ24","v":15},{"$f":"VLOOKUP(AR24,[4]ItemConfig!$A:$AC,29,FALSE)*AS24","v":10},{"$f":"VLOOKUP(AT24,[4]ItemConfig!$A:$AC,29,FALSE)*AU24","v":10},{"$f":"VLOOKUP(AV24,[4]ItemConfig!$A:$AC,29,FALSE)*AW24","v":10},{"$f":"CONCATENATE(AX24,\" + \",SUM(AY24:BB24))","v":"95 + 45"}]
[21,21,1,3,1,"225;237;238","练气","后期.","一重",225,237,238,{"$f":"ROUND([1]ResourceLevelConfig!$E25*[1]ResourceLevelConfig!$L25*0.1,0)*10","v":720},-1,-1,-1,-1,-1,-1,{"$f":"IF(G25=G26,0,CONCATENATE(80*ROUND(VLOOKUP(B25,[2]MonsterPowerUpConfig!$A:$I,9,FALSE),0),\";\",120*ROUND(VLOOKUP(B25,[2]MonsterPowerUpConfig!$A:$I,9,FALSE),0)))","v":0},{"$f":"[3]主表!K23","v":19.205770854078942},{"$f":"[3]主表!L23","v":1.5403770078781123},{"$f":"[3]主表!M23","v":1.5403770078781123},{"$f":"[3]主表!N23","v":0},{"$f":"[3]主表!$G23","v":346},{"$f":"[3]升级!$H23","v":1000},{"$f":"MAX(0.1,ROUND(100/(24*3600)*VLOOKUP(B25,[1]ResourceLevelConfig!$A:$E,5,FALSE),2))","v":0.14000000000000001},-1,3,1,1,320,null,null,null,1,1,21]
[22,22,1,3,2,"225;237;239","练气","后期.","二重",225,237,239,{"$f":"ROUND([1]ResourceLevelConfig!$E26*[1]ResourceLevelConfig!$L26*0.1,0)*10","v":730},-1,-1,-1,-1,-1,-1,{"$f":"IF(G26=G27,0,CONCATENATE(80*ROUND(VLOOKUP(B26,[2]MonsterPowerUpConfig!$A:$I,9,FALSE),0),\";\",120*ROUND(VLOOKUP(B26,[2]MonsterPowerUpConfig!$A:$I,9,FALSE),0)))","v":0},{"$f":"[3]主表!K24","v":20.048044341785008},{"$f":"[3]主表!L24","v":1.5611749139097879},{"$f":"[3]主表!M24","v":1.5611749139097879},{"$f":"[3]主表!N24","v":0},{"$f":"[3]主表!$G24","v":351},{"$f":"[3]升级!$H24","v":1000},{"$f":"MAX(0.1,ROUND(100/(24*3600)*VLOOKUP(B26,[1]ResourceLevelConfig!$A:$E,5,FALSE),2))","v":0.14000000000000001},-1,{"$f":"AC25","v":3},{"$f":"AD25","v":1},{"$f":"AE25","v":1},330,null,null,null,1,1,22]
[23,23,1,3,3,"225;237;240","练气","后期.","三重",225,237,240,{"$f":"ROUND([1]ResourceLevelConfig!$E27*[1]ResourceLevelConfig!$L27*0.1,0)*10","v":740},-1,-1,-1,-1,-1,-1,{"$f":"IF(G27=G28,0,CONCATENATE(80*ROUND(VLOOKUP(B27,[2]MonsterPowerUpConfig!$A:$I,9,FALSE),0),\";\",120*ROUND(VLOOKUP(B27,[2]MonsterPowerUpConfig!$A:$I,9,FALSE),0)))","v":0},{"$f":"[3]主表!K25","v":20.909561093755016},{"$f":"[3]主表!L25","v":1.5822536296997824},{"$f":"[3]主表!M25","v":1.5822536296997824},{"$f":"[3]主表!N25","v":0},{"$f":"[3]主表!$G25","v":356},{"$f":"[3]升级!$H25","v":1000},{"$f":"MAX(0.1,ROUND(100/(24*3600)*VLOOKUP(B27,[1]ResourceLevelConfig!$A:$E,5,FALSE),2))","v":0.14000000000000001},-1,{"$f":"AC26","v":3},1,1,340,null,null,null,1,1,23]
[24,24,1,3,4,"225;237;241","练气","后期.","四重",225,237,241,{"$f":"ROUND([1]ResourceLevelConfig!$E28*[1]ResourceLevelConfig!$L28*0.1,0)*10","v":820},-1,-1,-1,-1,-1,-1,{"$f":"IF(G28=G29,0,CONCATENATE(80*ROUND(VLOOKUP(B28,[2]MonsterPowerUpConfig!$A:$I,9,FALSE),0),\";\",120*ROUND(VLOOKUP(B28,[2]MonsterPowerUpConfig!$A:$I,9,FALSE),0)))","v":0},{"$f":"[3]主表!K26","v":21.79068720256657},{"$f":"[3]主表!L26","v":1.6036169466932659},{"$f":"[3]主表!M26","v":1.6036169466932659},{"$f":"[3]主表!N26","v":0},{"$f":"[3]主表!$G26","v":361},{"$f":"[3]升级!$H26","v":1000},{"$f":"MAX(0.1,ROUND(100/(24*3600)*VLOOKUP(B28,[1]ResourceLevelConfig!$A:$E,5,FALSE),2))","v":0.15},-1,3,1,1,350,null,null,null,1,1,24]
[25,25,1,3,5,"225;237;242","练气","后期.","五重",225,237,242,{"$f":"ROUND([1]ResourceLevelConfig!$E29*[1]ResourceLevelConfig!$L29*0.1,0)*10","v":830},-1,-1,-1,-1,-1,-1,{"$f":"IF(G29=G30,0,CONCATENATE(80*ROUND(VLOOKUP(B29,[2]MonsterPowerUpConfig!$A:$I,9,FALSE),0),\";\",120*ROUND(VLOOKUP(B29,[2]MonsterPowerUpConfig!$A:$I,9,FALSE),0)))","v":0},{"$f":"[3]主表!K27","v":22.691795138600636},{"$f":"[3]主表!L27","v":1.6252687075268504},{"$f":"[3]主表!M27","v":1.6252687075268504},{"$f":"[3]主表!N27","v":0},{"$f":"[3]主表!$G27","v":367},{"$f":"[3]升级!$H27","v":1000},{"$f":"MAX(0.1,ROUND(100/(24*3600)*VLOOKUP(B29,[1]ResourceLevelConfig!$A:$E,5,FALSE),2))","v":0.15},-1,3,1,1,360,null,null,null,1,1,25]
[26,26,1,3,6,"225;237;243","练气","后期.","六重",225,237,243,{"$f":"ROUND([1]ResourceLevelConfig!$E30*[1]ResourceLevelConfig!$L30*0.1,0)*10","v":840},-1,-1,-1,-1,-1,-1,{"$f":"IF(G30=G31,0,CONCATENATE(80*ROUND(VLOOKUP(B30,[2]MonsterPowerUpConfig!$A:$I,9,FALSE),0),\";\",120*ROUND(VLOOKUP(B30,[2]MonsterPowerUpConfig!$A:$I,9,FALSE),0)))","v":0},{"$f":"[3]主表!K28","v":23.613263855527098},{"$f":"[3]主表!L28","v":1.6472128067197676},{"$f":"[3]主表!M28","v":1.6472128067197676},{"$f":"[3]主表!N28","v":0},{"$f":"[3]主表!$G28","v":372},{"$f":"[3]升级!$H28","v":1000},{"$f":"MAX(0.1,ROUND(100/(24*3600)*VLOOKUP(B30,[1]ResourceLevelConfig!$A:$E,5,FALSE),2))","v":0.15},-1,3,1,1,370,null,null,null,1,1,26]
{"$rows_left_out":275}
{"sheet":"HeroQiangDuAddConfig","index":1,"n_rows":64,"n_cols":2,"rows_kept":64,"cut":false,"hidden":false,"merged":[]}
["ID","qiangDuZhi"]
["int","float"]
[]
["ID","玩家修为境界（等级）"]
[1,1]
[2,1.085]
[3,1.17]
[4,1.2549999999999999]
[5,1.34]
[6,1.425]
[7,1.51]
[8,1.595]
[9,1.68]
[10,1.7649999999999999]
[11,1.85]
[12,1.9350000000000001]
[13,2.02]
[14,2.105]
[15,2.19]
[16,2.2749999999999999]
[17,2.36]
[18,2.4449999999999998]
[19,2.5299999999999998]
[20,2.6150000000000002]
[21,2.7]
[22,2.7850000000000001]
[23,2.87]
[24,2.9550000000000001]
[25,3.04]
[26,3.125]
{"$rows_left_out":34}