{"text_format":"2","workbook":"xlsx","n_sheets":3,"sheets":["LevelbattleConfig","GroupConfig","强度验算"],"not_rendered":{"charts":0,"images":0,"macros":0,"external_links":3,"defined_names":2,"comments":0,"pivot_tables":0},"unopened":[],"bounds":{"document_bytes":16777216,"sheet_cells":100000,"run_cost":"one","rows_first":2000,"rows_last":500,"rows_between":2000,"halvings":0,"cell_chars":16384,"cell_head_chars":4096},"cells_cut":0,"cells_raw":0,"read":"whole","date_system":"1900"}

{"sheet":"LevelbattleConfig","index":0,"n_rows":219,"n_cols":18,"rows_kept":219,"cut":false,"hidden":false,"merged":[]}
["ID",null,"Group","awardDrop","awardNum","combatTime","combatType","MonsterGroupTruePower","MonsterGroupPower"]
["int",null,"int[]","int[]","int[]","float","int","int","int"]
[]
["战斗组ID","使用位置","包含的组ID\n（就是第二页的ID)","奖励随机掉落组","奖励道具数量","用时(秒）","玩法类型\n1.正常\n2.追逐\n3.站桩\n4.保卫水晶\n5.至少完成x波 （406260）\n6.至少坚持x秒 （406261）","怪物战斗组修为（实际）","怪物战斗组修为（表现）","评分修正\n例如3人参战填75%",null,"怪物等级上浮",{"$nulls":4},"事件ID","怪物等级"]
[100001,"主线1-1",{"$f":"A5","v":100001},-1,-1,120,1,100,100,null,"1-1"]
[100002,"主线1-1",{"$f":"A6","v":100002},-1,-1,120,1,100,100,null,"1-1"]
[100003,"主线1-1",{"$f":"A7","v":100003},-1,-1,120,1,100,100,null,"1-1",1]
[100004,"boss",{"$f":"A8","v":100004},-1,-1,120,1,100,100,null,"1-1",1]
[]
[]
[1002,{"$f":"_xlfn.TEXTJOIN(\"-\",1,M11:N11)","v":"主线-击败结界兽"},1002,-1,-1,120,1,100,100,null,null,null,"主线","击败结界兽",10004,5,{"$f":"VLOOKUP(A11,[1]EventLinkConfig!$Y:$AM,15,FALSE)","v":10004},{"$f":"VLOOKUP(Q11,[1]EventConfig!$A:$P,16,FALSE)","v":6}]
[{"$f":"A11+1","v":1003},"主线-击败痴道人",1003,-1,-1,120,1,100,100,null,null,null,"主线","击败痴道人",10007,15,{"$f":"VLOOKUP(A12,[1]EventLinkConfig!$Y:$AM,15,FALSE)","v":10007},{"$f":"VLOOKUP(Q12,[1]EventConfig!$A:$P,16,FALSE)","v":16}]
[1004,"主线-妖兽横行",1004,-1,-1,120,1,100,100,null,null,null,"主线","妖兽横行",10010,25,10010,{"$f":"VLOOKUP(Q13,[1]EventConfig!$A:$P,16,FALSE)","v":25}]
[1005,"主线-击败后山小妖",1005,-1,-1,120,1,100,100,null,null,null,"主线","击败后山小妖",10015,45,10015,{"$f":"VLOOKUP(Q14,[1]EventConfig!$A:$P,16,FALSE)","v":46}]
[1006,"主线-击败夜袭的妖兽",1006,-1,-1,120,1,100,100,null,null,null,"主线","击败夜袭的妖兽",10016,50,10016,{"$f":"VLOOKUP(Q15,[1]EventConfig!$A:$P,16,FALSE)","v":51}]
[1007,"主线-击败峰顶的妖王",1007,-1,-1,120,1,100,100,null,null,null,"主线","击败峰顶的妖王",10017,55,10017,{"$f":"VLOOKUP(Q16,[1]EventConfig!$A:$P,16,FALSE)","v":56}]
[1008,"主线-击败仙山的阵眼妖兽",1008,-1,-1,120,1,100,100,null,null,null,"主线","击败仙山的阵眼妖兽",10023,85,10023,{"$f":"VLOOKUP(Q17,[1]EventConfig!$A:$P,16,FALSE)","v":86}]
[1009,"主线-击杀灵兽获得天肥",1009,-1,-1,120,1,100,100,null,null,null,"主线","击杀灵兽获得天肥",10025,95,10025,{"$f":"VLOOKUP(Q18,[1]EventConfig!$A:$P,16,FALSE)","v":101}]
[1010,{"$f":"_xlfn.TEXTJOIN(\"-\",1,M19:N19)","v":"主线-击败小麻雀的幻影"},{"$f":"A19","v":1010},-1,-1,120,1,100,100,null,null,null,"主线","击败小麻雀的幻影",10027,100,{"$f":"VLOOKUP(A19,[1]EventLinkConfig!$Y:$AM,15,FALSE)","v":10027},{"$f":"VLOOKUP(Q19,[1]EventConfig!$A:$P,16,FALSE)","v":121}]
[1011,{"$f":"_xlfn.TEXTJOIN(\"-\",1,M20:N20)","v":"主线-击败痴道人的幻影"},{"$f":"A20","v":1011},-1,-1,120,1,100,100,null,null,null,"主线","击败痴道人的幻影",10027,110,{"$f":"VLOOKUP(A20,[1]EventLinkConfig!$Y:$AM,15,FALSE)","v":10027},{"$f":"VLOOKUP(Q20,[1]EventConfig!$A:$P,16,FALSE)","v":121}]
[1012,{"$f":"_xlfn.TEXTJOIN(\"-\",1,M21:N21)","v":"主线-樗木之灵的幻影"},{"$f":"A21","v":1012},-1,-1,120,1,100,100,null,null,null,"主线","樗木之灵的幻影",10027,120,{"$f":"VLOOKUP(A21,[1]EventLinkConfig!$Y:$AM,15,FALSE)","v":10027},{"$f":"VLOOKUP(Q21,[1]EventConfig!$A:$P,16,FALSE)","v":121}]
[1013,{"$f":"_xlfn.TEXTJOIN(\"-\",1,M22:N22)","v":"主线-击败心魔"},{"$f":"A22","v":1013},-1,-1,120,1,100,100,null,null,null,"主线","击败心魔",10030,140,{"$f":"VLOOKUP(A22,[1]EventLinkConfig!$Y:$AM,15,FALSE)","v":10030},{"$f":"VLOOKUP(Q22,[1]EventConfig!$A:$P,16,FALSE)","v":141}]
[1014,"主线-击败北海妖兽2",1014,-1,-1,120,1,100,100,null,null,null,"主线","击败北海妖兽2",10031,150,{"$f":"VLOOKUP(A23,[1]EventLinkConfig!$Y:$AM,15,FALSE)","v":10031},{"$f":"VLOOKUP(Q23,[1]EventConfig!$A:$P,16,FALSE)","v":151}]
[1015,{"$f":"_xlfn.TEXTJOIN(\"-\",1,M24:N24)","v":"主线-击败北海妖兽1"},{"$f":"A24","v":1015},-1,-1,120,1,100,100,null,null,null,"主线","击败北海妖兽1",10010,25,10010,{"$f":"VLOOKUP(Q24,[1]EventConfig!$A:$P,16,FALSE)","v":25}]
[1016,{"$f":"_xlfn.TEXTJOIN(\"-\",1,M25:N25)","v":"主线-与樗木之灵切磋"},{"$f":"A25","v":1016},-1,-1,120,1,100,100,null,null,null,"主线","与樗木之灵切磋",10020,65,{"$f":"VLOOKUP(A25,[1]EventLinkConfig!$Y:$AM,15,FALSE)","v":10020},{"$f":"VLOOKUP(Q25,[1]EventConfig!$A:$P,16,FALSE)","v":69}]
{"$rows_empty":22}
[3001,{"$f":"_xlfn.TEXTJOIN(\"-\",1,M48:N48)","v":"道侣雀灵儿-击败风妖"},{"$f":"A48","v":3001},-1,-1,120,1,100,100,null,null,null,"道侣雀灵儿","击败风妖",6003,{"$f":"VLOOKUP(O48,[1]EventConfig!$A:$P,16,FALSE)","v":16},{"$f":"VLOOKUP(A48,[1]EventLinkConfig!$Y:$AM,15,FALSE)","v":6003},{"$f":"VLOOKUP(Q48,[1]EventConfig!$A:$P,16,FALSE)","v":16}]
[3002,{"$f":"_xlfn.TEXTJOIN(\"-\",1,M49:N49)","v":"道侣雀灵儿-击败大风妖兽"},{"$f":"A49","v":3002},-1,-1,120,1,100,100,null,null,null,"道侣雀灵儿","击败大风妖兽",6003,{"$f":"VLOOKUP(O49,[1]EventConfig!$A:$P,16,FALSE)","v":16},{"$f":"VLOOKUP(A49,[1]EventLinkConfig!$Y:$AM,15,FALSE)","v":6005},{"$f":"VLOOKUP(Q49,[1]EventConfig!$A:$P,16,FALSE)","v":26}]
[{"$f":"A49+1","v":3003},{"$f":"_xlfn.TEXTJOIN(\"-\",1,M50:N50)","v":"道侣云枝-击败风妖"},{"$f":"A50","v":3003},-1,-1,120,1,100,100,null,null,null,"道侣云枝","击败风妖",6011,{"$f":"VLOOKUP(O50,[1]EventConfig!$A:$P,16,FALSE)","v":16},6011,{"$f":"VLOOKUP(Q50,[1]EventConfig!$A:$P,16,FALSE)","v":16}]
[3004,{"$f":"_xlfn.TEXTJOIN(\"-\",1,M51:N51)","v":"道侣云枝-击败风妖2"},{"$f":"A51","v":3004},-1,-1,120,1,100,100,null,null,null,"道侣云枝","击败风妖2",6012,{"$f":"VLOOKUP(O51,[1]EventConfig!$A:$P,16,FALSE)","v":21},{"$f":"VLOOKUP(A51,[1]EventLinkConfig!$Y:$AM,15,FALSE)","v":6012},{"$f":"VLOOKUP(Q51,[1]EventConfig!$A:$P,16,FALSE)","v":21}]
{"$rows_left_out":169}
{"sheet":"GroupConfig","index":1,"n_rows":222,"n_cols":26,"rows_kept":222,"cut":false,"hidden":false,"merged":[]}
["ID",null,"GroupMonsterLevel","GroupMonster","hpQiangDu","attQiangDu","duipingQiangDu","levelAdd"]
["int",null,"int[]","int[]","int[]","int[]","int[]","int[]"]
[]
["组ID","常用阵容ID","具体怪物等级\n-1代表跟随玩家等级\n-1后面可填动态修正等级","每组具体怪","每个怪的比例强度\n一个都不填就是默认强度","攻击强度","对拼强度","等级额外添加值","怪物1","怪物2","怪物3","怪物1生存强度","怪物2生存强度","怪物3生存强度","怪物1攻击强度","怪物2攻击强度","怪物3攻击强度","怪物1对拼强度","怪物2对拼强度","怪物3对拼强度","怪物1等级降低","怪物2等级降低","怪物3等级降低","怪物1","怪物2","怪物3"]
[100001,100001,-1,{"$f":"_xlfn.TEXTJOIN(\";\",1,I5:K5)","v":"1002"},{"$f":"_xlfn.TEXTJOIN(\";\",1,L5:N5)","v":""},{"$f":"_xlfn.TEXTJOIN(\";\",1,O5:Q5)","v":""},{"$f":"_xlfn.TEXTJOIN(\";\",1,R5:T5)","v":""},{"$f":"_xlfn.TEXTJOIN(\";\",1,U5:W5)","v":""},1002,{"$nulls":14},{"$f":"IF(I5=\"\",\"\",VLOOKUP(I5,[3]HeroModelConfig!$A:$D,4,FALSE))","v":"蒙面男子"},{"$f":"IF(J5=\"\",\"\",VLOOKUP(J5,[3]HeroModelConfig!$A:$D,4,FALSE))","v":""},{"$f":"IF(K5=\"\",\"\",VLOOKUP(K5,[3]HeroModelConfig!$A:$D,4,FALSE))","v":""}]
[100002,100002,-1,{"$f":"_xlfn.TEXTJOIN(\";\",1,I6:K6)","v":"1006"},{"$f":"_xlfn.TEXTJOIN(\";\",1,L6:N6)","v":""},{"$f":"_xlfn.TEXTJOIN(\";\",1,O6:Q6)","v":""},{"$f":"_xlfn.TEXTJOIN(\";\",1,R6:T6)","v":""},{"$f":"_xlfn.TEXTJOIN(\";\",1,U6:W6)","v":""},1006,{"$nulls":14},{"$f":"IF(I6=\"\",\"\",VLOOKUP(I6,[3]HeroModelConfig!$A:$D,4,FALSE))","v":"飞鹤"},{"$f":"IF(J6=\"\",\"\",VLOOKUP(J6,[3]HeroModelConfig!$A:$D,4,FALSE))","v":""},{"$f":"IF(K6=\"\",\"\",VLOOKUP(K6,[3]HeroModelConfig!$A:$D,4,FALSE))","v":""}]
[100003,100003,-1,"1003","","","","",1003,{"$nulls":14},{"$f":"IF(I7=\"\",\"\",VLOOKUP(I7,[3]HeroModelConfig!$A:$D,4,FALSE))","v":"蒙面女子"},{"$f":"IF(J7=\"\",\"\",VLOOKUP(J7,[3]HeroModelConfig!$A:$D,4,FALSE))","v":""},{"$f":"IF(K7=\"\",\"\",VLOOKUP(K7,[3]HeroModelConfig!$A:$D,4,FALSE))","v":""}]
[100004,100004,-1,"7002","","","","",7002,{"$nulls":14},{"$f":"IF(I8=\"\",\"\",VLOOKUP(I8,[3]HeroModelConfig!$A:$D,4,FALSE))","v":"突破-心魔"},{"$f":"IF(J8=\"\",\"\",VLOOKUP(J8,[3]HeroModelConfig!$A:$D,4,FALSE))","v":""},{"$f":"IF(K8=\"\",\"\",VLOOKUP(K8,[3]HeroModelConfig!$A:$D,4,FALSE))","v":""}]
[100005,100005,-1,"1005","","","","",1005,{"$nulls":14},{"$f":"IF(I9=\"\",\"\",VLOOKUP(I9,[3]HeroModelConfig!$A:$D,4,FALSE))","v":"树精"},{"$f":"IF(J9=\"\",\"\",VLOOKUP(J9,[3]HeroModelConfig!$A:$D,4,FALSE))","v":""},{"$f":"IF(K9=\"\",\"\",VLOOKUP(K9,[3]HeroModelConfig!$A:$D,4,FALSE))","v":""}]
[100006,100006,-1,"1002","","","","",1002,{"$nulls":14},{"$f":"IF(I10=\"\",\"\",VLOOKUP(I10,[3]HeroModelConfig!$A:$D,4,FALSE))","v":"蒙面男子"},{"$f":"IF(J10=\"\",\"\",VLOOKUP(J10,[3]HeroModelConfig!$A:$D,4,FALSE))","v":""},{"$f":"IF(K10=\"\",\"\",VLOOKUP(K10,[3]HeroModelConfig!$A:$D,4,FALSE))","v":""}]
[100007,100007,-1,"1003;1002","90;30","77;26","75;25","0;0",1003,1002,null,90,30,null,77,26,null,75,25,null,0,0,null,{"$f":"IF(I11=\"\",\"\",VLOOKUP(I11,[3]HeroModelConfig!$A:$D,4,FALSE))","v":"蒙面女子"},{"$f":"IF(J11=\"\",\"\",VLOOKUP(J11,[3]HeroModelConfig!$A:$D,4,FALSE))","v":"蒙面男子"},{"$f":"IF(K11=\"\",\"\",VLOOKUP(K11,[3]HeroModelConfig!$A:$D,4,FALSE))","v":""}]
[100008,100008,-1,"1004;1006","90;30","77;26","75;25","0;0",1004,1006,null,90,30,null,77,26,null,75,25,null,0,0,null,{"$f":"IF(I12=\"\",\"\",VLOOKUP(I12,[3]HeroModelConfig!$A:$D,4,FALSE))","v":"蒙面女子"},{"$f":"IF(J12=\"\",\"\",VLOOKUP(J12,[3]HeroModelConfig!$A:$D,4,FALSE))","v":"飞鹤"},{"$f":"IF(K12=\"\",\"\",VLOOKUP(K12,[3]HeroModelConfig!$A:$D,4,FALSE))","v":""}]
[100009,100009,-1,"1005","","","","",1005,{"$nulls":14},{"$f":"IF(I13=\"\",\"\",VLOOKUP(I13,[3]HeroModelConfig!$A:$D,4,FALSE))","v":"树精"},{"$f":"IF(J13=\"\",\"\",VLOOKUP(J13,[3]HeroModelConfig!$A:$D,4,FALSE))","v":""},{"$f":"IF(K13=\"\",\"\",VLOOKUP(K13,[3]HeroModelConfig!$A:$D,4,FALSE))","v":""}]
[null,null,null,"","","","","",{"$nulls":15},{"$f":"IF(I14=\"\",\"\",VLOOKUP(I14,[3]HeroModelConfig!$A:$D,4,FALSE))","v":""},{"$f":"IF(J14=\"\",\"\",VLOOKUP(J14,[3]HeroModelConfig!$A:$D,4,FALSE))","v":""},{"$f":"IF(K14=\"\",\"\",VLOOKUP(K14,[3]HeroModelConfig!$A:$D,4,FALSE))","v":""}]
[1002,{"$f":"LevelbattleConfig!B11","v":"主线-击败结界兽"},{"$f":"VLOOKUP(A15,LevelbattleConfig!A:R,18,FALSE)","v":6},"7001","","","","",7001,{"$nulls":14},{"$f":"IF(I15=\"\",\"\",VLOOKUP(I15,[3]HeroModelConfig!$A:$D,4,FALSE))","v":"凤凰"},{"$f":"IF(J15=\"\",\"\",VLOOKUP(J15,[3]HeroModelConfig!$A:$D,4,FALSE))","v":""},{"$f":"IF(K15=\"\",\"\",VLOOKUP(K15,[3]HeroModelConfig!$A:$D,4,FALSE))","v":""}]
[{"$f":"A15+1","v":1003},{"$f":"LevelbattleConfig!B12","v":"主线-击败痴道人"},{"$f":"VLOOKUP(A16,LevelbattleConfig!A:R,18,FALSE)","v":16},"7004","","","","",7004,{"$nulls":14},{"$f":"IF(I16=\"\",\"\",VLOOKUP(I16,[3]HeroModelConfig!$A:$D,4,FALSE))","v":"痴道人"},{"$f":"IF(J16=\"\",\"\",VLOOKUP(J16,[3]HeroModelConfig!$A:$D,4,FALSE))","v":""},{"$f":"IF(K16=\"\",\"\",VLOOKUP(K16,[3]HeroModelConfig!$A:$D,4,FALSE))","v":""}]
[{"$f":"A16+1","v":1004},{"$f":"LevelbattleConfig!B13","v":"主线-妖兽横行"},{"$f":"VLOOKUP(A17,LevelbattleConfig!A:R,18,FALSE)","v":25},"7006","","","","",7006,{"$nulls":14},{"$f":"IF(I17=\"\",\"\",VLOOKUP(I17,[3]HeroModelConfig!$A:$D,4,FALSE))","v":"蜘蛛"},{"$f":"IF(J17=\"\",\"\",VLOOKUP(J17,[3]HeroModelConfig!$A:$D,4,FALSE))","v":""},{"$f":"IF(K17=\"\",\"\",VLOOKUP(K17,[3]HeroModelConfig!$A:$D,4,FALSE))","v":""}]
[1005,{"$f":"LevelbattleConfig!B14","v":"主线-击败后山小妖"},{"$f":"VLOOKUP(A18,LevelbattleConfig!A:R,18,FALSE)","v":46},"5001","","","","",5001,{"$nulls":14},{"$f":"IF(I18=\"\",\"\",VLOOKUP(I18,[3]HeroModelConfig!$A:$D,4,FALSE))","v":"金修精英"},{"$f":"IF(J18=\"\",\"\",VLOOKUP(J18,[3]HeroModelConfig!$A:$D,4,FALSE))","v":""},{"$f":"IF(K18=\"\",\"\",VLOOKUP(K18,[3]HeroModelConfig!$A:$D,4,FALSE))","v":""}]
[1006,{"$f":"LevelbattleConfig!B15","v":"主线-击败夜袭的妖兽"},{"$f":"VLOOKUP(A19,LevelbattleConfig!A:R,18,FALSE)","v":51},"5006","","","","",5006,{"$nulls":14},{"$f":"IF(I19=\"\",\"\",VLOOKUP(I19,[3]HeroModelConfig!$A:$D,4,FALSE))","v":"鼠先锋 "},{"$f":"IF(J19=\"\",\"\",VLOOKUP(J19,[3]HeroModelConfig!$A:$D,4,FALSE))","v":""},{"$f":"IF(K19=\"\",\"\",VLOOKUP(K19,[3]HeroModelConfig!$A:$D,4,FALSE))","v":""}]
[1007,{"$f":"LevelbattleConfig!B16","v":"主线-击败峰顶的妖王"},{"$f":"VLOOKUP(A20,LevelbattleConfig!A:R,18,FALSE)","v":56},"5007","","","","",5007,{"$nulls":14},{"$f":"IF(I20=\"\",\"\",VLOOKUP(I20,[3]HeroModelConfig!$A:$D,4,FALSE))","v":"穷奇"},{"$f":"IF(J20=\"\",\"\",VLOOKUP(J20,[3]HeroModelConfig!$A:$D,4,FALSE))","v":""},{"$f":"IF(K20=\"\",\"\",VLOOKUP(K20,[3]HeroModelConfig!$A:$D,4,FALSE))","v":""}]
[1008,{"$f":"LevelbattleConfig!B17","v":"主线-击败仙山的阵眼妖兽"},{"$f":"VLOOKUP(A21,LevelbattleConfig!A:R,18,FALSE)","v":86},"7004","","","","",7004,{"$nulls":14},{"$f":"IF(I21=\"\",\"\",VLOOKUP(I21,[3]HeroModelConfig!$A:$D,4,FALSE))","v":"痴道人"},{"$f":"IF(J21=\"\",\"\",VLOOKUP(J21,[3]HeroModelConfig!$A:$D,4,FALSE))","v":""},{"$f":"IF(K21=\"\",\"\",VLOOKUP(K21,[3]HeroModelConfig!$A:$D,4,FALSE))","v":""}]
[1009,{"$f":"LevelbattleConfig!B18","v":"主线-击杀灵兽获得天肥"},{"$f":"VLOOKUP(A22,LevelbattleConfig!A:R,18,FALSE)","v":101},"7001","","","","",7001,{"$nulls":14},{"$f":"IF(I22=\"\",\"\",VLOOKUP(I22,[3]HeroModelConfig!$A:$D,4,FALSE))","v":"凤凰"},{"$f":"IF(J22=\"\",\"\",VLOOKUP(J22,[3]HeroModelConfig!$A:$D,4,FALSE))","v":""},{"$f":"IF(K22=\"\",\"\",VLOOKUP(K22,[3]HeroModelConfig!$A:$D,4,FALSE))","v":""}]
[1010,{"$f":"LevelbattleConfig!B19","v":"主线-击败小麻雀的幻影"},{"$f":"VLOOKUP(A23,LevelbattleConfig!A:R,18,FALSE)","v":121},"7001","","","","",7001,{"$nulls":14},{"$f":"IF(I23=\"\",\"\",VLOOKUP(I23,[3]HeroModelConfig!$A:$D,4,FALSE))","v":"凤凰"},{"$f":"IF(J23=\"\",\"\",VLOOKUP(J23,[3]HeroModelConfig!$A:$D,4,FALSE))","v":""},{"$f":"IF(K23=\"\",\"\",VLOOKUP(K23,[3]HeroModelConfig!$A:$D,4,FALSE))","v":""}]
[{"$f":"A23+1","v":1011},{"$f":"LevelbattleConfig!B20","v":"主线-击败痴道人的幻影"},{"$f":"VLOOKUP(A24,LevelbattleConfig!A:R,18,FALSE)","v":121},"7001","","","","",7001,{"$nulls":14},{"$f":"IF(I24=\"\",\"\",VLOOKUP(I24,[3]HeroModelConfig!$A:$D,4,FALSE))","v":"凤凰"},{"$f":"IF(J24=\"\",\"\",VLOOKUP(J24,[3]HeroModelConfig!$A:$D,4,FALSE))","v":""},{"$f":"IF(K24=\"\",\"\",VLOOKUP(K24,[3]HeroModelConfig!$A:$D,4,FALSE))","v":""}]
[1012,{"$f":"LevelbattleConfig!B21","v":"主线-樗木之灵的幻影"},{"$f":"VLOOKUP(A25,LevelbattleConfig!A:R,18,FALSE)","v":121},"7005","","","","",7005,{"$nulls":14},{"$f":"IF(I25=\"\",\"\",VLOOKUP(I25,[3]HeroModelConfig!$A:$D,4,FALSE))","v":"樗木之灵"},{"$f":"IF(J25=\"\",\"\",VLOOKUP(J25,[3]HeroModelConfig!$A:$D,4,FALSE))","v":""},{"$f":"IF(K25=\"\",\"\",VLOOKUP(K25,[3]HeroModelConfig!$A:$D,4,FALSE))","v":""}]
[1013,{"$f":"LevelbattleConfig!B22","v":"主线-击败心魔"},{"$f":"VLOOKUP(A26,LevelbattleConfig!A:R,18,FALSE)","v":141},"5007","","","","",5007,{"$nulls":14},{"$f":"IF(I26=\"\",\"\",VLOOKUP(I26,[3]HeroModelConfig!$A:$D,4,FALSE))","v":"穷奇"},{"$f":"IF(J26=\"\",\"\",VLOOKUP(J26,[3]HeroModelConfig!$A:$D,4,FALSE))","v":""},{"$f":"IF(K26=\"\",\"\",VLOOKUP(K26,[3]HeroModelConfig!$A:$D,4,FALSE))","v":""}]
[1014,{"$f":"LevelbattleConfig!B23","v":"主线-击败北海妖兽2"},{"$f":"VLOOKUP(A27,LevelbattleConfig!A:R,18,FALSE)&\";\"&VLOOKUP(A27,LevelbattleConfig!A:R,18,FALSE)","v":"151;151"},"5006;1006","80;40","72;36","67;33","0;0",5006,1006,null,80,40,null,72,36,null,67,33,null,0,0,null,{"$f":"IF(I27=\"\",\"\",VLOOKUP(I27,[3]HeroModelConfig!$A:$D,4,FALSE))","v":"鼠先锋 "},{"$f":"IF(J27=\"\",\"\",VLOOKUP(J27,[3]HeroModelConfig!$A:$D,4,FALSE))","v":"飞鹤"},{"$f":"IF(K27=\"\",\"\",VLOOKUP(K27,[3]HeroModelConfig!$A:$D,4,FALSE))","v":""}]
[1015,{"$f":"LevelbattleConfig!B24","v":"主线-击败北海妖兽1"},{"$f":"VLOOKUP(A28,LevelbattleConfig!A:R,18,FALSE)&\";\"&VLOOKUP(A28,LevelbattleConfig!A:R,18,FALSE)","v":"25;25"},{"$f":"_xlfn.TEXTJOIN(\";\",1,I28:K28)","v":"5007;1006"},{"$f":"_xlfn.TEXTJOIN(\";\",1,L28:N28)","v":"80;40"},{"$f":"_xlfn.TEXTJOIN(\";\",1,O28:Q28)","v":"72;36"},{"$f":"_xlfn.TEXTJOIN(\";\",1,R28:T28)","v":"67;33"},{"$f":"_xlfn.TEXTJOIN(\";\",1,U28:W28)","v":"0;0"},5007,1006,null,80,40,null,72,36,null,67,33,null,0,0,null,{"$f":"IF(I28=\"\",\"\",VLOOKUP(I28,[3]HeroModelConfig!$A:$D,4,FALSE))","v":"穷奇"},{"$f":"IF(J28=\"\",\"\",VLOOKUP(J28,[3]HeroModelConfig!$A:$D,4,FALSE))","v":"飞鹤"},{"$f":"IF(K28=\"\",\"\",VLOOKUP(K28,[3]HeroModelConfig!$A:$D,4,FALSE))","v":""}]
[1016,{"$f":"LevelbattleConfig!B25","v":"主线-与樗木之灵切磋"},{"$f":"VLOOKUP(A29,LevelbattleConfig!A:R,18,FALSE)","v":69},{"$f":"_xlfn.TEXTJOIN(\";\",1,I29:K29)","v":"7005"},{"$f":"_xlfn.TEXTJOIN(\";\",1,L29:N29)","v":""},{"$f":"_xlfn.TEXTJOIN(\";\",1,O29:Q29)","v":""},{"$f":"_xlfn.TEXTJOIN(\";\",1,R29:T29)","v":""},{"$f":"_xlfn.TEXTJOIN(\";\",1,U29:W29)","v":""},7005,{"$nulls":14},{"$f":"IF(I29=\"\",\"\",VLOOKUP(I29,[3]HeroModelConfig!$A:$D,4,FALSE))","v":"樗木之灵"},{"$f":"IF(J29=\"\",\"\",VLOOKUP(J29,[3]HeroModelConfig!$A:$D,4,FALSE))","v":""},{"$f":"IF(K29=\"\",\"\",VLOOKUP(K29,[3]HeroModelConfig!$A:$D,4,FALSE))","v":""}]
[null,null,null,"","","","","",{"$nulls":15},{"$f":"IF(I30=\"\",\"\",VLOOKUP(I30,[3]HeroModelConfig!$A:$D,4,FALSE))","v":""},{"$f":"IF(J30=\"\",\"\",VLOOKUP(J30,[3]HeroModelConfig!$A:$D,4,FALSE))","v":""},{"$f":"IF(K30=\"\",\"\",VLOOKUP(K30,[3]HeroModelConfig!$A:$D,4,FALSE))","v":""}]
{"$rows_left_out":193}
{"sheet":"强度验算","index":2,"n_rows":38,"n_cols":14,"rows_kept":38,"cut":false,"hidden":false,"merged":[]}
[null,"生存修正","生命","攻击修正","对拼修正","秒伤","怪物存活时间",null,"玩家打怪物",null,null,"怪物打玩家"]
[{"$nulls":8},"阶段1","阶段2",null,"阶段1","阶段2"]
["怪物1",null,2000,null,null,100,{"$f":"C3/100","v":20},null,{"$f":"G3*F3","v":2000}]
[]
[{"$nulls":6},1.2,null,{"$f":"SUM(I6:I7)","v":1800},{"$f":"SUM(J6:J7)","v":600},null,{"$f":"SUM(L6:L7)","v":1846.05},{"$f":"SUM(M6:M7)","v":153.94999999999999},{"$f":"SUM(L5:M5)","v":2000}]
["主怪",0.9,{"$f":"C$3*$B6","v":1800},0.76900000000000002,{"$f":"B6/SUM(B$6:B$7)","v":0.75},{"$f":"F$3*$D6","v":76.900000000000006},{"$f":"C6/F$3","v":18},{"$f":"B6/D6","v":1.1703511053316},{"$f":"G6*F$3","v":1800},null,null,{"$f":"F6*G6","v":1384.2}]
["辅怪1",{"$f":"C7/C$3","v":0.3},{"$f":"J7","v":600},{"$f":"F7/F$3","v":0.256583333333333},{"$f":"B7/SUM(B$6:B$7)","v":0.25},{"$f":"(C$3-L6)/G7","v":25.658333333333299},{"$f":"G$3*G5","v":24},{"$f":"B7/D7","v":1.16921078272166},null,{"$f":"F$3*(G7-G6)","v":600},null,{"$f":"F7*G6","v":461.85},{"$f":"C$3-L5","v":153.94999999999999}]
[]
[{"$nulls":6},{"$f":"G5","v":1.2},null,{"$f":"SUM(I10:I11)","v":1600},{"$f":"SUM(J10:J11)","v":800},null,{"$f":"SUM(L10:L11)","v":1714.13333333333},{"$f":"SUM(M10:M11)","v":285.86666666666702},{"$f":"SUM(L9:M9)","v":2000}]
["主怪",0.8,{"$f":"C$3*$B10","v":1600},0.71399999999999997,{"$f":"B10/SUM(B$10:B$11)","v":0.66666666666666696},{"$f":"F$3*$D10","v":71.400000000000006},{"$f":"C10/F$3","v":16},{"$f":"B10/D10","v":1.12044817927171},{"$f":"G10*F$3","v":1600},null,null,{"$f":"F10*G10","v":1142.4000000000001}]
["辅怪1",{"$f":"C11/C$3","v":0.4},{"$f":"J11","v":800},{"$f":"F11/F$3","v":0.357333333333333},{"$f":"B11/SUM(B$10:B$11)","v":0.33333333333333298},{"$f":"(C$3-L10)/G11","v":35.733333333333299},{"$f":"G$3*G9","v":24},{"$f":"B11/D11","v":1.1194029850746301},null,{"$f":"F$3*(G11-G10)","v":800},null,{"$f":"F11*G10","v":571.73333333333301},{"$f":"C$3-L9","v":285.86666666666702}]
[]
[{"$nulls":6},{"$f":"G5","v":1.2},null,{"$f":"SUM(I14:I15)","v":1400},{"$f":"SUM(J14:J15)","v":1000},null,{"$f":"SUM(L14:L15)","v":1541.1666666666699},{"$f":"SUM(M14:M15)","v":458.83333333333297},{"$f":"SUM(L13:M13)","v":2000}]
["主怪",0.7,{"$f":"C$3*$B14","v":1400},0.64200000000000002,{"$f":"B14/SUM(B$14:B$15)","v":0.58333333333333304},{"$f":"F$3*$D14","v":64.2},{"$f":"C14/F$3","v":14},{"$f":"B14/D14","v":1.09034267912773},{"$f":"G14*F$3","v":1400},null,null,{"$f":"F14*G14","v":898.8}]
["辅怪1",{"$f":"C15/C$3","v":0.5},{"$f":"J15","v":1000},{"$f":"F15/F$3","v":0.45883333333333298},{"$f":"B15/SUM(B$14:B$15)","v":0.41666666666666702},{"$f":"(C$3-L14)/G15","v":45.883333333333297},{"$f":"G$3*G13","v":24},{"$f":"B15/D15","v":1.0897203051216899},null,{"$f":"F$3*(G15-G14)","v":1000},null,{"$f":"F15*G14","v":642.36666666666702},{"$f":"C$3-L13","v":458.83333333333297}]
[]
[{"$nulls":6},{"$f":"G5","v":1.2},null,{"$f":"SUM(I18:I19)","v":1200},{"$f":"SUM(J18:J19)","v":1200},null,{"$f":"SUM(L18:L19)","v":1333.6},{"$f":"SUM(M18:M19)","v":666.4},{"$f":"SUM(L17:M17)","v":2000}]
["主怪",0.6,{"$f":"C$3*$B18","v":1200},0.55600000000000005,{"$f":"B18/SUM(B$18:B$19)","v":0.5},{"$f":"F$3*$D18","v":55.6},{"$f":"C18/F$3","v":12},{"$f":"B18/D18","v":1.07913669064748},{"$f":"G18*F$3","v":1200},null,null,{"$f":"F18*G18","v":667.2}]
["辅怪1",{"$f":"C19/C$3","v":0.6},{"$f":"J19","v":1200},{"$f":"F19/F$3","v":0.55533333333333301},{"$f":"B19/SUM(B$18:B$19)","v":0.5},{"$f":"(C$3-L18)/G19","v":55.533333333333303},{"$f":"G$3*G17","v":24},{"$f":"B19/D19","v":1.0804321728691499},null,{"$f":"F$3*(G19-G18)","v":1200},null,{"$f":"F19*G18","v":666.4},{"$f":"C$3-L17","v":666.4}]
[]
[]
[]
[]
[{"$nulls":6},1.3,null,{"$f":"SUM(I25:I26)","v":1800},{"$f":"SUM(J25:J26)","v":800},null,{"$f":"SUM(L25:L26)","v":1810.52307692308},{"$f":"SUM(M25:M26)","v":189.47692307692299},{"$f":"SUM(L24:M24)","v":2000}]
["主怪",0.9,{"$f":"C$3*$B25","v":1800},0.76900000000000002,null,{"$f":"F$3*$D25","v":76.900000000000006},{"$f":"C25/F$3","v":18},{"$f":"B25/D25","v":1.1703511053316},{"$f":"G25*F$3","v":1800},null,null,{"$f":"F25*G25","v":1384.2}]
["辅怪1",{"$f":"C26/C$3","v":0.4},{"$f":"J26","v":800},{"$f":"F26/F$3","v":0.23684615384615401},null,{"$f":"(C$3-L25)/G26","v":23.684615384615402},{"$f":"G$3*G24","v":26},{"$f":"B26/D26","v":1.6888600194868499},null,{"$f":"F$3*(G26-G25)","v":800},null,{"$f":"F26*G25","v":426.323076923077},{"$f":"C$3-L24","v":189.47692307692299}]
[]
[{"$nulls":6},{"$f":"G24","v":1.3},null,{"$f":"SUM(I29:I30)","v":1600},{"$f":"SUM(J29:J30)","v":1000},null,{"$f":"SUM(L29:L30)","v":1670.1538461538501},{"$f":"SUM(M29:M30)","v":329.84615384615398},{"$f":"SUM(L28:M28)","v":2000}]
["主怪",0.8,{"$f":"C$3*$B29","v":1600},0.71399999999999997,null,{"$f":"F$3*$D29","v":71.400000000000006},{"$f":"C29/F$3","v":16},{"$f":"B29/D29","v":1.12044817927171},{"$f":"G29*F$3","v":1600},null,null,{"$f":"F29*G29","v":1142.4000000000001}]
["辅怪1",{"$f":"C30/C$3","v":0.5},{"$f":"J30","v":1000},{"$f":"F30/F$3","v":0.32984615384615401},null,{"$f":"(C$3-L29)/G30","v":32.984615384615402},{"$f":"G$3*G28","v":26},{"$f":"B30/D30","v":1.5158582089552199},null,{"$f":"F$3*(G30-G29)","v":1000},null,{"$f":"F30*G29","v":527.75384615384598},{"$f":"C$3-L28","v":329.84615384615398}]
{"$rows_left_out":8}