{"text_format":"2","workbook":"xlsx","n_sheets":6,"sheets":["EventConfig","EventLinkConfig","EventConditionConfig","条件类型查询","EventNPC","XianTuLogConfig"],"not_rendered":{"charts":0,"images":0,"macros":0,"external_links":0,"defined_names":3,"comments":0,"pivot_tables":0},"unopened":[],"bounds":{"document_bytes":16777216,"sheet_cells":100000,"run_cost":"one","rows_first":2000,"rows_last":500,"rows_between":2000,"halvings":0,"cell_chars":16384,"cell_head_chars":4096},"cells_cut":0,"cells_raw":0,"read":"whole","date_system":"1900"}

{"sheet":"EventConfig","index":0,"n_rows":42,"n_cols":40,"rows_kept":42,"cut":false,"hidden":false,"merged":[]}
["ID","EventLinksId","EventTriggerType","EventTag","EventType","Score","EventQuality",null,"PrizeIDs","PrizeNums","RelatedEvents","RefreshProbability","RefreshCount","placeID","XiantuID",null,"EventConditionId","EventValue","EventCount","EventName","Description"]
["int","int[]","int","int","int","int","int",null,"int[]","int[]","int[]","int","int","int","int",null,"int","int[]","int","int","int"]
[{"$nulls":24},1,2,3,4,5,6,7,8,9,10,11,12,13,14,15,16]
["ID","事件包含的ID","事件类型：\n1.通用事件\n2.挂机事件\n4.主线任务\n5.仙山探险\n99.无标记\n","tag\n1主线2支线\n3通用\n4地图通用\n5道友","1.正常触发\n2.直接结算","增加进度值","事件品质",null,"事件结局奖励","事件结局奖励数量","关联的事件Id","刷新的概率\n（100=100%）","最大刷新数量","属于哪张地图","仙途日志ID","触发条件","触发条件类型\n只能配处于什么状态和数值，不能配变化的数值","触发效果值","触发判定数量or次数","任务标题","任务详情界面的总描述","标题","整体描述","总步数","步骤1","步骤2","步骤3","步骤4","步骤5","步骤6","步骤7","步骤8","步骤9","步骤10","步骤11","步骤12","步骤13","步骤14","步骤15","步骤16"]
[1,{"$f":"_xlfn.TEXTJOIN(\";\",1,Y5:AN5)","v":"1001;1002;1003;1004;1005"},1,3,1,0,1,null,1001,10,null,null,null,8,4,{"$f":"IF(Q5=\"\",\"\",VLOOKUP(Q5,条件类型查询!A:B,2,FALSE))","v":"境界判断"},3,5,null,174,1936,"受伤的狼","你发现一只奄奄一息的狼，决定上前一探究竟。",null,1001,1002,1003,1004,1005]
[2,{"$f":"_xlfn.TEXTJOIN(\";\",1,Y6:AN6)","v":"1010;1011;1012;1013;1014;1015;1016"},1,3,1,0,1,null,1001,10,null,null,null,9,4,{"$f":"IF(Q6=\"\",\"\",VLOOKUP(Q6,条件类型查询!A:B,2,FALSE))","v":""},null,null,null,175,1937,"鹬蚌相争","附近的小树林闹的不可开交，你决定去看看怎么回事。",null,1010,1011,1012,1013,1014,1015,1016]
[3,"1020;1021;1022;1023;1024;1025;1026",99,2,1,10,1,null,1001,10,null,null,null,10,4,{"$f":"IF(Q7=\"\",\"\",VLOOKUP(Q7,条件类型查询!A:B,2,FALSE))","v":"拥有特定道具"},1,1004,1,176,1938,"鹬蚌相争2","附近的小树林闹的不可开交，你决定去看看怎么回事。",null,1020,1021,1022,1023,1024,1025,1026]
[null,"",{"$nulls":13},{"$f":"IF(Q8=\"\",\"\",VLOOKUP(Q8,条件类型查询!A:B,2,FALSE))","v":""}]
[4,"1030",1,1,2,0,1,null,1001,10,null,null,null,5,3,{"$f":"IF(Q9=\"\",\"\",VLOOKUP(Q9,条件类型查询!A:B,2,FALSE))","v":"触发概率"},7,500,null,217,1939,"溅血背包","不远处有一个小红点，走近一看你发现是一个带血的背包。",null,1030]
[5,"1040",1,1,2,0,1,null,1001,10,null,null,null,5,3,{"$f":"IF(Q10=\"\",\"\",VLOOKUP(Q10,条件类型查询!A:B,2,FALSE))","v":""},null,null,null,218,1940,"废弃矿山","底下一座矿山甚是磅礴雄伟，走，去看一看。",null,1040]
[6,"1050",1,1,2,0,1,null,1001,10,null,null,null,6,3,{"$f":"IF(Q11=\"\",\"\",VLOOKUP(Q11,条件类型查询!A:B,2,FALSE))","v":""},null,null,null,219,1941,"吵架声","你被一男一女的吵架声吸引。",null,1050]
[7,"1060",1,1,2,0,1,null,1001,10,null,null,null,7,3,{"$f":"IF(Q12=\"\",\"\",VLOOKUP(Q12,条件类型查询!A:B,2,FALSE))","v":""},null,null,null,220,1942,"一座道观","远处一座道观仙气缭绕，似有仙人在此。",null,1060]
[null,"",{"$nulls":13},{"$f":"IF(Q13=\"\",\"\",VLOOKUP(Q13,条件类型查询!A:B,2,FALSE))","v":""}]
[11,"1101;1102",2,null,1,0,1,null,1001,10,{"$nulls":5},{"$f":"IF(Q14=\"\",\"\",VLOOKUP(Q14,条件类型查询!A:B,2,FALSE))","v":""},{"$nulls":5},"遇到怪物1-修为",null,{"$f":"COUNTIF(EventLinkConfig!K:K,EventConfig!A14)","v":2},{"$f":"IF($X14>=Y$3,$A14*100+Y$3,\"\")","v":1101},{"$f":"IF($X14>=Z$3,$A14*100+Z$3,\"\")","v":1102},"","","","","","","","","",""]
[12,"1201;1202;1203",2,null,1,0,1,null,1001,10,{"$nulls":5},{"$f":"IF(Q15=\"\",\"\",VLOOKUP(Q15,条件类型查询!A:B,2,FALSE))","v":""},{"$nulls":5},"对话-功法灵气",null,{"$f":"COUNTIF(EventLinkConfig!K:K,EventConfig!A15)","v":3},{"$f":"IF($X15>=Y$3,$A15*100+Y$3,\"\")","v":1201},1202,1203,"","","","","","","","",""]
[13,"1301;1302;1303;1304",2,null,1,0,1,null,1001,10,{"$nulls":5},{"$f":"IF(Q16=\"\",\"\",VLOOKUP(Q16,条件类型查询!A:B,2,FALSE))","v":""},{"$nulls":5},"对话-法宝灵韵",null,{"$f":"COUNTIF(EventLinkConfig!K:K,EventConfig!A16)","v":4},{"$f":"IF($X16>=Y$3,$A16*100+Y$3,\"\")","v":1301},1302,1303,1304,"","","","","","","",""]
[14,"1401;1402",2,null,1,0,1,null,1001,10,{"$nulls":5},{"$f":"IF(Q17=\"\",\"\",VLOOKUP(Q17,条件类型查询!A:B,2,FALSE))","v":""},{"$nulls":5},"遇到怪物2-修为",null,{"$f":"COUNTIF(EventLinkConfig!K:K,EventConfig!A17)","v":2},{"$f":"IF($X17>=Y$3,$A17*100+Y$3,\"\")","v":1401},1402,"","","","","","","","","",""]
[15,"1501;1502",2,null,1,0,1,null,1001,10,{"$nulls":5},{"$f":"IF(Q18=\"\",\"\",VLOOKUP(Q18,条件类型查询!A:B,2,FALSE))","v":""},{"$nulls":5},"遇到怪物3-修为",null,{"$f":"COUNTIF(EventLinkConfig!K:K,EventConfig!A18)","v":2},{"$f":"IF($X18>=Y$3,$A18*100+Y$3,\"\")","v":1501},1502,"","","","","","","","","",""]
[null,"",{"$nulls":13},{"$f":"IF(Q19=\"\",\"\",VLOOKUP(Q19,条件类型查询!A:B,2,FALSE))","v":""}]
[null,"",{"$nulls":13},{"$f":"IF(Q20=\"\",\"\",VLOOKUP(Q20,条件类型查询!A:B,2,FALSE))","v":""}]
[10001,"1000101;1000102;1000103;1000104",4,1,1,10,1,null,1001,10,null,null,null,1,1,{"$f":"IF(Q21=\"\",\"\",VLOOKUP(Q21,条件类型查询!A:B,2,FALSE))","v":""},null,null,null,1906,1914,"鲲鹏何在","神识未灭",{"$f":"COUNTIF(EventLinkConfig!K:K,EventConfig!A21)","v":4},{"$f":"IF($X21>=Y$3,$A21*100+Y$3,\"\")","v":1000101},{"$f":"IF($X21>=Z$3,$A21*100+Z$3,\"\")","v":1000102},1000103,1000104,"","","","","","","","","","","",""]
[10002,"1000201;1000202;1000203",4,1,1,10,1,null,1001,10,null,null,null,1,1,{"$f":"IF(Q22=\"\",\"\",VLOOKUP(Q22,条件类型查询!A:B,2,FALSE))","v":""},null,null,null,1907,1915,"北海迷径1","御剑而行",{"$f":"COUNTIF(EventLinkConfig!K:K,EventConfig!A22)","v":3},{"$f":"IF($X22>=Y$3,$A22*100+Y$3,\"\")","v":1000201},1000202,1000203,"","","","","","","","","","","","",""]
[10003,"1000301;1000302;1000303;1000304;1000305;1000306;1000307;1000308;1000309",4,1,1,10,1,null,1001,10,null,null,null,1,1,{"$f":"IF(Q23=\"\",\"\",VLOOKUP(Q23,条件类型查询!A:B,2,FALSE))","v":""},null,null,null,1908,1916,"北海迷径2","雀笑大鹏",{"$f":"COUNTIF(EventLinkConfig!K:K,EventConfig!A23)","v":9},1000301,1000302,1000303,1000304,1000305,1000306,1000307,1000308,1000309,"","","","","","",""]
[10004,"1000401;1000402;1000403;1000404",4,1,1,10,1,null,1001,10,null,null,null,1,1,{"$f":"IF(Q24=\"\",\"\",VLOOKUP(Q24,条件类型查询!A:B,2,FALSE))","v":""},null,null,null,1909,1917,"古径阵法","击败结界兽",{"$f":"COUNTIF(EventLinkConfig!K:K,EventConfig!A24)","v":4},1000401,1000402,1000403,1000404,"","","","","","","","","","","",""]
[10005,"1000501;1000502;1000503;1000504;1000505;1000506;1000507;1000508;1000509;1000510;1000511;1000512;1000513;1000514",4,1,1,10,1,null,1001,10,null,null,null,1,1,{"$f":"IF(Q25=\"\",\"\",VLOOKUP(Q25,条件类型查询!A:B,2,FALSE))","v":""},null,null,null,2135,2137,"浮空之岛1","初见疯道人",{"$f":"COUNTIF(EventLinkConfig!K:K,EventConfig!A25)","v":14},1000501,1000502,1000503,1000504,1000505,1000506,1000507,1000508,1000509,1000510,1000511,1000512,1000513,1000514,"",""]
[10006,"1000601;1000602;1000603;1000604;1000605;1000606",4,1,1,10,1,null,1001,10,null,null,null,1,1,{"$f":"IF(Q26=\"\",\"\",VLOOKUP(Q26,条件类型查询!A:B,2,FALSE))","v":""},null,null,null,2136,2138,"浮空之岛2","筑基中期",{"$f":"COUNTIF(EventLinkConfig!K:K,EventConfig!A26)","v":6},1000601,1000602,1000603,1000604,1000605,1000606,"","","","","","","","","",""]
[null,""]
[1001,"1001;1002;1003;1004;1005",99,4,1,10,1,null,1001,10,{"$nulls":9},1943,1944,"受伤的鸟","你发现一只奄奄一息的鸟，决定上前一探究竟。",null,1001,1002,1003,1004,1005]
[null,""]
[20001,"1001;1002;1003;1004;1005",5,null,1,0,1,null,1001,10,{"$nulls":9},174,1936,"受伤的狼","你发现一只奄奄一息的狼，决定上前一探究竟。",null,1001,1002,1003,1004,1005]
[20002,"1010;1011;1012;1013;1014;1015;1016",5,null,1,0,1,null,1001,10,{"$nulls":5},{"$f":"IF(Q31=\"\",\"\",VLOOKUP(Q31,条件类型查询!A:B,2,FALSE))","v":""},null,null,null,175,1937,"鹬蚌相争","附近的小树林闹的不可开交，你决定去看看怎么回事。",null,1010,1011,1012,1013,1014,1015,1016]
[20003,"1001;1002;1003;1004;1005",5,null,1,0,1,null,1001,10,{"$nulls":9},1943,1944,"受伤的鸟","你发现一只奄奄一息的鸟，决定上前一探究竟。",null,1001,1002,1003,1004,1005]
[null,""]
[9001,"1001;1002;1003;1004;1005",99,3,1,0,1,null,1001,10,{"$nulls":9},174,1936,"受伤的狼","你发现一只奄奄一息的狼，决定上前一探究竟。",null,1001,1002,1003,1004,1005]
[9002,"1010;1011;1012;1013;1014;1015;1016",99,3,1,0,1,null,1001,10,{"$nulls":5},{"$f":"IF(Q35=\"\",\"\",VLOOKUP(Q35,条件类型查询!A:B,2,FALSE))","v":""},null,null,null,175,1937,"鹬蚌相争","附近的小树林闹的不可开交，你决定去看看怎么回事。",null,1010,1011,1012,1013,1014,1015,1016]
[9003,"9003;9004;9005;9006;9007;9008",99,5,1,0,1,null,1001,10,{"$nulls":9},2035,2036,"幽谷剑鸣","你在闭关修炼时，感受到一股凌厉的剑意波动。深入探查，发现一名白衣剑修“清霜”盘坐于谷中，周围剑气环绕，正与一柄散发不祥气息的灵剑对峙。她似在参悟剑诀，却灵气不足，剑灵桀骜。",null,9003,9004,9005,9006,9007,9008]
[]
[9025,"9025;9026",1,3,1,0,1,null,1001,10,null,null,null,1,2,{"$nulls":4},2067,2068,"惠子.没用的大葫芦","惠子种的葫芦没用，他非常生气"]
[]
[9014,9014,99,3,1,0,1,null,1001,10,9031,null,null,2,2,{"$nulls":4},2069,2070,"发现魔修","发现一群魔修，正在夺人钱财"]
{"$rows_left_out":3}
{"sheet":"EventLinkConfig","index":1,"n_rows":180,"n_cols":31,"rows_kept":180,"cut":false,"hidden":false,"merged":[]}
["ID","conciseEventMessage",null,"EventConditionMessage",null,"NPCID",null,"LanID",null,"DialogueType","EventID",null,"ConditionId",null,null,null,"optionType","optionPara1","optionPara2",{"$nulls":5},"PrizeIDs","PrizeNums","ResultType","ResultOptions"]
["int","int",null,"int",null,"int",null,"int[]",null,"int","int",null,"int[]",null,null,null,"int","int[]","int[]",{"$nulls":5},"int[]","int[]","int","int[]"]
[]
["条件ID","任务列表中的简洁描述","任务列表中的简洁描述","无任务目标时的补充文本","无任务目标时的补充文本","对话NPCID","NPC","对话","对话1","对话框类型","属于哪个事件","步骤","条件判断类型","任务目标1","任务目标2","条件判断内容","步骤类型\n1=提供选项\n2=进入战斗\n3=获得奖励\n4=扣除道具","事件常量1\n1=步骤IDs\n2=战斗ID","事件常量2\n1=事件文本","选择1","选择1","选择2","选择2",null,"事件结局奖励","事件结局奖励数量","事件结束类型\n1：跳转步骤\n2：根据战斗结果跳转\n3.触发新事件","事件结局后提供的选项\n1.EventLinkId\n2.胜利id;失败id\n3.EventConfigId"]
[100,{"$nulls":6},216,"你被怪物击败，神识也随之消散了。",null,null,null,{"$f":"_xlfn.TEXTJOIN(\";\",1,N5:O5)","v":""},null,null,{"$f":"IF(N5=\"\",\"\",\"-\"&VLOOKUP(N5,EventConditionConfig!A:C,3,FALSE)&IF(O5=\"\",\"\",CHAR(10)&\"-\"&VLOOKUP(O5,EventConditionConfig!A:C,3,FALSE)))","v":""}]
[101,{"$nulls":6},216,"你败下阵来，感到头晕目眩，试图努力回忆起刚才发生的事情。(回到主界面重新触发剧情）",null,null,null,{"$f":"_xlfn.TEXTJOIN(\";\",1,N6:O6)","v":""},null,null,{"$f":"IF(N6=\"\",\"\",\"-\"&VLOOKUP(N6,EventConditionConfig!A:C,3,FALSE)&IF(O6=\"\",\"\",CHAR(10)&\"-\"&VLOOKUP(O6,EventConditionConfig!A:C,3,FALSE)))","v":""}]
[{"$nulls":12},"",null,null,{"$f":"IF(N7=\"\",\"\",\"-\"&VLOOKUP(N7,EventConditionConfig!A:C,3,FALSE)&IF(O7=\"\",\"\",CHAR(10)&\"-\"&VLOOKUP(O7,EventConditionConfig!A:C,3,FALSE)))","v":""}]
[1001,177,null,null,null,2,null,177,"你遇到一只奄奄一息的野狼，从周围四散的血迹来看，想必它刚才经历了一场恶战。",null,null,null,"",null,null,{"$f":"IF(N8=\"\",\"\",\"-\"&VLOOKUP(N8,EventConditionConfig!A:C,3,FALSE)&IF(O8=\"\",\"\",CHAR(10)&\"-\"&VLOOKUP(O8,EventConditionConfig!A:C,3,FALSE)))","v":""},1,"1002;1003","198;199",null,"趁它虚弱赶紧除掉它！",null,"你不忍见它受苦，选择帮它减轻痛苦。"]
[1002,178,{"$nulls":5},178,"野狼用它最后一口气，朝你扑了过来！",null,null,null,"",null,null,{"$f":"IF(N9=\"\",\"\",\"-\"&VLOOKUP(N9,EventConditionConfig!A:C,3,FALSE)&IF(O9=\"\",\"\",CHAR(10)&\"-\"&VLOOKUP(O9,EventConditionConfig!A:C,3,FALSE)))","v":""},2,100001,{"$nulls":8},2,"1004;100"]
[1003,179,{"$nulls":5},179,"你抽出匕首准备了结它的生命，却发现怀中还躺着一只刚出生的狼崽。",null,null,null,"",null,null,{"$f":"IF(N10=\"\",\"\",\"-\"&VLOOKUP(N10,EventConditionConfig!A:C,3,FALSE)&IF(O10=\"\",\"\",CHAR(10)&\"-\"&VLOOKUP(O10,EventConditionConfig!A:C,3,FALSE)))","v":""},1,1005,200]
[1004,180,{"$nulls":5},180,"随着你的最后一击，野狼应声倒下，你罔顾它幽怨的眼神，从它怀中拿走了一些财物。",null,null,null,"",null,null,{"$f":"IF(N11=\"\",\"\",\"-\"&VLOOKUP(N11,EventConditionConfig!A:C,3,FALSE)&IF(O11=\"\",\"\",CHAR(10)&\"-\"&VLOOKUP(O11,EventConditionConfig!A:C,3,FALSE)))","v":""},3,{"$nulls":7},1002,100]
[1005,181,{"$nulls":5},181,"母狼似乎懂你要做什么，眼神归于平静。你终结了她，决定收养这只小狼仔。",null,null,null,"",null,null,{"$f":"IF(N12=\"\",\"\",\"-\"&VLOOKUP(N12,EventConditionConfig!A:C,3,FALSE)&IF(O12=\"\",\"\",CHAR(10)&\"-\"&VLOOKUP(O12,EventConditionConfig!A:C,3,FALSE)))","v":""},3,{"$nulls":7},1001,50]
[{"$nulls":12},"",null,null,{"$f":"IF(N13=\"\",\"\",\"-\"&VLOOKUP(N13,EventConditionConfig!A:C,3,FALSE)&IF(O13=\"\",\"\",CHAR(10)&\"-\"&VLOOKUP(O13,EventConditionConfig!A:C,3,FALSE)))","v":""}]
[1010,182,{"$nulls":5},182,"从不远处传来刀剑声，听起来双方已经精疲力尽了。",null,null,null,"",null,null,{"$f":"IF(N14=\"\",\"\",\"-\"&VLOOKUP(N14,EventConditionConfig!A:C,3,FALSE)&IF(O14=\"\",\"\",CHAR(10)&\"-\"&VLOOKUP(O14,EventConditionConfig!A:C,3,FALSE)))","v":""},1,"1011;1012","201;202",null,"去看看",null,"(需拥有法宝凝神珠）听起来都是鸡毛蒜皮的小摩擦，你选择祭出凝神珠化解他们的怨气。"]
[1011,183,{"$nulls":5},183,"你走进一看，原来是一伙山贼分赃不均内讧了起来。你看着旁边被砍的七零八落的轿子和这群山贼，选择怎么做呢：",null,null,null,"",null,null,{"$f":"IF(N15=\"\",\"\",\"-\"&VLOOKUP(N15,EventConditionConfig!A:C,3,FALSE)&IF(O15=\"\",\"\",CHAR(10)&\"-\"&VLOOKUP(O15,EventConditionConfig!A:C,3,FALSE)))","v":""},1,"1014;1015","203;204",null,"你顿时杀心四起，决定杀了贼寇，救出轿中之人",null,"盗贼们个个双眼杀的通红，你决定来个渔翁得利。"]
[1012,184,{"$nulls":5},"184;187","法宝现身，效果立竿见影，刀剑声逐渐消失，这个世界安静了。",null,null,null,"",null,null,{"$f":"IF(N16=\"\",\"\",\"-\"&VLOOKUP(N16,EventConditionConfig!A:C,3,FALSE)&IF(O16=\"\",\"\",CHAR(10)&\"-\"&VLOOKUP(O16,EventConditionConfig!A:C,3,FALSE)))","v":""},3,{"$nulls":7},1001,10,null,null,null,1,"1001;1"]
[1014,185,{"$nulls":5},185,"你怒斥贼寇的恶行，贼寇们被你激怒了，准备迎战！",null,null,null,"",null,null,{"$f":"IF(N17=\"\",\"\",\"-\"&VLOOKUP(N17,EventConditionConfig!A:C,3,FALSE)&IF(O17=\"\",\"\",CHAR(10)&\"-\"&VLOOKUP(O17,EventConditionConfig!A:C,3,FALSE)))","v":""},2,100002,{"$nulls":8},2,"1016;100",null,2,"4;150"]
[1015,186,{"$nulls":5},"186;189","你趁人不备顺走了轿内主人的包裹，任留轿内人痛苦的挣扎。",null,null,null,"",null,null,{"$f":"IF(N18=\"\",\"\",\"-\"&VLOOKUP(N18,EventConditionConfig!A:C,3,FALSE)&IF(O18=\"\",\"\",CHAR(10)&\"-\"&VLOOKUP(O18,EventConditionConfig!A:C,3,FALSE)))","v":""},3,{"$nulls":7},1003,1000]
[1016,188,{"$nulls":5},188,"杀退贼寇，你上演了一出英雄救美的桥段。姑娘为了答谢你的救命之恩，将藏在贴身处的珍贵首饰赠与你作为定情信物。",null,null,null,"",null,null,{"$f":"IF(N19=\"\",\"\",\"-\"&VLOOKUP(N19,EventConditionConfig!A:C,3,FALSE)&IF(O19=\"\",\"\",CHAR(10)&\"-\"&VLOOKUP(O19,EventConditionConfig!A:C,3,FALSE)))","v":""},{"$nulls":8},1001,200]
[{"$nulls":12},"",null,null,{"$f":"IF(N20=\"\",\"\",\"-\"&VLOOKUP(N20,EventConditionConfig!A:C,3,FALSE)&IF(O20=\"\",\"\",CHAR(10)&\"-\"&VLOOKUP(O20,EventConditionConfig!A:C,3,FALSE)))","v":""}]
[1020,190,{"$nulls":5},190,"从不远处传来刀剑声，听起来双方已经精疲力尽了。",null,null,null,"",null,null,{"$f":"IF(N21=\"\",\"\",\"-\"&VLOOKUP(N21,EventConditionConfig!A:C,3,FALSE)&IF(O21=\"\",\"\",CHAR(10)&\"-\"&VLOOKUP(O21,EventConditionConfig!A:C,3,FALSE)))","v":""},1,"1021;1022","201;202",null,"去看看",null,"使用法宝息事宁人"]
[1021,191,{"$nulls":5},191,"你走进一看，原来是一伙山贼抢了一名坐在官轿内的女子，因分赃不均内讧了起来。山贼二话不说就朝你冲了过来！",null,null,null,"",null,null,{"$f":"IF(N22=\"\",\"\",\"-\"&VLOOKUP(N22,EventConditionConfig!A:C,3,FALSE)&IF(O22=\"\",\"\",CHAR(10)&\"-\"&VLOOKUP(O22,EventConditionConfig!A:C,3,FALSE)))","v":""},2,100003,{"$nulls":6},1002,100,2,"1026;100"]
[1022,192,{"$nulls":5},192,"法宝现身，效果立竿见影，刀剑声逐渐消失，这个世界安静了。",null,null,null,"",null,null,{"$f":"IF(N23=\"\",\"\",\"-\"&VLOOKUP(N23,EventConditionConfig!A:C,3,FALSE)&IF(O23=\"\",\"\",CHAR(10)&\"-\"&VLOOKUP(O23,EventConditionConfig!A:C,3,FALSE)))","v":""},4,{"$nulls":7},1002,10,null,null,null,1,"1001;1"]
[1024,193,{"$nulls":5},"193;196","你大声怒斥贼寇的恶行，贼首发现你了，准备迎战！",null,null,null,"",null,null,{"$f":"IF(N24=\"\",\"\",\"-\"&VLOOKUP(N24,EventConditionConfig!A:C,3,FALSE)&IF(O24=\"\",\"\",CHAR(10)&\"-\"&VLOOKUP(O24,EventConditionConfig!A:C,3,FALSE)))","v":""},2,100004,{"$nulls":6},1004,100,2,"1016;100",null,2,"4;150"]
[1025,194,{"$nulls":5},"194;197","你趁人不备顺走了轿内主人的包裹，任留轿内人痛苦的挣扎。",null,null,null,"",null,null,{"$f":"IF(N25=\"\",\"\",\"-\"&VLOOKUP(N25,EventConditionConfig!A:C,3,FALSE)&IF(O25=\"\",\"\",CHAR(10)&\"-\"&VLOOKUP(O25,EventConditionConfig!A:C,3,FALSE)))","v":""},3,{"$nulls":7},1002,1000]
[1026,207,{"$nulls":5},207,"你将山贼们打的落花流水，成功吸引了山贼头子的注意。",null,null,null,"",null,null,{"$f":"IF(N26=\"\",\"\",\"-\"&VLOOKUP(N26,EventConditionConfig!A:C,3,FALSE)&IF(O26=\"\",\"\",CHAR(10)&\"-\"&VLOOKUP(O26,EventConditionConfig!A:C,3,FALSE)))","v":""},1,"1024;1025","205;206",null,"选择正面迎战山贼头领（困难）",null,"你决定避开山贼头领的视线，来个渔翁得利。"]
[{"$nulls":12},"",null,null,{"$f":"IF(N27=\"\",\"\",\"-\"&VLOOKUP(N27,EventConditionConfig!A:C,3,FALSE)&IF(O27=\"\",\"\",CHAR(10)&\"-\"&VLOOKUP(O27,EventConditionConfig!A:C,3,FALSE)))","v":""}]
[1030,221,{"$nulls":5},221,"发现一个血迹斑斑的背包，好像刚刚发生了战斗，我翻翻背包...",null,null,null,"",null,null,{"$f":"IF(N28=\"\",\"\",\"-\"&VLOOKUP(N28,EventConditionConfig!A:C,3,FALSE)&IF(O28=\"\",\"\",CHAR(10)&\"-\"&VLOOKUP(O28,EventConditionConfig!A:C,3,FALSE)))","v":""},3,{"$nulls":7},1002,10]
[{"$nulls":12},"",null,null,{"$f":"IF(N29=\"\",\"\",\"-\"&VLOOKUP(N29,EventConditionConfig!A:C,3,FALSE)&IF(O29=\"\",\"\",CHAR(10)&\"-\"&VLOOKUP(O29,EventConditionConfig!A:C,3,FALSE)))","v":""}]
[1040,222,{"$nulls":5},222,"啥也没有....除了钱",null,null,null,"",null,null,{"$f":"IF(N30=\"\",\"\",\"-\"&VLOOKUP(N30,EventConditionConfig!A:C,3,FALSE)&IF(O30=\"\",\"\",CHAR(10)&\"-\"&VLOOKUP(O30,EventConditionConfig!A:C,3,FALSE)))","v":""},3,{"$nulls":7},1002,10]
[{"$nulls":12},"",null,null,{"$f":"IF(N31=\"\",\"\",\"-\"&VLOOKUP(N31,EventConditionConfig!A:C,3,FALSE)&IF(O31=\"\",\"\",CHAR(10)&\"-\"&VLOOKUP(O31,EventConditionConfig!A:C,3,FALSE)))","v":""}]
[1050,223,{"$nulls":5},223,"两夫妻在吵架，似乎为了一件大事..",null,null,null,"",null,null,{"$f":"IF(N32=\"\",\"\",\"-\"&VLOOKUP(N32,EventConditionConfig!A:C,3,FALSE)&IF(O32=\"\",\"\",CHAR(10)&\"-\"&VLOOKUP(O32,EventConditionConfig!A:C,3,FALSE)))","v":""},3,{"$nulls":7},"1002;1001","10;20"]
[{"$nulls":12},"",null,null,{"$f":"IF(N33=\"\",\"\",\"-\"&VLOOKUP(N33,EventConditionConfig!A:C,3,FALSE)&IF(O33=\"\",\"\",CHAR(10)&\"-\"&VLOOKUP(O33,EventConditionConfig!A:C,3,FALSE)))","v":""}]
[1060,224,{"$nulls":5},224,"没有任何发现，但感觉空气很好....下次有空再来看看",null,null,null,"",null,null,{"$f":"IF(N34=\"\",\"\",\"-\"&VLOOKUP(N34,EventConditionConfig!A:C,3,FALSE)&IF(O34=\"\",\"\",CHAR(10)&\"-\"&VLOOKUP(O34,EventConditionConfig!A:C,3,FALSE)))","v":""}]
[{"$nulls":12},"",null,null,{"$f":"IF(N35=\"\",\"\",\"-\"&VLOOKUP(N35,EventConditionConfig!A:C,3,FALSE)&IF(O35=\"\",\"\",CHAR(10)&\"-\"&VLOOKUP(O35,EventConditionConfig!A:C,3,FALSE)))","v":""}]
[{"$nulls":12},"",null,null,{"$f":"IF(N36=\"\",\"\",\"-\"&VLOOKUP(N36,EventConditionConfig!A:C,3,FALSE)&IF(O36=\"\",\"\",CHAR(10)&\"-\"&VLOOKUP(O36,EventConditionConfig!A:C,3,FALSE)))","v":""}]
[{"$nulls":12},"",null,null,{"$f":"IF(N37=\"\",\"\",\"-\"&VLOOKUP(N37,EventConditionConfig!A:C,3,FALSE)&IF(O37=\"\",\"\",CHAR(10)&\"-\"&VLOOKUP(O37,EventConditionConfig!A:C,3,FALSE)))","v":""}]
[{"$f":"K38*100+L38","v":1101},{"$nulls":6},208,"事件10001：一只[怪物1]袭击了你，准备迎战",null,11,{"$f":"IF(K38=K37,L37+1,1)","v":1},"",null,null,{"$f":"IF(N38=\"\",\"\",\"-\"&VLOOKUP(N38,EventConditionConfig!A:C,3,FALSE)&IF(O38=\"\",\"\",CHAR(10)&\"-\"&VLOOKUP(O38,EventConditionConfig!A:C,3,FALSE)))","v":""},2,100001,{"$nulls":8},2,"1102;100"]
[{"$f":"K39*100+L39","v":1102},{"$nulls":6},209,"你击败了怪物，并从它身上吸取了一些修为",null,11,{"$f":"IF(K39=K38,L38+1,1)","v":2},"",null,null,{"$f":"IF(N39=\"\",\"\",\"-\"&VLOOKUP(N39,EventConditionConfig!A:C,3,FALSE)&IF(O39=\"\",\"\",CHAR(10)&\"-\"&VLOOKUP(O39,EventConditionConfig!A:C,3,FALSE)))","v":""},3,{"$nulls":7},1003,3000]
[{"$nulls":12},"",null,null,{"$f":"IF(N40=\"\",\"\",\"-\"&VLOOKUP(N40,EventConditionConfig!A:C,3,FALSE)&IF(O40=\"\",\"\",CHAR(10)&\"-\"&VLOOKUP(O40,EventConditionConfig!A:C,3,FALSE)))","v":""}]
{"$rows_left_out":141}
{"sheet":"EventConditionConfig","index":2,"n_rows":15,"n_cols":11,"rows_kept":15,"cut":false,"hidden":false,"merged":[]}
["ID","message",null,null,"Operation",null,"ConditionType","ConditionPara","finishCount"]
["int","int",null,null,"int",null,"int","int[]","int"]
[]
["ID","描述",null,null,"与0\n或1",null,"条件判断类型","条件判断值","条件完成次数or数量","提示","跳转"]
[1,2078,"拥有金币",{"$f":"CONCATENATE(\"- \",C5,\"{0}/{1}\")","v":"- 拥有金币{0}/{1}"},null,null,1,1001,10]
[2,2079,"达到境界：筑基-中期",{"$f":"CONCATENATE(\"- \",C6,\"{0}/{1}\")","v":"- 达到境界：筑基-中期{0}/{1}"},null,null,3,11,1]
[3,2080,"击杀魔休","- 击杀魔休{0}/{1}",null,null,5,100001,5]
[4,2081,"获得钻石","- 获得钻石{0}/{1}",null,null,6,1002,10]
[5,2082,"使用神识","- 使用神识{0}/{1}",null,null,8,null,1]
[6,2094,"继续飞行一段时间","- 继续飞行一段时间{0}/{1}",null,null,9,null,6]
[7,null,"击败结界兽","- 击败结界兽{0}/{1}",null,null,5,100001,1]
[8,null,"达到境界：筑基-后期","- 达到境界：筑基-后期{0}/{1}",null,null,3,21,1]
[9,null,"击杀妖兽","- 击杀妖兽{0}/{1}",null,null,5,100004,1]
[10,null,"击败后山小妖","- 击败后山小妖{0}/{1}",null,null,5,100001,3]
[11,null,"收集灵草种子","- 收集灵草种子{0}/{1}",null,null,6,1002,3]

{"sheet":"条件类型查询","index":3,"n_rows":9,"n_cols":7,"rows_kept":9,"cut":false,"hidden":false,"merged":[]}
["ID","条件判断类型","条件判断值","条件完成次数or数量","额外文本","不可用","是否可用于事件"]
[1,"拥有特定道具","道具ID","数量≥","检测背包道具",null,1]
[2,"灵根判定","哪个灵根","灵根值≥",null,1]
[3,"境界判断","境界id",null,null,null,1]
[5,"战斗胜利","战斗组ID","胜利次数≥"]
[6,"获得道具","道具的ID","数量≥","探测出事件才开始检测"]
[7,"触发概率","概率值 1000=100%",null,null,null,1]
[8,"使用神识",null,"数量≥"]
[9,"游戏在线多少时长（秒）",null,"时间≥（秒）",null,null,1]

{"sheet":"EventNPC","index":4,"n_rows":23,"n_cols":5,"rows_kept":23,"cut":false,"hidden":false,"merged":[]}
["ID","name","ID","DaoyouID"]
["int","int","int","int"]
[]
["ID","名字","半身像icon","道友ID","名称"]
[1,null,null,null,"玩家"]
[2,null,null,1,"道友1"]
[3,null,null,2,"道友2"]
[4,null,null,3,"道友3"]
[5,null,null,4,"道友4"]
[6,null,null,5,"道友5"]
[7,null,null,6,"道友6"]
[8,null,null,7,"道友7"]
[9,null,null,8,"道友8"]
[10,null,null,9,"道友9"]
[11,null,null,10,"道友10"]
[]
[100,null,null,null,"玩家"]
[101,null,null,null,"蜩鸟"]
[102,null,null,null,"小麻雀"]
[103,null,null,null,"疯道人"]
[104,null,null,null,"痴道人"]
[105,null,null,null,"尧帝"]
[106,null,null,null,"许由"]

{"sheet":"XianTuLogConfig","index":5,"n_rows":8,"n_cols":7,"rows_kept":8,"cut":false,"hidden":false,"merged":[]}
["ID","EventType","Title","Desc","BigMapID"]
["int","int","int","int","int"]
[]
["ID","1主线\n2事件","名称","描述","属于哪个章节"]
[1,1,2087,2089,1,"第一章.逍遥游","多次渡劫失败的你，误入“无何有之乡”，在这里受到了列子的指引，踏上了寻找七道心境的修仙之路。"]
[2,2,2088,2090,1,"无用的大葫芦","惠子种出了巨大葫芦，他觉得毫无用处，非常生气！"]
[3,2,2088,2090,2,"无用的大葫芦","惠子种出了巨大葫芦，他觉得毫无用处，非常生气！"]
[4,2,2088,2090,3,"无用的大葫芦","惠子种出了巨大葫芦，他觉得毫无用处，非常生气！"]