{"text_format":"2","workbook":"xlsx","n_sheets":5,"sheets":["SkillConfig","SkillPowerupConfig","SkillConstant","技能设计","异常状态效果值"],"not_rendered":{"charts":0,"images":0,"macros":0,"external_links":3,"defined_names":1,"comments":0,"pivot_tables":0},"unopened":[],"bounds":{"document_bytes":16777216,"sheet_cells":100000,"run_cost":"one","rows_first":2000,"rows_last":500,"rows_between":2000,"halvings":0,"cell_chars":16384,"cell_head_chars":4096},"cells_cut":0,"cells_raw":0,"read":"whole","date_system":"1900"}

{"sheet":"SkillConfig","index":0,"n_rows":630,"n_cols":53,"rows_kept":630,"cut":false,"hidden":false,"merged":[]}
["ID","PieceID","power","name","dec",null,null,"attribute","icon","scriptName","IDGroup","timelineName","cd","addcd","SkillType","level","effectUpK","effectValue","intensifierIndex","addPropertyType","addPropertyValue","PromoteLan","PromoteLanPara","PromoteLanPara"]
["int","int","float","int","int",null,null,"int","string","string","int","string","float","float","int","int","int","float[]","int[]","int[]","float[]","int","float[]","float[]"]
[{"$nulls":42},{"$f":"SUMIFS(AQ5:AQ10095,$A5:$A10095,\"<>\"&\"\",$P5:$P10095,6)","v":210},{"$f":"SUMIFS(AR5:AR10095,$A5:$A10095,\"<>\"&\"\",$P5:$P10095,6)","v":236},202,10,10,20,20,10]
["技能ID\nIDGroup+技能等级","对应的碎片ID","功法强度\n基于标准强度的百分比\n50=50%","名称语言表ID","描述语言表ID","技能名称","技能效果","技能属性\n1=金\n2=水\n4=木\n8=火\n16=土","图标","脚本名称","技能组","技能的timeline表现，没得就不填，这个可以程序填","功法：多少圈释放1次\n法宝：CD多少秒","功法上阵后，大道增加的CD\n大道的默认CD","技能类型:\n1=主动功法\n2=被动功法\n3=法宝技能\n4=大道\n","星级","效果升级的强化因子100=100%","效果值","允许被加强的效果下表","属性ID表内对应\n101=生命百分比\n102=攻击百分比\n103=防御百分比\n106~110=金木水火土灵根\n","具体效果值","升星简短描述","升星简短描述参数","哪边的法宝被影响\n0=无\n1=前方\n-1=后方","数值1","数值2","数值3","数值4","数值5","数值6","数值7","升星描述",null,null,"总威力","段数","单段伤害","buff占比","额外占比","恢复能力","恢复类型\n0=攻击力\n1=最大生命值","技能生效最大次数",101,102,103,106,107,108,109,110,"名称","描述","升级描述"]
[null,"英雄-主动功法区域"]
[{"$f":"K6*10+P6-1","v":11010},13001,{"$f":"异常状态效果值!G23","v":100},{"$f":"A6+1000000","v":1011010},{"$f":"A6+1100000","v":1111010},"太虚幻剑经","身体周围幻化出{0}柄细剑，每柄细剑对敌人造成{1}%伤害，并有{2}几率对敌人造成1层流血。",1,{"$f":"IF(A6=\"\",\"\",CONCATENATE(\"icon_s\",K6))","v":"icon_s1101"},{"$f":"CONCATENATE(\"S\",K6)","v":"S1101"},1101,"1101_timeline_TD",1,1,1,1,100,{"$f":"_xlfn.TEXTJOIN(\";\",1,Y6:AE6)","v":"6;18;100"},2,{"$f":"_xlfn.TEXTJOIN(\";\",1,IF(AQ6=\"\",\"\",101),IF(AR6=\"\",\"\",102),IF(AS6=\"\",\"\",103),IF(AT6=\"\",\"\",106),IF(AU6=\"\",\"\",107),IF(AV6=\"\",\"\",108),IF(AW6=\"\",\"\",109),IF(AX6=\"\",\"\",110))","v":""},{"$f":"_xlfn.TEXTJOIN(\";\",1,AQ6:AX6)","v":""},-1,null,null,6,{"$f":"ROUND(异常状态效果值!G9*(1-AL6)/AJ6,0)","v":18},100,{"$nulls":5},{"$f":"IF(F6=\"\",\"\",CONCATENATE(F6,\"·\",CHOOSE(P6,\"壹\",\"贰\",\"叁\",\"肆\",\"伍\",\"陆\")))","v":"太虚幻剑经·壹"},null,{"$f":"IF(A6=\"\",\"\",AJ6*AK6/(1-AL6-AM6))","v":154.28571428571399},{"$f":"Y6","v":6},{"$f":"Z6","v":18},{"$f":"AJ6*5/100","v":0.3},{"$nulls":12},{"$f":"VLOOKUP(D6,[1]語言配置表!$A:$B,2,FALSE)","v":"太虚幻剑经"}]
[{"$f":"K7*10+P7-1","v":11011},13001,{"$f":"异常状态效果值!G24","v":150},{"$f":"A7+1000000","v":1011011},{"$f":"A7+1100000","v":1111011},"太虚幻剑经","身体周围幻化出{0}柄细剑，每柄细剑对敌人造成{1}%伤害，并有{2}几率对敌人造成1层流血。",1,{"$f":"IF(A7=\"\",\"\",CONCATENATE(\"icon_s\",K7))","v":"icon_s1101"},{"$f":"CONCATENATE(\"S\",K7)","v":"S1101"},1101,"1101_timeline_TD",1,1,1,2,100,{"$f":"_xlfn.TEXTJOIN(\";\",1,Y7:AE7)","v":"6;20;100"},2,{"$f":"_xlfn.TEXTJOIN(\";\",1,IF(AQ7=\"\",\"\",101),IF(AR7=\"\",\"\",102),IF(AS7=\"\",\"\",103),IF(AT7=\"\",\"\",106),IF(AU7=\"\",\"\",107),IF(AV7=\"\",\"\",108),IF(AW7=\"\",\"\",109),IF(AX7=\"\",\"\",110))","v":""},{"$f":"_xlfn.TEXTJOIN(\";\",1,AQ7:AX7)","v":""},{"$f":"A7+1200000","v":1211011},2,null,6,{"$f":"ROUND(异常状态效果值!G10*(1-AL7)/AJ7,0)","v":20},100,{"$nulls":4},{"$f":"CONCATENATE(\"飞剑数量+\",W7)","v":"飞剑数量+2"},{"$f":"IF(F7=\"\",\"\",CONCATENATE(F7,\"·\",CHOOSE(P7,\"壹\",\"贰\",\"叁\",\"肆\",\"伍\",\"陆\")))","v":"太虚幻剑经·贰"},null,{"$f":"IF(A7=\"\",\"\",AJ7*AK7/(1-AL7-AM7))","v":171.42857142857099},{"$f":"Y7","v":6},{"$f":"Z7","v":20},{"$f":"AJ7*5/100","v":0.3}]
[11012,13001,{"$f":"异常状态效果值!G25","v":225},1011012,1111012,"太虚幻剑经","身体周围幻化出{0}柄细剑，每柄细剑对敌人造成{1}%伤害，并有{2}几率对敌人造成1层流血。",1,"icon_s1101","S1101",1101,"1101_timeline_TD",1,1,1,3,100,"6;23;100",2,"101","10",{"$f":"A8+1200000","v":1211012},10,null,6,{"$f":"ROUND(异常状态效果值!G11*(1-AL8)/AJ8,0)","v":23},100,{"$nulls":4},{"$f":"CONCATENATE(CHOOSE(T8-100,\"生命\",\"攻击\",\"防御\"),\"+\",W8,\"%\")","v":"生命+10%"},"太虚幻剑经·叁",null,197.142857142857,6,23,{"$f":"AJ8*5/100","v":0.3},{"$nulls":4},10]
[11013,13001,{"$f":"异常状态效果值!G26","v":337.5},1011013,1111013,"太虚幻剑经","身体周围幻化出{0}柄细剑，每柄细剑对敌人造成{1}%伤害，并有{2}几率对敌人造成1层流血。\n如果敌人有减益状态，则虚剑伤害提升{3}%。",1,"icon_s1101","S1101",1101,"1101_timeline_TD",1,1,1,4,100,"6;23;100;10",2,"101","10",1211013,1,null,6,{"$f":"ROUND(异常状态效果值!G12*(1-AL9)/AJ9,0)","v":23},100,10,null,null,null,{"$f":"CONCATENATE(\"飞剑数量+\",W9,\"，对带减益的敌人增伤\")","v":"飞剑数量+1，对带减益的敌人增伤"},"太虚幻剑经·肆",null,230,6,23,{"$f":"AJ9*5/100+AB9/100","v":0.4},{"$nulls":4},10]
[11014,13001,{"$f":"异常状态效果值!G27","v":506.25},1011014,1111014,"太虚幻剑经","身体周围幻化出{0}柄细剑，每柄细剑对敌人造成{1}%伤害，并有{2}几率对敌人造成1层流血。\n如果敌人有减益状态，则虚剑伤害提升{3}%。",1,"icon_s1101","S1101",1101,"1101_timeline_TD",1,1,1,5,100,"6;26;100;10",2,"101","20",1211014,10,null,6,{"$f":"ROUND(异常状态效果值!G13*(1-AL10)/AJ10,0)","v":26},100,10,null,null,null,{"$f":"CONCATENATE(CHOOSE(T10-100,\"生命\",\"攻击\",\"防御\"),\"+\",W10,\"%\")","v":"生命+10%"},"太虚幻剑经·伍",null,260,6,26,{"$f":"AJ10*5/100+AB10/100","v":0.4},{"$nulls":4},20]
[11015,13001,{"$f":"异常状态效果值!G28","v":759.375},1011015,1111015,"太虚幻剑经","身体周围幻化出{0}柄更大体型的虚剑，每柄虚剑对敌人造成{1}%伤害，并有{2}几率对敌人造成1层流血。\n如果敌人有减益状态，则虚剑伤害提升{3}%。",1,"icon_s1101","S1101",1101,"1101_timeline_TD",1,1,1,6,100,"7;24;100;10",2,"101","20",1211015,null,null,7,{"$f":"ROUND(异常状态效果值!G14*(1-AL11)/AJ11,0)","v":24},100,10,null,null,null,"发射伤害更高的幻剑","太虚幻剑经·陆",null,305.45454545454498,7,24,{"$f":"AJ11*5/100+AB11/100","v":0.45},{"$nulls":4},20]
[{"$nulls":8},"",{"$nulls":4},1,null,null,100,{"$nulls":15},"",null,""]
[{"$f":"K13*10+P13-1","v":11020},{"$f":"B6+1","v":13002},{"$f":"异常状态效果值!G23*1.3","v":130},{"$f":"A13+1000000","v":1011020},{"$f":"A13+1100000","v":1111020},"天罡剑气诀","吸收自身灵气凝聚{0}柄大剑，大剑旋转快速穿透敌人对敌人照成{1}%伤害",1,"icon_s1102",{"$f":"CONCATENATE(\"S\",K13)","v":"S1102"},{"$f":"K6+1","v":1102},"1102_timeline_TD",1,1,1,1,100,{"$f":"_xlfn.TEXTJOIN(\";\",1,Y13:AE13)","v":"1;170"},2,{"$f":"_xlfn.TEXTJOIN(\";\",1,IF(AQ13=\"\",\"\",101),IF(AR13=\"\",\"\",102),IF(AS13=\"\",\"\",103),IF(AT13=\"\",\"\",106),IF(AU13=\"\",\"\",107),IF(AV13=\"\",\"\",108),IF(AW13=\"\",\"\",109),IF(AX13=\"\",\"\",110))","v":""},{"$f":"_xlfn.TEXTJOIN(\";\",1,AQ13:AX13)","v":""},-1,null,null,1,{"$f":"ROUND(异常状态效果值!F9*(1-AL13)/AJ13,0)","v":170},{"$nulls":6},"天罡剑气诀·壹",null,170,{"$f":"Y13","v":1},{"$f":"Z13","v":170}]
[{"$f":"K14*10+P14-1","v":11021},{"$f":"B7+1","v":13002},{"$f":"异常状态效果值!G24*1.3","v":195},1011021,{"$f":"A14+1100000","v":1111021},"天罡剑气诀","吸收自身灵气凝聚{0}柄大剑，大剑旋转快速穿透敌人对敌人照成{1}%伤害\n敌人如果在流血或放血状态，对敌人造成的伤害+{2}%",1,"icon_s1102",{"$f":"CONCATENATE(\"S\",K14)","v":"S1102"},{"$f":"K7+1","v":1102},"1102_timeline_TD",1,1,1,2,100,{"$f":"_xlfn.TEXTJOIN(\";\",1,Y14:AE14)","v":"1;150;25"},2,{"$f":"_xlfn.TEXTJOIN(\";\",1,IF(AQ14=\"\",\"\",101),IF(AR14=\"\",\"\",102),IF(AS14=\"\",\"\",103),IF(AT14=\"\",\"\",106),IF(AU14=\"\",\"\",107),IF(AV14=\"\",\"\",108),IF(AW14=\"\",\"\",109),IF(AX14=\"\",\"\",110))","v":""},{"$f":"_xlfn.TEXTJOIN(\";\",1,AQ14:AX14)","v":""},{"$f":"A14+1200000","v":1211021},2,null,1,{"$f":"ROUND(异常状态效果值!F10*(1-AL14)/AJ14,0)","v":150},25,{"$nulls":4},"对流血或放血敌人增伤","天罡剑气诀·贰",null,200,{"$f":"Y14","v":1},{"$f":"Z14","v":150},{"$f":"AA14/100","v":0.25}]
[11022,13002,{"$f":"异常状态效果值!G25*1.3","v":292.5},1011022,1111022,"天罡剑气诀","吸收自身灵气凝聚{0}柄大剑，大剑旋转快速穿透敌人对敌人照成{1}%伤害\n敌人如果在流血或放血状态，对敌人造成的伤害+{2}%",1,"icon_s1102","S1102",1102,"1102_timeline_TD",1,1,1,3,100,"1;173;25",2,"102","10",{"$f":"A15+1200000","v":1211022},10,null,1,{"$f":"ROUND(异常状态效果值!F11*(1-AL15)/AJ15,0)","v":173},25,{"$nulls":4},{"$f":"CONCATENATE(CHOOSE(T15-100,\"生命\",\"攻击\",\"防御\"),\"+\",W15,\"%\")","v":"攻击+10%"},"天罡剑气诀·叁",null,230.666666666667,1,{"$f":"Z15","v":173},{"$f":"AA15/100","v":0.25},{"$nulls":5},10]
[11023,13002,{"$f":"异常状态效果值!G26*1.3","v":438.75},1011023,1111023,"天罡剑气诀","吸收自身灵气凝聚{0}柄大剑，大剑旋转快速穿透敌人对敌人照成{1}%伤害\n敌人如果在流血或放血状态，对敌人造成的伤害+{2}%\n重伤敌人后，如果目标没在放血状态，直接放血且不消耗流血层数",1,"icon_s1102","S1102",1102,"1102_timeline_TD",1,1,1,4,100,"1;169;25",2,"102","10",1211023,1,null,1,{"$f":"ROUND(异常状态效果值!F12*(1-AL16)/AJ16,0)","v":169},25,{"$nulls":4},"无条件放血","天罡剑气诀·肆",null,260,1,169,{"$f":"AA16/100+0.1","v":0.35},{"$nulls":5},10]
[11024,13002,{"$f":"异常状态效果值!G27*1.3","v":658.125},1011024,1111024,"天罡剑气诀","吸收自身灵气凝聚{0}柄大剑，大剑旋转快速穿透敌人对敌人照成{1}%伤害\n敌人如果在流血或放血状态，对敌人造成的伤害+{2}%\n重伤敌人后，如果目标没在放血状态，直接放血且不消耗流血层数",1,"icon_s1102","S1102",1102,"1102_timeline_TD",1,1,1,5,100,"1;195;25",2,"102","20",1211024,10,null,1,{"$f":"ROUND(异常状态效果值!F13*(1-AL17)/AJ17,0)","v":195},25,{"$nulls":4},{"$f":"CONCATENATE(CHOOSE(T17-100,\"生命\",\"攻击\",\"防御\"),\"+\",W17,\"%\")","v":"攻击+10%"},"天罡剑气诀·伍",null,300,1,195,{"$f":"AA17/100+0.1","v":0.35},{"$nulls":5},20]
[11025,13002,{"$f":"异常状态效果值!G28*1.3","v":987.1875},1011025,1111025,"天罡剑气诀","吸收自身灵气凝聚{0}柄大剑，大剑旋转快速穿透敌人对敌人照成{1}%伤害\n敌人如果在流血或放血状态，对敌人造成的伤害+{2}%\n重伤敌人后，如果目标没在放血状态，直接放血且不消耗流血层数\n全盛状态，剑的体型变大，对拼强度+{3}%，伤害提升{4}%",1,"icon_s1102","S1102",1102,"1102_timeline_TD",1,1,1,6,100,"1;234;25;100",2,"102","20",1211025,null,null,1,{"$f":"ROUND(异常状态效果值!F14*(1-AL18)/AJ18,0)","v":234},25,100,null,null,null,"对拼强度和伤害提升","天罡剑气诀·陆",null,360,1,234,{"$f":"(AA18+AC18)/100+0.1","v":0.35},{"$nulls":5},20]
[{"$nulls":8},"",{"$nulls":4},1,null,null,100,{"$nulls":15},"",null,"",null,null,null," "]
[{"$f":"K20*10+P20-1","v":11030},{"$f":"B13+1","v":13003},100,{"$f":"A20+1000000","v":1011030},{"$f":"A20+1100000","v":1111030},"血刃金煌功","向前方挥动{0}次，每次挥动形成一道血刃刀气，对敌人{1}造成伤害，并有{2}%概率对敌人造成流血。",1,"icon_s1103",{"$f":"CONCATENATE(\"S\",K20)","v":"S1103"},{"$f":"K13+1","v":1103},"1103_timeline_TD",1,1,1,1,100,{"$f":"_xlfn.TEXTJOIN(\";\",1,Y20:AE20)","v":"3;53;100"},2,{"$f":"_xlfn.TEXTJOIN(\";\",1,IF(AQ20=\"\",\"\",101),IF(AR20=\"\",\"\",102),IF(AS20=\"\",\"\",103),IF(AT20=\"\",\"\",106),IF(AU20=\"\",\"\",107),IF(AV20=\"\",\"\",108),IF(AW20=\"\",\"\",109),IF(AX20=\"\",\"\",110))","v":""},{"$f":"_xlfn.TEXTJOIN(\";\",1,AQ20:AX20)","v":""},-1,null,null,3,{"$f":"ROUND(异常状态效果值!F9*(1-AL20-AN20*0.1)/AJ20,0)","v":53},100,{"$nulls":5},"血刃金煌功·壹",null,169.14893617021301,{"$f":"Y20","v":3},{"$f":"Z20","v":53},{"$f":"AJ20*异常状态效果值!B1/100","v":0.06}]
{"$rows_left_out":611}
{"sheet":"SkillPowerupConfig","index":1,"n_rows":304,"n_cols":13,"rows_kept":304,"cut":false,"hidden":false,"merged":[]}
["ID","MainPower","SkillPower1","LevelupItem","LevelupItemNum",{"$nulls":4},"PlayerLevelLimit"]
["int","float","float","int[]","int[]",{"$nulls":4},"int"]
[]
["等级","功法对拼标准强度","标准强度百分比","功法升级所需道具","攻击升级所需道具数量","道具1","数量1","道具2","数量2","升级所需境界",1.0369999999999999,100,3000]
[1,100,100,{"$f":"_xlfn.TEXTJOIN(\";\",1,F5,H5)","v":"1001;1005"},{"$f":"_xlfn.TEXTJOIN(\";\",1,G5,I5)","v":"5051;63"},1001,{"$f":"ROUND(20*VLOOKUP(J5,[2]ResourceLevelConfig!$A:$G,3,FALSE)/40,0)","v":5051},1005,{"$f":"ROUND(50*VLOOKUP(J5,[2]ResourceLevelConfig!$A:$G,7,FALSE)/80,0)","v":63},2]
[2,{"$f":"ROUND(B5*K$4,0)","v":104},{"$f":"ROUND(C$5+(M$4*A5/300),2)","v":110},{"$f":"_xlfn.TEXTJOIN(\";\",1,F6,H6)","v":"1001;1005"},"5101;64",1001,{"$f":"ROUND(20*VLOOKUP(J6,[2]ResourceLevelConfig!$A:$G,3,FALSE)/40,0)","v":5101},1005,{"$f":"ROUND(50*VLOOKUP(J6,[2]ResourceLevelConfig!$A:$G,7,FALSE)/80,0)","v":64},3]
[3,{"$f":"ROUND(B6*K$4,0)","v":108},{"$f":"ROUND(C$5+(M$4*A6/300),2)","v":120},"1001;1005","5153;64",1001,{"$f":"ROUND(20*VLOOKUP(J7,[2]ResourceLevelConfig!$A:$G,3,FALSE)/40,0)","v":5153},1005,{"$f":"ROUND(50*VLOOKUP(J7,[2]ResourceLevelConfig!$A:$G,7,FALSE)/80,0)","v":64},4]
[4,112,130,"1001;1005","5205;65",1001,{"$f":"ROUND(20*VLOOKUP(J8,[2]ResourceLevelConfig!$A:$G,3,FALSE)/40,0)","v":5205},1005,{"$f":"ROUND(50*VLOOKUP(J8,[2]ResourceLevelConfig!$A:$G,7,FALSE)/80,0)","v":65},5]
[5,116,140,"1001;1005","5257;66",1001,{"$f":"ROUND(20*VLOOKUP(J9,[2]ResourceLevelConfig!$A:$G,3,FALSE)/40,0)","v":5257},1005,{"$f":"ROUND(50*VLOOKUP(J9,[2]ResourceLevelConfig!$A:$G,7,FALSE)/80,0)","v":66},6]
[6,120,150,"1001;1005","5310;66",1001,{"$f":"ROUND(20*VLOOKUP(J10,[2]ResourceLevelConfig!$A:$G,3,FALSE)/40,0)","v":5310},1005,{"$f":"ROUND(50*VLOOKUP(J10,[2]ResourceLevelConfig!$A:$G,7,FALSE)/80,0)","v":66},7]
[7,124,160,"1001;1005","5364;67",1001,{"$f":"ROUND(20*VLOOKUP(J11,[2]ResourceLevelConfig!$A:$G,3,FALSE)/40,0)","v":5364},1005,{"$f":"ROUND(50*VLOOKUP(J11,[2]ResourceLevelConfig!$A:$G,7,FALSE)/80,0)","v":67},8]
[8,129,170,"1001;1005","5418;68",1001,{"$f":"ROUND(20*VLOOKUP(J12,[2]ResourceLevelConfig!$A:$G,3,FALSE)/40,0)","v":5418},1005,{"$f":"ROUND(50*VLOOKUP(J12,[2]ResourceLevelConfig!$A:$G,7,FALSE)/80,0)","v":68},9]
[9,134,180,"1001;1005","5472;68",1001,{"$f":"ROUND(20*VLOOKUP(J13,[2]ResourceLevelConfig!$A:$G,3,FALSE)/40,0)","v":5472},1005,{"$f":"ROUND(50*VLOOKUP(J13,[2]ResourceLevelConfig!$A:$G,7,FALSE)/80,0)","v":68},10]
[10,139,190,"1001;1005","5527;69",1001,{"$f":"ROUND(20*VLOOKUP(J14,[2]ResourceLevelConfig!$A:$G,3,FALSE)/40,0)","v":5527},1005,{"$f":"ROUND(50*VLOOKUP(J14,[2]ResourceLevelConfig!$A:$G,7,FALSE)/80,0)","v":69},11]
[11,144,200,"1001;1005","5583;70",1001,{"$f":"ROUND(20*VLOOKUP(J15,[2]ResourceLevelConfig!$A:$G,3,FALSE)/40,0)","v":5583},1005,{"$f":"ROUND(50*VLOOKUP(J15,[2]ResourceLevelConfig!$A:$G,7,FALSE)/80,0)","v":70},12]
[12,149,210,"1001;1005","5639;71",1001,{"$f":"ROUND(20*VLOOKUP(J16,[2]ResourceLevelConfig!$A:$G,3,FALSE)/40,0)","v":5639},1005,{"$f":"ROUND(50*VLOOKUP(J16,[2]ResourceLevelConfig!$A:$G,7,FALSE)/80,0)","v":71},13]
[13,155,220,"1001;1005","5696;71",1001,{"$f":"ROUND(20*VLOOKUP(J17,[2]ResourceLevelConfig!$A:$G,3,FALSE)/40,0)","v":5696},1005,{"$f":"ROUND(50*VLOOKUP(J17,[2]ResourceLevelConfig!$A:$G,7,FALSE)/80,0)","v":71},14]
[14,161,230,"1001;1005","5753;72",1001,{"$f":"ROUND(20*VLOOKUP(J18,[2]ResourceLevelConfig!$A:$G,3,FALSE)/40,0)","v":5753},1005,{"$f":"ROUND(50*VLOOKUP(J18,[2]ResourceLevelConfig!$A:$G,7,FALSE)/80,0)","v":72},15]
[15,167,240,"1001;1005","5811;73",1001,{"$f":"ROUND(20*VLOOKUP(J19,[2]ResourceLevelConfig!$A:$G,3,FALSE)/40,0)","v":5811},1005,{"$f":"ROUND(50*VLOOKUP(J19,[2]ResourceLevelConfig!$A:$G,7,FALSE)/80,0)","v":73},16]
[16,173,250,"1001;1005","5870;73",1001,{"$f":"ROUND(20*VLOOKUP(J20,[2]ResourceLevelConfig!$A:$G,3,FALSE)/40,0)","v":5870},1005,{"$f":"ROUND(50*VLOOKUP(J20,[2]ResourceLevelConfig!$A:$G,7,FALSE)/80,0)","v":73},17]
{"$rows_left_out":285}
{"sheet":"SkillConstant","index":2,"n_rows":7,"n_cols":8,"rows_kept":7,"cut":false,"hidden":false,"merged":[]}
["ID",null,"SkillPromoteNeedPieceNum"]
["int",null,"int[]"]
[]
[null,null,"功法升到对应星级所需碎片数量","2星","3星","4星","5星","6星"]
[3,"蓝色",{"$f":"_xlfn.TEXTJOIN(\";\",1,D5:H5)","v":"12;24;36;48;60"},{"$f":"[3]抽卡!S10","v":12},{"$f":"[3]抽卡!T10","v":24},{"$f":"[3]抽卡!U10","v":36},{"$f":"[3]抽卡!V10","v":48},{"$f":"[3]抽卡!W10","v":60}]
[4,"紫色",{"$f":"_xlfn.TEXTJOIN(\";\",1,D6:H6)","v":"20;30;40;50;60"},{"$f":"[3]抽卡!S11","v":20},{"$f":"[3]抽卡!T11","v":30},{"$f":"[3]抽卡!U11","v":40},{"$f":"[3]抽卡!V11","v":50},{"$f":"[3]抽卡!W11","v":60}]
[5,"橙色","30;30;60;60;90",{"$f":"[3]抽卡!S12","v":30},{"$f":"[3]抽卡!T12","v":30},{"$f":"[3]抽卡!U12","v":60},{"$f":"[3]抽卡!V12","v":60},{"$f":"[3]抽卡!W12","v":90}]

{"sheet":"技能设计","index":3,"n_rows":41,"n_cols":27,"rows_kept":41,"cut":false,"hidden":false,"merged":[]}
[null,null,"生命","攻击","防御",null,"金","水","木","火","土"]
[null,"星级",101,102,103,null,106,107,108,109,110]
["0星",1,{"$f":"SUMIFS(SkillConfig!AQ5:AQ10095,SkillConfig!$A5:$A10095,\"<>\"&\"\",SkillConfig!$P5:$P10095,$B3)","v":0},{"$f":"SUMIFS(SkillConfig!AR5:AR10095,SkillConfig!$A5:$A10095,\"<>\"&\"\",SkillConfig!$P5:$P10095,$B3)","v":0},{"$f":"SUMIFS(SkillConfig!AS5:AS10095,SkillConfig!$A5:$A10095,\"<>\"&\"\",SkillConfig!$P5:$P10095,$B3)","v":0},null,{"$f":"SUMIFS(SkillConfig!AT5:AT10095,SkillConfig!$A5:$A10095,\"<>\"&\"\",SkillConfig!$P5:$P10095,$B3)","v":0},{"$f":"SUMIFS(SkillConfig!AU5:AU10095,SkillConfig!$A5:$A10095,\"<>\"&\"\",SkillConfig!$P5:$P10095,$B3)","v":0},{"$f":"SUMIFS(SkillConfig!AV5:AV10095,SkillConfig!$A5:$A10095,\"<>\"&\"\",SkillConfig!$P5:$P10095,$B3)","v":0},{"$f":"SUMIFS(SkillConfig!AW5:AW10095,SkillConfig!$A5:$A10095,\"<>\"&\"\",SkillConfig!$P5:$P10095,$B3)","v":0},{"$f":"SUMIFS(SkillConfig!AX5:AX10095,SkillConfig!$A5:$A10095,\"<>\"&\"\",SkillConfig!$P5:$P10095,$B3)","v":0}]
["1星",2,{"$f":"SUMIFS(SkillConfig!AQ6:AQ10096,SkillConfig!$A6:$A10096,\"<>\"&\"\",SkillConfig!$P6:$P10096,$B4)","v":30},{"$f":"SUMIFS(SkillConfig!AR6:AR10096,SkillConfig!$A6:$A10096,\"<>\"&\"\",SkillConfig!$P6:$P10096,$B4)","v":44},{"$f":"SUMIFS(SkillConfig!AS6:AS10096,SkillConfig!$A6:$A10096,\"<>\"&\"\",SkillConfig!$P6:$P10096,$B4)","v":33},null,{"$f":"SUMIFS(SkillConfig!AT6:AT10096,SkillConfig!$A6:$A10096,\"<>\"&\"\",SkillConfig!$P6:$P10096,$B4)","v":5},{"$f":"SUMIFS(SkillConfig!AU6:AU10096,SkillConfig!$A6:$A10096,\"<>\"&\"\",SkillConfig!$P6:$P10096,$B4)","v":0},{"$f":"SUMIFS(SkillConfig!AV6:AV10096,SkillConfig!$A6:$A10096,\"<>\"&\"\",SkillConfig!$P6:$P10096,$B4)","v":5},{"$f":"SUMIFS(SkillConfig!AW6:AW10096,SkillConfig!$A6:$A10096,\"<>\"&\"\",SkillConfig!$P6:$P10096,$B4)","v":5},{"$f":"SUMIFS(SkillConfig!AX6:AX10096,SkillConfig!$A6:$A10096,\"<>\"&\"\",SkillConfig!$P6:$P10096,$B4)","v":0}]
["2星",3,{"$f":"SUMIFS(SkillConfig!AQ7:AQ10097,SkillConfig!$A7:$A10097,\"<>\"&\"\",SkillConfig!$P7:$P10097,$B5)","v":95},{"$f":"SUMIFS(SkillConfig!AR7:AR10097,SkillConfig!$A7:$A10097,\"<>\"&\"\",SkillConfig!$P7:$P10097,$B5)","v":103},{"$f":"SUMIFS(SkillConfig!AS7:AS10097,SkillConfig!$A7:$A10097,\"<>\"&\"\",SkillConfig!$P7:$P10097,$B5)","v":96},null,{"$f":"SUMIFS(SkillConfig!AT7:AT10097,SkillConfig!$A7:$A10097,\"<>\"&\"\",SkillConfig!$P7:$P10097,$B5)","v":5},{"$f":"SUMIFS(SkillConfig!AU7:AU10097,SkillConfig!$A7:$A10097,\"<>\"&\"\",SkillConfig!$P7:$P10097,$B5)","v":5},{"$f":"SUMIFS(SkillConfig!AV7:AV10097,SkillConfig!$A7:$A10097,\"<>\"&\"\",SkillConfig!$P7:$P10097,$B5)","v":10},{"$f":"SUMIFS(SkillConfig!AW7:AW10097,SkillConfig!$A7:$A10097,\"<>\"&\"\",SkillConfig!$P7:$P10097,$B5)","v":10},{"$f":"SUMIFS(SkillConfig!AX7:AX10097,SkillConfig!$A7:$A10097,\"<>\"&\"\",SkillConfig!$P7:$P10097,$B5)","v":5}]
["3星",4,{"$f":"SUMIFS(SkillConfig!AQ8:AQ10098,SkillConfig!$A8:$A10098,\"<>\"&\"\",SkillConfig!$P8:$P10098,$B6)","v":130},{"$f":"SUMIFS(SkillConfig!AR8:AR10098,SkillConfig!$A8:$A10098,\"<>\"&\"\",SkillConfig!$P8:$P10098,$B6)","v":157},{"$f":"SUMIFS(SkillConfig!AS8:AS10098,SkillConfig!$A8:$A10098,\"<>\"&\"\",SkillConfig!$P8:$P10098,$B6)","v":129},null,{"$f":"SUMIFS(SkillConfig!AT8:AT10098,SkillConfig!$A8:$A10098,\"<>\"&\"\",SkillConfig!$P8:$P10098,$B6)","v":10},{"$f":"SUMIFS(SkillConfig!AU8:AU10098,SkillConfig!$A8:$A10098,\"<>\"&\"\",SkillConfig!$P8:$P10098,$B6)","v":5},{"$f":"SUMIFS(SkillConfig!AV8:AV10098,SkillConfig!$A8:$A10098,\"<>\"&\"\",SkillConfig!$P8:$P10098,$B6)","v":10},{"$f":"SUMIFS(SkillConfig!AW8:AW10098,SkillConfig!$A8:$A10098,\"<>\"&\"\",SkillConfig!$P8:$P10098,$B6)","v":10},{"$f":"SUMIFS(SkillConfig!AX8:AX10098,SkillConfig!$A8:$A10098,\"<>\"&\"\",SkillConfig!$P8:$P10098,$B6)","v":5}]
["4星",5,{"$f":"SUMIFS(SkillConfig!AQ9:AQ10099,SkillConfig!$A9:$A10099,\"<>\"&\"\",SkillConfig!$P9:$P10099,$B7)","v":195},{"$f":"SUMIFS(SkillConfig!AR9:AR10099,SkillConfig!$A9:$A10099,\"<>\"&\"\",SkillConfig!$P9:$P10099,$B7)","v":216},{"$f":"SUMIFS(SkillConfig!AS9:AS10099,SkillConfig!$A9:$A10099,\"<>\"&\"\",SkillConfig!$P9:$P10099,$B7)","v":187},null,{"$f":"SUMIFS(SkillConfig!AT9:AT10099,SkillConfig!$A9:$A10099,\"<>\"&\"\",SkillConfig!$P9:$P10099,$B7)","v":10},{"$f":"SUMIFS(SkillConfig!AU9:AU10099,SkillConfig!$A9:$A10099,\"<>\"&\"\",SkillConfig!$P9:$P10099,$B7)","v":10},{"$f":"SUMIFS(SkillConfig!AV9:AV10099,SkillConfig!$A9:$A10099,\"<>\"&\"\",SkillConfig!$P9:$P10099,$B7)","v":20},{"$f":"SUMIFS(SkillConfig!AW9:AW10099,SkillConfig!$A9:$A10099,\"<>\"&\"\",SkillConfig!$P9:$P10099,$B7)","v":20},{"$f":"SUMIFS(SkillConfig!AX9:AX10099,SkillConfig!$A9:$A10099,\"<>\"&\"\",SkillConfig!$P9:$P10099,$B7)","v":10}]
["5星",6,{"$f":"SUMIFS(SkillConfig!AQ10:AQ10100,SkillConfig!$A10:$A10100,\"<>\"&\"\",SkillConfig!$P10:$P10100,$B8)","v":210},{"$f":"SUMIFS(SkillConfig!AR10:AR10100,SkillConfig!$A10:$A10100,\"<>\"&\"\",SkillConfig!$P10:$P10100,$B8)","v":236},{"$f":"SUMIFS(SkillConfig!AS10:AS10100,SkillConfig!$A10:$A10100,\"<>\"&\"\",SkillConfig!$P10:$P10100,$B8)","v":202},null,{"$f":"SUMIFS(SkillConfig!AT10:AT10100,SkillConfig!$A10:$A10100,\"<>\"&\"\",SkillConfig!$P10:$P10100,$B8)","v":10},{"$f":"SUMIFS(SkillConfig!AU10:AU10100,SkillConfig!$A10:$A10100,\"<>\"&\"\",SkillConfig!$P10:$P10100,$B8)","v":10},{"$f":"SUMIFS(SkillConfig!AV10:AV10100,SkillConfig!$A10:$A10100,\"<>\"&\"\",SkillConfig!$P10:$P10100,$B8)","v":20},{"$f":"SUMIFS(SkillConfig!AW10:AW10100,SkillConfig!$A10:$A10100,\"<>\"&\"\",SkillConfig!$P10:$P10100,$B8)","v":20},{"$f":"SUMIFS(SkillConfig!AX10:AX10100,SkillConfig!$A10:$A10100,\"<>\"&\"\",SkillConfig!$P10:$P10100,$B8)","v":10}]
{"$rows_empty":9}
[{"$nulls":25},"金","高速，低伤害"]
[{"$nulls":12},20,{"$nulls":8},"血祭神通","为所有流血状态附加上血祭，\n流血带来的伤害会充能血祭，充能满后\n对敌人照成大量伤害",null,null,null,"流血"]
[{"$nulls":21},"金煞决\n","前方功法对敌人照成伤害时额外附加一层流血",null,null,null,"放血"]
[]
[]
[]
[{"$nulls":21},"毒瘴领域\n","前方功法在击中目标时，额外施加 一层毒，对流血中的目标额外施加一层\n",null,null,"木","高范围，高异常伤害"]
[{"$nulls":21},"毒爆\n","后方功法击中目标后让目标身上\n的毒气爆炸开来，对目标照成额外的20%伤害，如果范围内其敌人也有毒，则对其他敌人照成等额的伤害",null,null,null,"毒"]
[]
[{"$nulls":21},"异常转移","对目标照成的以上状态有20%概率转移到\n周围的敌人身上"]
[]
{"$rows_left_out":14}
{"sheet":"异常状态效果值","index":4,"n_rows":50,"n_cols":39,"rows_kept":50,"cut":false,"hidden":false,"merged":[[43,12,44,12],[45,12,46,12],[47,12,48,12],[49,12,50,12],[45,11,46,11],[47,11,48,11],[49,11,50,11],[16,12,17,12],[18,12,19,12],[20,12,21,12],[22,12,23,12],[24,12,25,12],[26,12,27,12],[28,12,29,12],[30,12,31,12],[33,12,34,12],[35,12,36,12],[37,12,38,12],[39,12,40,12],[41,12,42,12],[35,11,36,11],[37,11,38,11],[39,11,40,11],[41,11,42,11],[43,11,44,11],[24,11,25,11],[26,11,27,11],[28,11,29,11],[30,11,31,11],[33,11,34,11],[13,11,15,11],[16,11,17,11],[18,11,19,11],[20,11,21,11],[22,11,23,11]]}
["流血buff效果值",2]
["寒气buff转换为伤害值",2]
["毒的转换值",2]
["燃烧转换值",2]
["细尘转换值",1]
["感电转换值",1,{"$nulls":4},"功法伤害占比系数",1]
["鼠疫转换值",3]
[{"$nulls":5},"SSR功法","SR功法伤害强度","R普通","法宝伤害强度"]
[{"$nulls":5},170,150,150,500]
[{"$nulls":5},200,170,170,700]
[{"$nulls":5},230,200,180,900]
[{"$nulls":5},260,230,190,1100]
[{"$nulls":5},300,260,200,1300]
[{"$nulls":5},360,300,220,1500,null,null,"天衍星辰诀","引星辰之力入体，增强玩家体魄让后方槽位的功法无视防御性护盾（功法法宝带来的防护罩、自身护盾），"]
[]
[]
[{"$nulls":11},"法宝秘籍","后方槽位第一个技能在击中目前时为法宝提供1%充能"]
[]
[{"$nulls":11},"崩脉决","前方功法照成伤害时有{0}%概率施加一层对应属性的伤势"]
[{"$nulls":24},85,{"$nulls":11},{"$f":"AI20*异常状态效果值!B1/100","v":0}]
{"$rows_left_out":30}