{"text_format":"2","workbook":"xlsx","n_sheets":3,"sheets":["ItemConfig","ID分段","道具用途说明"],"not_rendered":{"charts":0,"images":0,"macros":0,"external_links":3,"defined_names":1,"comments":0,"pivot_tables":0},"unopened":[],"bounds":{"document_bytes":16777216,"sheet_cells":100000,"run_cost":"one","rows_first":2000,"rows_last":500,"rows_between":2000,"halvings":0,"cell_chars":16384,"cell_head_chars":4096},"cells_cut":0,"cells_raw":0,"read":"whole","date_system":"1900"}

{"sheet":"ItemConfig","index":0,"n_rows":213,"n_cols":37,"rows_kept":213,"cut":false,"hidden":false,"merged":[]}
["ID","itemName",null,"itemDesc",null,"icon","itemTag",null,"quality","stack","isSell","SkiptoID","rewardsNum","isVisible","isUse","useLimit","useLimtValue","costItemNum","rewardsItems","rewardsItemNums","stack","associateID","associateVlaue","sort","itemDesc2"]
["int","int",null,"int",null,"string","int",null,"int","int","bool","int[]","int","int","bool","int",null,"int","int[]","int[]","int","int","int[]","int","int"]
[]
["ID1","道具名称\n","道具名\n(查看)","功能说明","功能说明","道具图标","道具分类\n见ID分段",{"$f":"SUBTOTAL(3,H5:H10009)","v":191},"品质\n1.[物品]白\n2.[物品]绿\n3.[物品]蓝\n4.[物品]紫\n5.[物品]橙\n6.[物品]红","堆叠数量\n0.无限","是否出售","跳转ID","出售金额","进入背包时，是否可见","是否可用","使用限制\n0. 无\n1. 共鸣等级","限制的值","消耗道具数量","获得道具ID","获得道具的数量","堆叠数量\n0.无限","特殊功能ID\n详情见说明页","特殊功能参数\n详情见说明页","背包内排序","包装文本","包装文本","参数1","参数2","参数3","参数4","参数5",null,"跳转1","跳转2","跳转3"]
[1001,169,"灵石",162,null,"icon_Coin",1,{"$f":"CONCATENATE(VLOOKUP(G5,ID分段!A:B,2,FALSE),\"-\",VLOOKUP(G5,ID分段!A:C,3,FALSE))","v":"资源-货币"},2,0,0,{"$f":"_xlfn.TEXTJOIN(\";\",1,AG5:AI5)","v":""},0,1,0,null,null,0,0,0,0]
[1002,170,"妖丹",163,null,"icon_Coins_s",1,{"$f":"CONCATENATE(VLOOKUP(G6,ID分段!A:B,2,FALSE),\"-\",VLOOKUP(G6,ID分段!A:C,3,FALSE))","v":"资源-货币"},4,0,0,{"$f":"_xlfn.TEXTJOIN(\";\",1,AG6:AI6)","v":""},0,1,0,null,null,0,0,0,0]
[1003,171,"修为",164,null,"icon_Gem_Star_Blue",2,{"$f":"CONCATENATE(VLOOKUP(G7,ID分段!A:B,2,FALSE),\"-\",VLOOKUP(G7,ID分段!A:C,3,FALSE))","v":"资源-材料"},2,0,0,"",0,1,0,null,null,0,0,0,0]
[1004,248,"仙缘宝券",249,null,"icon_Demo_Gem04",1,{"$f":"CONCATENATE(VLOOKUP(G8,ID分段!A:B,2,FALSE),\"-\",VLOOKUP(G8,ID分段!A:C,3,FALSE))","v":"资源-货币"},5,0,0,"",0,1,0,null,null,0,0,0,0]
[1005,725,"灵气",726,null,"icon_GradeBadge_Master",2,{"$f":"CONCATENATE(VLOOKUP(G9,ID分段!A:B,2,FALSE),\"-\",VLOOKUP(G9,ID分段!A:C,3,FALSE))","v":"资源-材料"},3,0,0,"",0,1,0,null,null,0,0,0,0]
[1006,1400,"玄晶",1401,null,"icon_GradeBadge_Challenger",2,{"$f":"CONCATENATE(VLOOKUP(G10,ID分段!A:B,2,FALSE),\"-\",VLOOKUP(G10,ID分段!A:C,3,FALSE))","v":"资源-材料"},3,0,0,"",0,1,0,null,null,0,0,0,0]
[1007,-1,"广告币",-1,null,"icon_GradeBadge_Challenger",1,{"$f":"CONCATENATE(VLOOKUP(G11,ID分段!A:B,2,FALSE),\"-\",VLOOKUP(G11,ID分段!A:C,3,FALSE))","v":"资源-货币"},4,0,0,"",0,0,0,null,null,0,0,0,0]
[{"$nulls":11},""]
[1101,-1,{"$f":"CONCATENATE(\"自转道具-\",VLOOKUP(AA13,A:C,3,FALSE),\"×\",AB13)","v":"自转道具-妖丹×6"},-1,null,"icon_GradeBadge_Challenger",9,{"$f":"CONCATENATE(VLOOKUP(G13,ID分段!A:B,2,FALSE),\"-\",VLOOKUP(G13,ID分段!A:C,3,FALSE))","v":"资源-自动转代币"},3,0,0,"",0,0,0,null,null,0,0,0,0,9,{"$f":"_xlfn.TEXTJOIN(\";\",1,AA13:AE13)","v":"1002;6"},null,null,null,1002,6]
[1102,-1,"自转道具-妖丹×30",-1,null,"icon_GradeBadge_Challenger",9,{"$f":"CONCATENATE(VLOOKUP(G14,ID分段!A:B,2,FALSE),\"-\",VLOOKUP(G14,ID分段!A:C,3,FALSE))","v":"资源-自动转代币"},3,0,0,"",0,0,0,null,null,0,0,0,0,9,{"$f":"_xlfn.TEXTJOIN(\";\",1,AA14:AE14)","v":"1002;30"},null,null,null,1002,30]
[1103,-1,"自转道具-妖丹×98",-1,null,"icon_GradeBadge_Challenger",9,{"$f":"CONCATENATE(VLOOKUP(G15,ID分段!A:B,2,FALSE),\"-\",VLOOKUP(G15,ID分段!A:C,3,FALSE))","v":"资源-自动转代币"},4,0,0,"",0,0,0,null,null,0,0,0,0,9,"1002;98",null,null,null,1002,98]
[1104,-1,"自转道具-妖丹×198",-1,null,"icon_GradeBadge_Challenger",9,{"$f":"CONCATENATE(VLOOKUP(G16,ID分段!A:B,2,FALSE),\"-\",VLOOKUP(G16,ID分段!A:C,3,FALSE))","v":"资源-自动转代币"},4,0,0,"",0,0,0,null,null,0,0,0,0,9,"1002;198",null,null,null,1002,198]
[1105,-1,"自转道具-妖丹×328",-1,null,"icon_GradeBadge_Challenger",9,{"$f":"CONCATENATE(VLOOKUP(G17,ID分段!A:B,2,FALSE),\"-\",VLOOKUP(G17,ID分段!A:C,3,FALSE))","v":"资源-自动转代币"},5,0,0,"",0,0,0,null,null,0,0,0,0,9,"1002;328",null,null,null,1002,328]
[1106,-1,"自转道具-妖丹×648",-1,null,"icon_GradeBadge_Challenger",9,{"$f":"CONCATENATE(VLOOKUP(G18,ID分段!A:B,2,FALSE),\"-\",VLOOKUP(G18,ID分段!A:C,3,FALSE))","v":"资源-自动转代币"},5,0,0,"",0,0,0,null,null,0,0,0,0,9,"1002;648",null,null,null,1002,648]
[{"$nulls":11},""]
[1201,250,"渡劫丹",259,"最基础的渡劫丹，可提升10%渡劫成功率。",{"$f":"\"icon_item_\"&A20","v":"icon_item_1201"},3,{"$f":"CONCATENATE(VLOOKUP(G20,ID分段!A:B,2,FALSE),\"-\",VLOOKUP(G20,ID分段!A:C,3,FALSE))","v":"资源-渡劫丹"},3,0,0,"",0,1,0,null,null,0,0,0,0,1,"1;300;10;10",null,null,null,1,300,10,10]
[1202,251,"良品渡劫丹",260,"品相较好的渡劫丹，可提升15%渡劫成功率。",{"$f":"\"icon_item_\"&A21","v":"icon_item_1202"},3,{"$f":"CONCATENATE(VLOOKUP(G21,ID分段!A:B,2,FALSE),\"-\",VLOOKUP(G21,ID分段!A:C,3,FALSE))","v":"资源-渡劫丹"},4,0,0,"",0,1,0,null,null,0,0,0,0,1,"1;300;15;25",null,null,null,1,300,15,25]
[1203,252,"上品渡劫丹",261,"品相极好的渡劫丹，可提升25%渡劫成功率。","icon_item_1203",3,{"$f":"CONCATENATE(VLOOKUP(G22,ID分段!A:B,2,FALSE),\"-\",VLOOKUP(G22,ID分段!A:C,3,FALSE))","v":"资源-渡劫丹"},5,0,0,"",0,1,0,null,null,0,0,0,0,1,"1;300;25;50",null,null,null,1,300,25,50]
[1204,253,"极品渡劫丹",262,"百年难得一见的渡劫丹，可提升40%渡劫成功率。",{"$f":"\"icon_item_\"&A23","v":"icon_item_1204"},3,{"$f":"CONCATENATE(VLOOKUP(G23,ID分段!A:B,2,FALSE),\"-\",VLOOKUP(G23,ID分段!A:C,3,FALSE))","v":"资源-渡劫丹"},6,0,0,"",0,1,0,null,null,0,0,0,0,1,"1;300;40;80",null,null,null,1,300,40,80]
[{"$nulls":11},""]
[1301,268,"筑基丹",272,{"$f":"CONCATENATE(\"突破\",AJ25,\"达到\",AK25,\"境界所必需的天材地宝。\")","v":"突破练气期达到筑基期境界所必需的天材地宝。"},{"$f":"\"icon_item_\"&A25","v":"icon_item_1301"},4,{"$f":"CONCATENATE(VLOOKUP(G25,ID分段!A:B,2,FALSE),\"-\",VLOOKUP(G25,ID分段!A:C,3,FALSE))","v":"资源-天材地宝"},4,0,0,"",0,1,0,null,null,0,0,0,0,1,"1;300;45;0",null,null,null,1,300,45,0,{"$nulls":5},"练气期","筑基期"]
[1302,269,"金阳果",273,{"$f":"CONCATENATE(\"突破\",AJ26,\"达到\",AK26,\"境界所必需的天材地宝。\")","v":"突破筑基期达到结丹期境界所必需的天材地宝。"},{"$f":"\"icon_item_\"&A26","v":"icon_item_1302"},4,{"$f":"CONCATENATE(VLOOKUP(G26,ID分段!A:B,2,FALSE),\"-\",VLOOKUP(G26,ID分段!A:C,3,FALSE))","v":"资源-天材地宝"},4,0,0,"",0,1,0,null,null,0,0,0,0,1,"1;300;40;0",null,null,null,1,300,40,0,{"$nulls":5},"筑基期","结丹期"]
[1303,270,"九窍芝",274,"突破结丹期达到元婴期境界所必需的天材地宝。",{"$f":"\"icon_item_\"&A27","v":"icon_item_1303"},4,{"$f":"CONCATENATE(VLOOKUP(G27,ID分段!A:B,2,FALSE),\"-\",VLOOKUP(G27,ID分段!A:C,3,FALSE))","v":"资源-天材地宝"},4,0,0,"",0,1,0,null,null,0,0,0,0,1,"1;300;35;0",null,null,null,1,300,35,0,{"$nulls":5},"结丹期","元婴期"]
[1304,271,"玄冥髓",275,"突破元婴期达到化神期境界所必需的天材地宝。",{"$f":"\"icon_item_\"&A28","v":"icon_item_1304"},4,{"$f":"CONCATENATE(VLOOKUP(G28,ID分段!A:B,2,FALSE),\"-\",VLOOKUP(G28,ID分段!A:C,3,FALSE))","v":"资源-天材地宝"},5,0,0,"",0,1,0,null,null,0,0,0,0,1,"1;300;30;0",null,null,null,1,300,30,0,{"$nulls":5},"元婴期","化神期"]
[1305,10112,"九焰莲",10117,"突破化神期达到炼虚期境界所必需的天材地宝。","icon_item_1305",4,{"$f":"CONCATENATE(VLOOKUP(G29,ID分段!A:B,2,FALSE),\"-\",VLOOKUP(G29,ID分段!A:C,3,FALSE))","v":"资源-天材地宝"},5,0,0,{"$f":"_xlfn.TEXTJOIN(\";\",1,AG29:AI29)","v":""},0,1,0,null,null,0,0,0,0,1,"1;300;25;0",null,null,null,1,300,25,0,{"$nulls":5},"化神期","炼虚期"]
[1306,10113,"混沌合晶",10118,"突破炼虚期达到大乘期境界所必需的天材地宝。","icon_item_1306",4,{"$f":"CONCATENATE(VLOOKUP(G30,ID分段!A:B,2,FALSE),\"-\",VLOOKUP(G30,ID分段!A:C,3,FALSE))","v":"资源-天材地宝"},5,0,0,"",0,1,0,null,null,0,0,0,0,1,"1;300;20;0",null,null,null,1,300,20,0,{"$nulls":5},"炼虚期","大乘期"]
[1307,10114,"鸿蒙紫华",10119,"突破大乘期达到飞升期境界所必需的天材地宝。","icon_item_1307",4,{"$f":"CONCATENATE(VLOOKUP(G31,ID分段!A:B,2,FALSE),\"-\",VLOOKUP(G31,ID分段!A:C,3,FALSE))","v":"资源-天材地宝"},6,0,0,"",0,1,0,null,null,0,0,0,0,1,"1;300;15;0",null,null,null,1,300,15,0,{"$nulls":5},"大乘期","飞升期"]
[1308,10115,"开天古藤",10120,"突破飞升期达到逍遥期境界所必需的天材地宝。",{"$f":"\"icon_item_\"&A32","v":"icon_item_1308"},4,{"$f":"CONCATENATE(VLOOKUP(G32,ID分段!A:B,2,FALSE),\"-\",VLOOKUP(G32,ID分段!A:C,3,FALSE))","v":"资源-天材地宝"},6,0,0,"",0,1,0,null,null,0,0,0,0,1,"1;300;10;0",null,null,null,1,300,10,0,{"$nulls":5},"飞升期","逍遥期"]
[1309,10116,"九天露华",10121,"突破逍遥期达到真神期境界所必需的天材地宝。",{"$f":"\"icon_item_\"&A33","v":"icon_item_1309"},4,{"$f":"CONCATENATE(VLOOKUP(G33,ID分段!A:B,2,FALSE),\"-\",VLOOKUP(G33,ID分段!A:C,3,FALSE))","v":"资源-天材地宝"},6,0,0,{"$f":"_xlfn.TEXTJOIN(\";\",1,AG33:AI33)","v":""},0,1,0,null,null,0,0,0,0,1,"1;300;5;0",null,null,null,1,300,5,0,{"$nulls":5},"逍遥期","真神期"]
[{"$nulls":11},""]
[1401,276,"增元丹",280,20,"icon_xiuweidan",5,{"$f":"CONCATENATE(VLOOKUP(G35,ID分段!A:B,2,FALSE),\"-\",VLOOKUP(G35,ID分段!A:C,3,FALSE))","v":"资源-经验丹"},2,0,0,"",0,1,0,null,null,0,0,0,0,2,{"$f":"ROUND(Z35*0.001,0)*1000","v":4000},null,null,{"$f":"VLOOKUP(E35,[1]HeroPowerUpConfig!$A:$M,13,FALSE)*0.5","v":4175}]
[1402,277,"增元丹",281,50,"icon_xiuweidan",5,{"$f":"CONCATENATE(VLOOKUP(G36,ID分段!A:B,2,FALSE),\"-\",VLOOKUP(G36,ID分段!A:C,3,FALSE))","v":"资源-经验丹"},3,0,0,"",0,1,0,null,null,0,0,0,0,2,{"$f":"ROUND(Z36*0.001,0)*1000","v":8000},null,null,{"$f":"VLOOKUP(E36,[1]HeroPowerUpConfig!$A:$M,13,FALSE)*0.5","v":8070}]
[1403,278,"增元丹",282,70,"icon_xiuweidan",5,{"$f":"CONCATENATE(VLOOKUP(G37,ID分段!A:B,2,FALSE),\"-\",VLOOKUP(G37,ID分段!A:C,3,FALSE))","v":"资源-经验丹"},4,0,0,"",0,1,0,null,null,0,0,0,0,2,12000,null,null,{"$f":"VLOOKUP(E37,[1]HeroPowerUpConfig!$A:$M,13,FALSE)*0.5","v":11900}]
[1404,279,"增元丹",283,100,"icon_xiuweidan",5,{"$f":"CONCATENATE(VLOOKUP(G38,ID分段!A:B,2,FALSE),\"-\",VLOOKUP(G38,ID分段!A:C,3,FALSE))","v":"资源-经验丹"},5,0,0,"",0,1,0,null,null,0,0,0,0,2,20000,null,null,{"$f":"VLOOKUP(E38,[1]HeroPowerUpConfig!$A:$M,13,FALSE)*0.5","v":20115}]
[{"$nulls":11},""]
[1501,1947,"好感度礼物1",1949,{"$f":"CONCATENATE(\"道具描述_\",C40)","v":"道具描述_好感度礼物1"},"icon_haogandugift",6,{"$f":"CONCATENATE(VLOOKUP(G40,ID分段!A:B,2,FALSE),\"-\",VLOOKUP(G40,ID分段!A:C,3,FALSE))","v":"资源-好感度礼物"},3,0,0,"",0,1,0,null,null,0,0,0,0,0,0]
[1502,1948,"好感度礼物2",1950,{"$f":"CONCATENATE(\"道具描述_\",C41)","v":"道具描述_好感度礼物2"},"icon_haogandugift",6,{"$f":"CONCATENATE(VLOOKUP(G41,ID分段!A:B,2,FALSE),\"-\",VLOOKUP(G41,ID分段!A:C,3,FALSE))","v":"资源-好感度礼物"},4,0,0,"",0,1,0,null,null,0,0,0,0,0,0]
[{"$nulls":11},""]
[1601,1951,"心情礼物1",1952,{"$f":"CONCATENATE(\"道具描述_\",C43)","v":"道具描述_心情礼物1"},"icon_xinqingliwu",7,{"$f":"CONCATENATE(VLOOKUP(G43,ID分段!A:B,2,FALSE),\"-\",VLOOKUP(G43,ID分段!A:C,3,FALSE))","v":"资源-心情礼物"},2,0,0,"",0,1,0,null,null,0,0,0,0,5,10]
[{"$nulls":11},""]
[1701,3237,"清识还元丹",3240,{"$f":"CONCATENATE(\"使用后恢复\",W45,\"点神识。\")","v":"使用后恢复100点神识。"},"icon_shenshidan",8,{"$f":"CONCATENATE(VLOOKUP(G45,ID分段!A:B,2,FALSE),\"-\",VLOOKUP(G45,ID分段!A:C,3,FALSE))","v":"资源-神识丹"},3,0,0,"",0,1,0,null,null,0,0,0,0,8,100]
[1702,3238,"清识还元丹",3241,{"$f":"CONCATENATE(\"使用后恢复\",W46,\"点神识。\")","v":"使用后恢复300点神识。"},"icon_shenshidan",8,{"$f":"CONCATENATE(VLOOKUP(G46,ID分段!A:B,2,FALSE),\"-\",VLOOKUP(G46,ID分段!A:C,3,FALSE))","v":"资源-神识丹"},4,0,0,"",0,1,0,null,null,0,0,0,0,8,300]
[1703,3239,"清识还元丹",3242,"使用后恢复1000点神识。","icon_shenshidan",8,{"$f":"CONCATENATE(VLOOKUP(G47,ID分段!A:B,2,FALSE),\"-\",VLOOKUP(G47,ID分段!A:C,3,FALSE))","v":"资源-神识丹"},5,0,0,"",0,1,0,null,null,0,0,0,0,8,1000]
[{"$nulls":11},""]
[10001,284,"神龙鼎",292,null,"icon_s3101",11,{"$f":"CONCATENATE(VLOOKUP(G49,ID分段!A:B,2,FALSE),\"-\",VLOOKUP(G49,ID分段!A:C,3,FALSE))","v":"法宝-本体"},4,0,0,"",0,1,0,null,null,0,0,0,0,4,{"$f":"_xlfn.TEXTJOIN(\";\",1,AA49:AE49)","v":"11001;10001;10"},null,null,null,11001,10001,{"$f":"CHOOSE(I49-2,[2]抽卡!$Q$2,[2]抽卡!$Q$3,[2]抽卡!$Q$4)","v":10}]
[10002,285,"破天斧",293,null,"icon_s3102",11,{"$f":"CONCATENATE(VLOOKUP(G50,ID分段!A:B,2,FALSE),\"-\",VLOOKUP(G50,ID分段!A:C,3,FALSE))","v":"法宝-本体"},5,0,0,"",0,1,0,null,null,0,0,0,0,4,{"$f":"_xlfn.TEXTJOIN(\";\",1,AA50:AE50)","v":"11002;10002;30"},null,null,null,11002,10002,{"$f":"CHOOSE(I50-2,[2]抽卡!$Q$2,[2]抽卡!$Q$3,[2]抽卡!$Q$4)","v":30}]
[10003,286,"翡翠葫芦",294,null,"icon_s3201",11,{"$f":"CONCATENATE(VLOOKUP(G51,ID分段!A:B,2,FALSE),\"-\",VLOOKUP(G51,ID分段!A:C,3,FALSE))","v":"法宝-本体"},4,0,0,"",0,1,0,null,null,0,0,0,0,4,"11003;10003;10",null,null,null,11003,10003,{"$f":"CHOOSE(I51-2,[2]抽卡!$Q$2,[2]抽卡!$Q$3,[2]抽卡!$Q$4)","v":10}]
[10004,287,"混沌珠",295,null,"icon_s3202",11,{"$f":"CONCATENATE(VLOOKUP(G52,ID分段!A:B,2,FALSE),\"-\",VLOOKUP(G52,ID分段!A:C,3,FALSE))","v":"法宝-本体"},5,0,0,"",0,1,0,null,null,0,0,0,0,4,"11004;10004;30",null,null,null,11004,10004,{"$f":"CHOOSE(I52-2,[2]抽卡!$Q$2,[2]抽卡!$Q$3,[2]抽卡!$Q$4)","v":30}]
[10005,288,"琉璃宝塔",296,null,"icon_s3203",11,{"$f":"CONCATENATE(VLOOKUP(G53,ID分段!A:B,2,FALSE),\"-\",VLOOKUP(G53,ID分段!A:C,3,FALSE))","v":"法宝-本体"},5,0,0,"",0,1,0,null,null,0,0,0,0,4,"11005;10005;30",null,null,null,11005,10005,{"$f":"CHOOSE(I53-2,[2]抽卡!$Q$2,[2]抽卡!$Q$3,[2]抽卡!$Q$4)","v":30}]
[10006,289,"九幽镇魂瓶",297,null,"icon_s3301",11,{"$f":"CONCATENATE(VLOOKUP(G54,ID分段!A:B,2,FALSE),\"-\",VLOOKUP(G54,ID分段!A:C,3,FALSE))","v":"法宝-本体"},4,0,0,"",0,1,0,null,null,0,0,0,0,4,"11006;10006;10",null,null,null,11006,10006,{"$f":"CHOOSE(I54-2,[2]抽卡!$Q$2,[2]抽卡!$Q$3,[2]抽卡!$Q$4)","v":10}]
[10007,290,"玉莲守心灯",298,null,"icon_s3302",11,{"$f":"CONCATENATE(VLOOKUP(G55,ID分段!A:B,2,FALSE),\"-\",VLOOKUP(G55,ID分段!A:C,3,FALSE))","v":"法宝-本体"},5,0,0,"",0,1,0,null,null,0,0,0,0,4,"11007;10007;30",null,null,null,11007,10007,{"$f":"CHOOSE(I55-2,[2]抽卡!$Q$2,[2]抽卡!$Q$3,[2]抽卡!$Q$4)","v":30}]
[10008,291,"融灵塔",299,null,"icon_s3401",11,{"$f":"CONCATENATE(VLOOKUP(G56,ID分段!A:B,2,FALSE),\"-\",VLOOKUP(G56,ID分段!A:C,3,FALSE))","v":"法宝-本体"},4,0,0,"",0,1,0,null,null,0,0,0,0,4,"11008;10008;10",null,null,null,11008,10008,{"$f":"CHOOSE(I56-2,[2]抽卡!$Q$2,[2]抽卡!$Q$3,[2]抽卡!$Q$4)","v":10}]
[10009,1402,"禁元珠",1405,null,"icon_s3402",11,{"$f":"CONCATENATE(VLOOKUP(G57,ID分段!A:B,2,FALSE),\"-\",VLOOKUP(G57,ID分段!A:C,3,FALSE))","v":"法宝-本体"},5,0,0,"",0,1,0,null,null,0,0,0,0,4,{"$f":"_xlfn.TEXTJOIN(\";\",1,AA57:AE57)","v":"11009;10009;30"},null,null,null,11009,10009,{"$f":"CHOOSE(I57-2,[2]抽卡!$Q$2,[2]抽卡!$Q$3,[2]抽卡!$Q$4)","v":30}]
[10010,1403,"玄龟盾",1406,null,"icon_s3501",11,{"$f":"CONCATENATE(VLOOKUP(G58,ID分段!A:B,2,FALSE),\"-\",VLOOKUP(G58,ID分段!A:C,3,FALSE))","v":"法宝-本体"},4,0,0,"",0,1,0,null,null,0,0,0,0,4,"11010;10010;10",null,null,null,11010,10010,{"$f":"CHOOSE(I58-2,[2]抽卡!$Q$2,[2]抽卡!$Q$3,[2]抽卡!$Q$4)","v":10}]
[10011,1404,"天殇血刃剑",1407,null,"icon_s3502",11,{"$f":"CONCATENATE(VLOOKUP(G59,ID分段!A:B,2,FALSE),\"-\",VLOOKUP(G59,ID分段!A:C,3,FALSE))","v":"法宝-本体"},5,0,0,"",0,1,0,null,null,0,0,0,0,4,{"$f":"_xlfn.TEXTJOIN(\";\",1,AA59:AE59)","v":"11011;10011;30"},null,null,null,11011,10011,{"$f":"CHOOSE(I59-2,[2]抽卡!$Q$2,[2]抽卡!$Q$3,[2]抽卡!$Q$4)","v":30}]
[{"$nulls":11},""]
[11001,300,"神龙鼎碎片",308,null,"icon_s3101",12,{"$f":"CONCATENATE(VLOOKUP(G61,ID分段!A:B,2,FALSE),\"-\",VLOOKUP(G61,ID分段!A:C,3,FALSE))","v":"法宝-碎片"},3,0,0,"",0,1,0,null,null,0,0,0,0,12,{"$f":"_xlfn.TEXTJOIN(\";\",1,AA61:AE61)","v":"11001"},null,null,null,11001]
[11002,301,"破天斧碎片",309,null,"icon_s3102",12,{"$f":"CONCATENATE(VLOOKUP(G62,ID分段!A:B,2,FALSE),\"-\",VLOOKUP(G62,ID分段!A:C,3,FALSE))","v":"法宝-碎片"},4,0,0,"",0,1,0,null,null,0,0,0,0,12,{"$f":"_xlfn.TEXTJOIN(\";\",1,AA62:AE62)","v":"11002"},null,null,null,11002]
[11003,302,"翡翠葫芦碎片",310,null,"icon_s3201",12,{"$f":"CONCATENATE(VLOOKUP(G63,ID分段!A:B,2,FALSE),\"-\",VLOOKUP(G63,ID分段!A:C,3,FALSE))","v":"法宝-碎片"},3,0,0,"",0,1,0,null,null,0,0,0,0,12,"11003",null,null,null,11003]
[11004,303,"混沌珠碎片",311,null,"icon_s3202",12,{"$f":"CONCATENATE(VLOOKUP(G64,ID分段!A:B,2,FALSE),\"-\",VLOOKUP(G64,ID分段!A:C,3,FALSE))","v":"法宝-碎片"},4,0,0,"",0,1,0,null,null,0,0,0,0,12,"11004",null,null,null,11004]
[11005,304,"琉璃宝塔碎片",312,null,"icon_s3203",12,{"$f":"CONCATENATE(VLOOKUP(G65,ID分段!A:B,2,FALSE),\"-\",VLOOKUP(G65,ID分段!A:C,3,FALSE))","v":"法宝-碎片"},5,0,0,"",0,1,0,null,null,0,0,0,0,12,"11005",null,null,null,11005]
[11006,305,"九幽镇魂瓶碎片",313,null,"icon_s3301",12,{"$f":"CONCATENATE(VLOOKUP(G66,ID分段!A:B,2,FALSE),\"-\",VLOOKUP(G66,ID分段!A:C,3,FALSE))","v":"法宝-碎片"},3,0,0,"",0,1,0,null,null,0,0,0,0,12,"11006",null,null,null,11006]
[11007,306,"玉莲守心灯碎片",314,null,"icon_s3302",12,{"$f":"CONCATENATE(VLOOKUP(G67,ID分段!A:B,2,FALSE),\"-\",VLOOKUP(G67,ID分段!A:C,3,FALSE))","v":"法宝-碎片"},4,0,0,"",0,1,0,null,null,0,0,0,0,12,"11007",null,null,null,11007]
[11008,307,"融灵塔碎片",315,null,"icon_s3401",12,{"$f":"CONCATENATE(VLOOKUP(G68,ID分段!A:B,2,FALSE),\"-\",VLOOKUP(G68,ID分段!A:C,3,FALSE))","v":"法宝-碎片"},3,0,0,"",0,1,0,null,null,0,0,0,0,12,"11008",null,null,null,11008]
[11009,1408,"禁元珠碎片",1411,null,"icon_s3402",12,{"$f":"CONCATENATE(VLOOKUP(G69,ID分段!A:B,2,FALSE),\"-\",VLOOKUP(G69,ID分段!A:C,3,FALSE))","v":"法宝-碎片"},4,0,0,"",0,1,0,null,null,0,0,0,0,12,"11009",null,null,null,11009]
[11010,1409,"玄龟盾碎片",1412,null,"icon_s3501",12,{"$f":"CONCATENATE(VLOOKUP(G70,ID分段!A:B,2,FALSE),\"-\",VLOOKUP(G70,ID分段!A:C,3,FALSE))","v":"法宝-碎片"},3,0,0,{"$f":"_xlfn.TEXTJOIN(\";\",1,AG70:AI70)","v":""},0,1,0,null,null,0,0,0,0,12,"11010",null,null,null,11010]
[11011,1410,"天殇血刃剑碎片",1413,null,"icon_s3502",12,{"$f":"CONCATENATE(VLOOKUP(G71,ID分段!A:B,2,FALSE),\"-\",VLOOKUP(G71,ID分段!A:C,3,FALSE))","v":"法宝-碎片"},4,0,0,"",0,1,0,null,null,0,0,0,0,12,"11011",null,null,null,11011]
[{"$nulls":11},""]
[12001,1414,"太虚幻剑经",1500,"功法-金1",{"$f":"IFERROR(VLOOKUP(AB73*10,[3]SkillConfig!$A:$I,9,FALSE),\"\")","v":"icon_s1101"},13,{"$f":"CONCATENATE(VLOOKUP(G73,ID分段!A:B,2,FALSE),\"-\",VLOOKUP(G73,ID分段!A:C,3,FALSE))","v":"功法-本体"},5,0,0,"",0,1,0,null,null,0,0,0,0,3,{"$f":"_xlfn.TEXTJOIN(\";\",1,AA73:AE73)","v":"13001;1101;30"},null,null,null,13001,1101,{"$f":"CHOOSE(I73-2,[2]抽卡!$Q$2,[2]抽卡!$Q$3,[2]抽卡!$Q$4)","v":30}]
[12002,1415,"天罡剑气诀",1501,"功法-金2",{"$f":"IFERROR(VLOOKUP(AB74*10,[3]SkillConfig!$A:$I,9,FALSE),\"\")","v":"icon_s1102"},13,{"$f":"CONCATENATE(VLOOKUP(G74,ID分段!A:B,2,FALSE),\"-\",VLOOKUP(G74,ID分段!A:C,3,FALSE))","v":"功法-本体"},5,0,0,"",0,1,0,null,null,0,0,0,0,3,{"$f":"_xlfn.TEXTJOIN(\";\",1,AA74:AE74)","v":"13002;1102;30"},null,null,null,13002,1102,{"$f":"CHOOSE(I74-2,[2]抽卡!$Q$2,[2]抽卡!$Q$3,[2]抽卡!$Q$4)","v":30}]
[12003,1416,"血刃金煌功",1502,"功法-金3",{"$f":"IFERROR(VLOOKUP(AB75*10,[3]SkillConfig!$A:$I,9,FALSE),\"\")","v":"icon_s1103"},13,{"$f":"CONCATENATE(VLOOKUP(G75,ID分段!A:B,2,FALSE),\"-\",VLOOKUP(G75,ID分段!A:C,3,FALSE))","v":"功法-本体"},5,0,0,"",0,1,0,null,null,0,0,0,0,3,"13003;1103;30",null,null,null,13003,1103,{"$f":"CHOOSE(I75-2,[2]抽卡!$Q$2,[2]抽卡!$Q$3,[2]抽卡!$Q$4)","v":30}]
[12004,1417,"飞刃",1503,"功法-金4",{"$f":"IFERROR(VLOOKUP(AB76*10,[3]SkillConfig!$A:$I,9,FALSE),\"\")","v":"icon_s1104"},13,{"$f":"CONCATENATE(VLOOKUP(G76,ID分段!A:B,2,FALSE),\"-\",VLOOKUP(G76,ID分段!A:C,3,FALSE))","v":"功法-本体"},4,0,0,"",0,1,0,null,null,0,0,0,0,3,"13004;1104;10",null,null,null,13004,1104,{"$f":"CHOOSE(I76-2,[2]抽卡!$Q$2,[2]抽卡!$Q$3,[2]抽卡!$Q$4)","v":10}]
[12005,1418,"金针",1504,"功法-金5",{"$f":"IFERROR(VLOOKUP(AB77*10,[3]SkillConfig!$A:$I,9,FALSE),\"\")","v":"icon_s1105"},13,{"$f":"CONCATENATE(VLOOKUP(G77,ID分段!A:B,2,FALSE),\"-\",VLOOKUP(G77,ID分段!A:C,3,FALSE))","v":"功法-本体"},3,0,0,"",0,1,0,null,null,0,0,0,0,3,"13005;1105;3",null,null,null,13005,1105,{"$f":"CHOOSE(I77-2,[2]抽卡!$Q$2,[2]抽卡!$Q$3,[2]抽卡!$Q$4)","v":3}]
[12006,1419,"碧落幽冥劲",1505,"功法-水1",{"$f":"IFERROR(VLOOKUP(AB78*10,[3]SkillConfig!$A:$I,9,FALSE),\"\")","v":"icon_s1201"},13,{"$f":"CONCATENATE(VLOOKUP(G78,ID分段!A:B,2,FALSE),\"-\",VLOOKUP(G78,ID分段!A:C,3,FALSE))","v":"功法-本体"},5,0,0,"",0,1,0,null,null,0,0,0,0,3,"13006;1201;30",null,null,null,13006,1201,{"$f":"CHOOSE(I78-2,[2]抽卡!$Q$2,[2]抽卡!$Q$3,[2]抽卡!$Q$4)","v":30}]
[12007,1420,"雾隐千流法",1506,"功法-水2",{"$f":"IFERROR(VLOOKUP(AB79*10,[3]SkillConfig!$A:$I,9,FALSE),\"\")","v":"icon_s1202"},13,{"$f":"CONCATENATE(VLOOKUP(G79,ID分段!A:B,2,FALSE),\"-\",VLOOKUP(G79,ID分段!A:C,3,FALSE))","v":"功法-本体"},5,0,0,"",0,1,0,null,null,0,0,0,0,3,"13007;1202;30",null,null,null,13007,1202,{"$f":"CHOOSE(I79-2,[2]抽卡!$Q$2,[2]抽卡!$Q$3,[2]抽卡!$Q$4)","v":30}]
[12008,1421,"功法-水3",1507,"功法-水3",{"$f":"IFERROR(VLOOKUP(AB80*10,[3]SkillConfig!$A:$I,9,FALSE),\"\")","v":""},13,{"$f":"CONCATENATE(VLOOKUP(G80,ID分段!A:B,2,FALSE),\"-\",VLOOKUP(G80,ID分段!A:C,3,FALSE))","v":"功法-本体"},5,0,0,"",0,1,0,null,null,0,0,0,0,3,"13008;1203;30",null,null,null,13008,1203,{"$f":"CHOOSE(I80-2,[2]抽卡!$Q$2,[2]抽卡!$Q$3,[2]抽卡!$Q$4)","v":30}]
[12009,1422,"水球",1508,"功法-水4",{"$f":"IFERROR(VLOOKUP(AB81*10,[3]SkillConfig!$A:$I,9,FALSE),\"\")","v":"icon_s1204"},13,{"$f":"CONCATENATE(VLOOKUP(G81,ID分段!A:B,2,FALSE),\"-\",VLOOKUP(G81,ID分段!A:C,3,FALSE))","v":"功法-本体"},4,0,0,"",0,1,0,null,null,0,0,0,0,3,"13009;1204;10",null,null,null,13009,1204,{"$f":"CHOOSE(I81-2,[2]抽卡!$Q$2,[2]抽卡!$Q$3,[2]抽卡!$Q$4)","v":10}]
[12010,1423,"冰刀",1509,"功法-水5",{"$f":"IFERROR(VLOOKUP(AB82*10,[3]SkillConfig!$A:$I,9,FALSE),\"\")","v":"icon_s1205"},13,{"$f":"CONCATENATE(VLOOKUP(G82,ID分段!A:B,2,FALSE),\"-\",VLOOKUP(G82,ID分段!A:C,3,FALSE))","v":"功法-本体"},3,0,0,"",0,1,0,null,null,0,0,0,0,3,"13010;1205;3",null,null,null,13010,1205,{"$f":"CHOOSE(I82-2,[2]抽卡!$Q$2,[2]抽卡!$Q$3,[2]抽卡!$Q$4)","v":3}]
[12011,1424,"瘴影千丝术",1510,"功法-木1",{"$f":"IFERROR(VLOOKUP(AB83*10,[3]SkillConfig!$A:$I,9,FALSE),\"\")","v":"icon_s1301"},13,{"$f":"CONCATENATE(VLOOKUP(G83,ID分段!A:B,2,FALSE),\"-\",VLOOKUP(G83,ID分段!A:C,3,FALSE))","v":"功法-本体"},5,0,0,"",0,1,0,null,null,0,0,0,0,3,"13011;1301;30",null,null,null,13011,1301,{"$f":"CHOOSE(I83-2,[2]抽卡!$Q$2,[2]抽卡!$Q$3,[2]抽卡!$Q$4)","v":30}]
[12012,1425,"蚀骨腐血掌",1511,"功法-木2",{"$f":"IFERROR(VLOOKUP(AB84*10,[3]SkillConfig!$A:$I,9,FALSE),\"\")","v":"icon_s1302"},13,{"$f":"CONCATENATE(VLOOKUP(G84,ID分段!A:B,2,FALSE),\"-\",VLOOKUP(G84,ID分段!A:C,3,FALSE))","v":"功法-本体"},5,0,0,"",0,1,0,null,null,0,0,0,0,3,"13012;1302;30",null,null,null,13012,1302,{"$f":"CHOOSE(I84-2,[2]抽卡!$Q$2,[2]抽卡!$Q$3,[2]抽卡!$Q$4)","v":30}]
[12013,1426,"功法-木3",1512,"功法-木3",{"$f":"IFERROR(VLOOKUP(AB85*10,[3]SkillConfig!$A:$I,9,FALSE),\"\")","v":""},13,{"$f":"CONCATENATE(VLOOKUP(G85,ID分段!A:B,2,FALSE),\"-\",VLOOKUP(G85,ID分段!A:C,3,FALSE))","v":"功法-本体"},5,0,0,"",0,1,0,null,null,0,0,0,0,3,{"$f":"_xlfn.TEXTJOIN(\";\",1,AA85:AE85)","v":"13013;1303;30"},null,null,null,13013,1303,{"$f":"CHOOSE(I85-2,[2]抽卡!$Q$2,[2]抽卡!$Q$3,[2]抽卡!$Q$4)","v":30}]
[12014,1427,"竹刺",1513,"功法-木4",{"$f":"IFERROR(VLOOKUP(AB86*10,[3]SkillConfig!$A:$I,9,FALSE),\"\")","v":"icon_s1304"},13,{"$f":"CONCATENATE(VLOOKUP(G86,ID分段!A:B,2,FALSE),\"-\",VLOOKUP(G86,ID分段!A:C,3,FALSE))","v":"功法-本体"},4,0,0,"",0,1,0,null,null,0,0,0,0,3,"13014;1304;10",null,null,null,13014,1304,{"$f":"CHOOSE(I86-2,[2]抽卡!$Q$2,[2]抽卡!$Q$3,[2]抽卡!$Q$4)","v":10}]
[12015,1428,"飞叶",1514,"功法-木5",{"$f":"IFERROR(VLOOKUP(AB87*10,[3]SkillConfig!$A:$I,9,FALSE),\"\")","v":"icon_s1305"},13,{"$f":"CONCATENATE(VLOOKUP(G87,ID分段!A:B,2,FALSE),\"-\",VLOOKUP(G87,ID分段!A:C,3,FALSE))","v":"功法-本体"},3,0,0,"",0,1,0,null,null,0,0,0,0,3,"13015;1305;3",null,null,null,13015,1305,{"$f":"CHOOSE(I87-2,[2]抽卡!$Q$2,[2]抽卡!$Q$3,[2]抽卡!$Q$4)","v":3}]
[12016,1429,"烈焰剑",1515,"功法-火1",{"$f":"IFERROR(VLOOKUP(AB88*10,[3]SkillConfig!$A:$I,9,FALSE),\"\")","v":"icon_s1401"},13,{"$f":"CONCATENATE(VLOOKUP(G88,ID分段!A:B,2,FALSE),\"-\",VLOOKUP(G88,ID分段!A:C,3,FALSE))","v":"功法-本体"},5,0,0,"",0,1,0,null,null,0,0,0,0,3,"13016;1401;30",null,null,null,13016,1401,{"$f":"CHOOSE(I88-2,[2]抽卡!$Q$2,[2]抽卡!$Q$3,[2]抽卡!$Q$4)","v":30}]
[12017,1430,"赤焰龙吟功",1516,"功法-火2",{"$f":"IFERROR(VLOOKUP(AB89*10,[3]SkillConfig!$A:$I,9,FALSE),\"\")","v":"icon_s1402"},13,{"$f":"CONCATENATE(VLOOKUP(G89,ID分段!A:B,2,FALSE),\"-\",VLOOKUP(G89,ID分段!A:C,3,FALSE))","v":"功法-本体"},5,0,0,"",0,1,0,null,null,0,0,0,0,3,"13017;1402;30",null,null,null,13017,1402,{"$f":"CHOOSE(I89-2,[2]抽卡!$Q$2,[2]抽卡!$Q$3,[2]抽卡!$Q$4)","v":30}]
[12018,1431,"朱雀燎原指",1517,"功法-火3",{"$f":"IFERROR(VLOOKUP(AB90*10,[3]SkillConfig!$A:$I,9,FALSE),\"\")","v":"icon_s1403"},13,{"$f":"CONCATENATE(VLOOKUP(G90,ID分段!A:B,2,FALSE),\"-\",VLOOKUP(G90,ID分段!A:C,3,FALSE))","v":"功法-本体"},5,0,0,"",0,1,0,null,null,0,0,0,0,3,"13018;1403;30",null,null,null,13018,1403,{"$f":"CHOOSE(I90-2,[2]抽卡!$Q$2,[2]抽卡!$Q$3,[2]抽卡!$Q$4)","v":30}]
[12019,1432,"火球",1518,"功法-火4",{"$f":"IFERROR(VLOOKUP(AB91*10,[3]SkillConfig!$A:$I,9,FALSE),\"\")","v":"icon_s1404"},13,{"$f":"CONCATENATE(VLOOKUP(G91,ID分段!A:B,2,FALSE),\"-\",VLOOKUP(G91,ID分段!A:C,3,FALSE))","v":"功法-本体"},4,0,0,"",0,1,0,null,null,0,0,0,0,3,"13019;1404;10",null,null,null,13019,1404,{"$f":"CHOOSE(I91-2,[2]抽卡!$Q$2,[2]抽卡!$Q$3,[2]抽卡!$Q$4)","v":10}]
[12020,1433,"火刀",1519,"功法-火5",{"$f":"IFERROR(VLOOKUP(AB92*10,[3]SkillConfig!$A:$I,9,FALSE),\"\")","v":"icon_s1405"},13,{"$f":"CONCATENATE(VLOOKUP(G92,ID分段!A:B,2,FALSE),\"-\",VLOOKUP(G92,ID分段!A:C,3,FALSE))","v":"功法-本体"},3,0,0,"",0,1,0,null,null,0,0,0,0,3,"13020;1405;3",null,null,null,13020,1405,{"$f":"CHOOSE(I92-2,[2]抽卡!$Q$2,[2]抽卡!$Q$3,[2]抽卡!$Q$4)","v":3}]
[12021,1434,"黄尘灭魂刺",1520,"功法-土1",{"$f":"IFERROR(VLOOKUP(AB93*10,[3]SkillConfig!$A:$I,9,FALSE),\"\")","v":"icon_s1501"},13,{"$f":"CONCATENATE(VLOOKUP(G93,ID分段!A:B,2,FALSE),\"-\",VLOOKUP(G93,ID分段!A:C,3,FALSE))","v":"功法-本体"},5,0,0,"",0,1,0,null,null,0,0,0,0,3,"13021;1501;30",null,null,null,13021,1501,{"$f":"CHOOSE(I93-2,[2]抽卡!$Q$2,[2]抽卡!$Q$3,[2]抽卡!$Q$4)","v":30}]
[12022,1435,"地裂屠龙斩",1521,"功法-土2",{"$f":"IFERROR(VLOOKUP(AB94*10,[3]SkillConfig!$A:$I,9,FALSE),\"\")","v":"icon_s1502"},13,{"$f":"CONCATENATE(VLOOKUP(G94,ID分段!A:B,2,FALSE),\"-\",VLOOKUP(G94,ID分段!A:C,3,FALSE))","v":"功法-本体"},5,0,0,"",0,1,0,null,null,0,0,0,0,3,"13022;1502;30",null,null,null,13022,1502,{"$f":"CHOOSE(I94-2,[2]抽卡!$Q$2,[2]抽卡!$Q$3,[2]抽卡!$Q$4)","v":30}]
[12023,1436,"功法-土3",1522,"功法-土3",{"$f":"IFERROR(VLOOKUP(AB95*10,[3]SkillConfig!$A:$I,9,FALSE),\"\")","v":""},13,{"$f":"CONCATENATE(VLOOKUP(G95,ID分段!A:B,2,FALSE),\"-\",VLOOKUP(G95,ID分段!A:C,3,FALSE))","v":"功法-本体"},5,0,0,"",0,1,0,null,null,0,0,0,0,3,{"$f":"_xlfn.TEXTJOIN(\";\",1,AA95:AE95)","v":"13023;1503;30"},null,null,null,13023,1503,{"$f":"CHOOSE(I95-2,[2]抽卡!$Q$2,[2]抽卡!$Q$3,[2]抽卡!$Q$4)","v":30}]
[12024,1437,"落石",1523,"功法-土4",{"$f":"IFERROR(VLOOKUP(AB96*10,[3]SkillConfig!$A:$I,9,FALSE),\"\")","v":"icon_s1504"},13,{"$f":"CONCATENATE(VLOOKUP(G96,ID分段!A:B,2,FALSE),\"-\",VLOOKUP(G96,ID分段!A:C,3,FALSE))","v":"功法-本体"},4,0,0,"",0,1,0,null,null,0,0,0,0,3,"13024;1504;10",null,null,null,13024,1504,{"$f":"CHOOSE(I96-2,[2]抽卡!$Q$2,[2]抽卡!$Q$3,[2]抽卡!$Q$4)","v":10}]
[12025,1438,"小石头",1524,"功法-土5",{"$f":"IFERROR(VLOOKUP(AB97*10,[3]SkillConfig!$A:$I,9,FALSE),\"\")","v":"icon_s1505"},13,{"$f":"CONCATENATE(VLOOKUP(G97,ID分段!A:B,2,FALSE),\"-\",VLOOKUP(G97,ID分段!A:C,3,FALSE))","v":"功法-本体"},3,0,0,"",0,1,0,null,null,0,0,0,0,3,"13025;1505;3",null,null,null,13025,1505,{"$f":"CHOOSE(I97-2,[2]抽卡!$Q$2,[2]抽卡!$Q$3,[2]抽卡!$Q$4)","v":3}]
[{"$nulls":11},""]
[12501,1800,"天衍星辰诀",1850,"功法-被动",{"$f":"IFERROR(VLOOKUP(AB99*10,[3]SkillConfig!$A:$I,9,FALSE),\"\")","v":"icon_s2001"},13,{"$f":"CONCATENATE(VLOOKUP(G99,ID分段!A:B,2,FALSE),\"-\",VLOOKUP(G99,ID分段!A:C,3,FALSE))","v":"功法-本体"},3,0,0,"",0,1,0,null,null,0,0,0,0,3,{"$f":"_xlfn.TEXTJOIN(\";\",1,AA99:AE99)","v":"13501;2001;3"},null,null,null,13501,2001,{"$f":"CHOOSE(I99-2,[2]抽卡!$Q$2,[2]抽卡!$Q$3,[2]抽卡!$Q$4)","v":3}]
[12502,1801,"法宝秘籍",1851,"功法-被动",{"$f":"IFERROR(VLOOKUP(AB100*10,[3]SkillConfig!$A:$I,9,FALSE),\"\")","v":"icon_s2002"},13,{"$f":"CONCATENATE(VLOOKUP(G100,ID分段!A:B,2,FALSE),\"-\",VLOOKUP(G100,ID分段!A:C,3,FALSE))","v":"功法-本体"},3,0,0,"",0,1,0,null,null,0,0,0,0,3,{"$f":"_xlfn.TEXTJOIN(\";\",1,AA100:AE100)","v":"13502;2002;3"},null,null,null,13502,2002,{"$f":"CHOOSE(I100-2,[2]抽卡!$Q$2,[2]抽卡!$Q$3,[2]抽卡!$Q$4)","v":3}]
[12503,1802,"崩脉决",1852,"功法-被动",{"$f":"IFERROR(VLOOKUP(AB101*10,[3]SkillConfig!$A:$I,9,FALSE),\"\")","v":"icon_s2003"},13,{"$f":"CONCATENATE(VLOOKUP(G101,ID分段!A:B,2,FALSE),\"-\",VLOOKUP(G101,ID分段!A:C,3,FALSE))","v":"功法-本体"},3,0,0,"",0,1,0,null,null,0,0,0,0,3,"13503;2003;3",null,null,null,13503,2003,{"$f":"CHOOSE(I101-2,[2]抽卡!$Q$2,[2]抽卡!$Q$3,[2]抽卡!$Q$4)","v":3}]
[12504,1803,"两仪决",1853,"功法-被动",{"$f":"IFERROR(VLOOKUP(AB102*10,[3]SkillConfig!$A:$I,9,FALSE),\"\")","v":"icon_s2004"},13,{"$f":"CONCATENATE(VLOOKUP(G102,ID分段!A:B,2,FALSE),\"-\",VLOOKUP(G102,ID分段!A:C,3,FALSE))","v":"功法-本体"},3,0,0,"",0,1,0,null,null,0,0,0,0,3,"13504;2004;3",null,null,null,13504,2004,{"$f":"CHOOSE(I102-2,[2]抽卡!$Q$2,[2]抽卡!$Q$3,[2]抽卡!$Q$4)","v":3}]
[12505,1804,"火焰决",1854,"功法-被动",{"$f":"IFERROR(VLOOKUP(AB103*10,[3]SkillConfig!$A:$I,9,FALSE),\"\")","v":"icon_s2005"},13,{"$f":"CONCATENATE(VLOOKUP(G103,ID分段!A:B,2,FALSE),\"-\",VLOOKUP(G103,ID分段!A:C,3,FALSE))","v":"功法-本体"},3,0,0,"",0,1,0,null,null,0,0,0,0,3,"13505;2005;3",null,null,null,13505,2005,{"$f":"CHOOSE(I103-2,[2]抽卡!$Q$2,[2]抽卡!$Q$3,[2]抽卡!$Q$4)","v":3}]
[12506,1805,"乾坤巨灵诀",1855,"功法-被动",{"$f":"IFERROR(VLOOKUP(AB104*10,[3]SkillConfig!$A:$I,9,FALSE),\"\")","v":"icon_s2006"},13,{"$f":"CONCATENATE(VLOOKUP(G104,ID分段!A:B,2,FALSE),\"-\",VLOOKUP(G104,ID分段!A:C,3,FALSE))","v":"功法-本体"},4,0,0,"",0,1,0,null,null,0,0,0,0,3,"13506;2006;10",null,null,null,13506,2006,{"$f":"CHOOSE(I104-2,[2]抽卡!$Q$2,[2]抽卡!$Q$3,[2]抽卡!$Q$4)","v":10}]
[12507,1806,"极速齿轮",1856,"功法-被动",{"$f":"IFERROR(VLOOKUP(AB105*10,[3]SkillConfig!$A:$I,9,FALSE),\"\")","v":"icon_s2007"},13,{"$f":"CONCATENATE(VLOOKUP(G105,ID分段!A:B,2,FALSE),\"-\",VLOOKUP(G105,ID分段!A:C,3,FALSE))","v":"功法-本体"},4,0,0,"",0,1,0,null,null,0,0,0,0,3,"13507;2007;10",null,null,null,13507,2007,{"$f":"CHOOSE(I105-2,[2]抽卡!$Q$2,[2]抽卡!$Q$3,[2]抽卡!$Q$4)","v":10}]
[12508,1807,"太虚剑意",1857,"功法-被动",{"$f":"IFERROR(VLOOKUP(AB106*10,[3]SkillConfig!$A:$I,9,FALSE),\"\")","v":"icon_s2008"},13,{"$f":"CONCATENATE(VLOOKUP(G106,ID分段!A:B,2,FALSE),\"-\",VLOOKUP(G106,ID分段!A:C,3,FALSE))","v":"功法-本体"},4,0,0,"",0,1,0,null,null,0,0,0,0,3,"13508;2008;10",null,null,null,13508,2008,{"$f":"CHOOSE(I106-2,[2]抽卡!$Q$2,[2]抽卡!$Q$3,[2]抽卡!$Q$4)","v":10}]
[12509,1808,"青莲净体诀",1858,"功法-被动",{"$f":"IFERROR(VLOOKUP(AB107*10,[3]SkillConfig!$A:$I,9,FALSE),\"\")","v":"icon_s2009"},13,{"$f":"CONCATENATE(VLOOKUP(G107,ID分段!A:B,2,FALSE),\"-\",VLOOKUP(G107,ID分段!A:C,3,FALSE))","v":"功法-本体"},4,0,0,"",0,1,0,null,null,0,0,0,0,3,{"$f":"_xlfn.TEXTJOIN(\";\",1,AA107:AE107)","v":"13509;2009;10"},null,null,null,13509,2009,{"$f":"CHOOSE(I107-2,[2]抽卡!$Q$2,[2]抽卡!$Q$3,[2]抽卡!$Q$4)","v":10}]
[12510,1809,"碧霄回春术",1859,"功法-被动",{"$f":"IFERROR(VLOOKUP(AB108*10,[3]SkillConfig!$A:$I,9,FALSE),\"\")","v":"icon_s2010"},13,{"$f":"CONCATENATE(VLOOKUP(G108,ID分段!A:B,2,FALSE),\"-\",VLOOKUP(G108,ID分段!A:C,3,FALSE))","v":"功法-本体"},4,0,0,"",0,1,0,null,null,0,0,0,0,3,"13510;2010;10",null,null,null,13510,2010,{"$f":"CHOOSE(I108-2,[2]抽卡!$Q$2,[2]抽卡!$Q$3,[2]抽卡!$Q$4)","v":10}]
[12511,10122,"血祭神通",null,"功法-被动",{"$f":"IFERROR(VLOOKUP(AB109*10,[3]SkillConfig!$A:$I,9,FALSE),\"\")","v":"icon_s2011"},13,{"$f":"CONCATENATE(VLOOKUP(G109,ID分段!A:B,2,FALSE),\"-\",VLOOKUP(G109,ID分段!A:C,3,FALSE))","v":"功法-本体"},5,0,0,"",0,1,0,null,null,0,0,0,0,3,"13511;2011;30",null,null,null,13511,2011,{"$f":"CHOOSE(I109-2,[2]抽卡!$Q$2,[2]抽卡!$Q$3,[2]抽卡!$Q$4)","v":30}]
[12512,10123,"金煞决",null,"功法-被动",{"$f":"IFERROR(VLOOKUP(AB110*10,[3]SkillConfig!$A:$I,9,FALSE),\"\")","v":"icon_s2012"},13,{"$f":"CONCATENATE(VLOOKUP(G110,ID分段!A:B,2,FALSE),\"-\",VLOOKUP(G110,ID分段!A:C,3,FALSE))","v":"功法-本体"},5,0,0,"",0,1,0,null,null,0,0,0,0,3,"13512;2012;30",null,null,null,13512,2012,{"$f":"CHOOSE(I110-2,[2]抽卡!$Q$2,[2]抽卡!$Q$3,[2]抽卡!$Q$4)","v":30}]
[12513,10124,"毒瘴领域",null,"功法-被动",{"$f":"IFERROR(VLOOKUP(AB111*10,[3]SkillConfig!$A:$I,9,FALSE),\"\")","v":"icon_s2013"},13,{"$f":"CONCATENATE(VLOOKUP(G111,ID分段!A:B,2,FALSE),\"-\",VLOOKUP(G111,ID分段!A:C,3,FALSE))","v":"功法-本体"},5,0,0,"",0,1,0,null,null,0,0,0,0,3,"13513;2013;30",null,null,null,13513,2013,{"$f":"CHOOSE(I111-2,[2]抽卡!$Q$2,[2]抽卡!$Q$3,[2]抽卡!$Q$4)","v":30}]
[12514,10125,"毒爆",null,"功法-被动",{"$f":"IFERROR(VLOOKUP(AB112*10,[3]SkillConfig!$A:$I,9,FALSE),\"\")","v":"icon_s2014"},13,{"$f":"CONCATENATE(VLOOKUP(G112,ID分段!A:B,2,FALSE),\"-\",VLOOKUP(G112,ID分段!A:C,3,FALSE))","v":"功法-本体"},5,0,0,"",0,1,0,null,null,0,0,0,0,3,"13514;2014;30",null,null,null,13514,2014,{"$f":"CHOOSE(I112-2,[2]抽卡!$Q$2,[2]抽卡!$Q$3,[2]抽卡!$Q$4)","v":30}]
[12515,10126,"异常转移",null,"功法-被动",{"$f":"IFERROR(VLOOKUP(AB113*10,[3]SkillConfig!$A:$I,9,FALSE),\"\")","v":"icon_s2015"},13,{"$f":"CONCATENATE(VLOOKUP(G113,ID分段!A:B,2,FALSE),\"-\",VLOOKUP(G113,ID分段!A:C,3,FALSE))","v":"功法-本体"},5,0,0,"",0,1,0,null,null,0,0,0,0,3,"13515;2015;30",null,null,null,13515,2015,{"$f":"CHOOSE(I113-2,[2]抽卡!$Q$2,[2]抽卡!$Q$3,[2]抽卡!$Q$4)","v":30}]
[12516,10127,"阴水",null,"功法-被动",{"$f":"IFERROR(VLOOKUP(AB114*10,[3]SkillConfig!$A:$I,9,FALSE),\"\")","v":"icon_s2016"},13,{"$f":"CONCATENATE(VLOOKUP(G114,ID分段!A:B,2,FALSE),\"-\",VLOOKUP(G114,ID分段!A:C,3,FALSE))","v":"功法-本体"},5,0,0,"",0,1,0,null,null,0,0,0,0,3,"13516;2016;30",null,null,null,13516,2016,{"$f":"CHOOSE(I114-2,[2]抽卡!$Q$2,[2]抽卡!$Q$3,[2]抽卡!$Q$4)","v":30}]
[12517,10128,"灵油",null,"功法-被动",{"$f":"IFERROR(VLOOKUP(AB115*10,[3]SkillConfig!$A:$I,9,FALSE),\"\")","v":"icon_s2017"},13,{"$f":"CONCATENATE(VLOOKUP(G115,ID分段!A:B,2,FALSE),\"-\",VLOOKUP(G115,ID分段!A:C,3,FALSE))","v":"功法-本体"},5,0,0,"",0,1,0,null,null,0,0,0,0,3,"13517;2017;30",null,null,null,13517,2017,{"$f":"CHOOSE(I115-2,[2]抽卡!$Q$2,[2]抽卡!$Q$3,[2]抽卡!$Q$4)","v":30}]
[12518,10129,"厚土护体",null,"功法-被动",{"$f":"IFERROR(VLOOKUP(AB116*10,[3]SkillConfig!$A:$I,9,FALSE),\"\")","v":"icon_s2018"},13,{"$f":"CONCATENATE(VLOOKUP(G116,ID分段!A:B,2,FALSE),\"-\",VLOOKUP(G116,ID分段!A:C,3,FALSE))","v":"功法-本体"},5,0,0,"",0,1,0,null,null,0,0,0,0,3,{"$f":"_xlfn.TEXTJOIN(\";\",1,AA116:AE116)","v":"13518;2018;30"},null,null,null,13518,2018,{"$f":"CHOOSE(I116-2,[2]抽卡!$Q$2,[2]抽卡!$Q$3,[2]抽卡!$Q$4)","v":30}]
[12519,10130,"金沙",null,"功法-被动",{"$f":"IFERROR(VLOOKUP(AB117*10,[3]SkillConfig!$A:$I,9,FALSE),\"\")","v":"icon_s2019"},13,{"$f":"CONCATENATE(VLOOKUP(G117,ID分段!A:B,2,FALSE),\"-\",VLOOKUP(G117,ID分段!A:C,3,FALSE))","v":"功法-本体"},5,0,0,"",0,1,0,null,null,0,0,0,0,3,"13519;2019;30",null,null,null,13519,2019,{"$f":"CHOOSE(I117-2,[2]抽卡!$Q$2,[2]抽卡!$Q$3,[2]抽卡!$Q$4)","v":30}]
[{"$nulls":11},""]
[13001,1600,{"$f":"CONCATENATE(C73,\"碎片\")","v":"太虚幻剑经碎片"},1700,null,{"$f":"F73","v":"icon_s1101"},14,{"$f":"CONCATENATE(VLOOKUP(G119,ID分段!A:B,2,FALSE),\"-\",VLOOKUP(G119,ID分段!A:C,3,FALSE))","v":"功法-碎片"},5,0,0,"",0,1,0,null,null,0,0,0,0,11,{"$f":"_xlfn.TEXTJOIN(\";\",1,AA119:AE119)","v":"12001"},null,null,null,12001]
[13002,1601,"天罡剑气诀碎片",1701,null,{"$f":"F74","v":"icon_s1102"},14,{"$f":"CONCATENATE(VLOOKUP(G120,ID分段!A:B,2,FALSE),\"-\",VLOOKUP(G120,ID分段!A:C,3,FALSE))","v":"功法-碎片"},5,0,0,"",0,1,0,null,null,0,0,0,0,11,{"$f":"_xlfn.TEXTJOIN(\";\",1,AA120:AE120)","v":"12002"},null,null,null,12002]
[13003,1602,"血刃金煌功碎片",1702,null,"icon_s1103",14,{"$f":"CONCATENATE(VLOOKUP(G121,ID分段!A:B,2,FALSE),\"-\",VLOOKUP(G121,ID分段!A:C,3,FALSE))","v":"功法-碎片"},5,0,0,"",0,1,0,null,null,0,0,0,0,11,"12003",null,null,null,12003]
[13004,1603,"飞刃碎片",1703,null,"icon_s1104",14,{"$f":"CONCATENATE(VLOOKUP(G122,ID分段!A:B,2,FALSE),\"-\",VLOOKUP(G122,ID分段!A:C,3,FALSE))","v":"功法-碎片"},4,0,0,"",0,1,0,null,null,0,0,0,0,11,"12004",null,null,null,12004]
[13005,1604,"金针碎片",1704,null,"icon_s1105",14,{"$f":"CONCATENATE(VLOOKUP(G123,ID分段!A:B,2,FALSE),\"-\",VLOOKUP(G123,ID分段!A:C,3,FALSE))","v":"功法-碎片"},3,0,0,"",0,1,0,null,null,0,0,0,0,11,"12005",null,null,null,12005]
[13006,1605,"碧落幽冥劲碎片",1705,null,"icon_s1201",14,{"$f":"CONCATENATE(VLOOKUP(G124,ID分段!A:B,2,FALSE),\"-\",VLOOKUP(G124,ID分段!A:C,3,FALSE))","v":"功法-碎片"},5,0,0,"",0,1,0,null,null,0,0,0,0,11,"12006",null,null,null,12006]
[13007,1606,"雾隐千流法碎片",1706,null,"icon_s1202",14,{"$f":"CONCATENATE(VLOOKUP(G125,ID分段!A:B,2,FALSE),\"-\",VLOOKUP(G125,ID分段!A:C,3,FALSE))","v":"功法-碎片"},5,0,0,"",0,1,0,null,null,0,0,0,0,11,"12007",null,null,null,12007]
[13008,1607,"功法-水3碎片",1707,null,"",14,{"$f":"CONCATENATE(VLOOKUP(G126,ID分段!A:B,2,FALSE),\"-\",VLOOKUP(G126,ID分段!A:C,3,FALSE))","v":"功法-碎片"},5,0,0,"",0,1,0,null,null,0,0,0,0,11,"12008",null,null,null,12008]
[13009,1608,"水球碎片",1708,null,"icon_s1204",14,{"$f":"CONCATENATE(VLOOKUP(G127,ID分段!A:B,2,FALSE),\"-\",VLOOKUP(G127,ID分段!A:C,3,FALSE))","v":"功法-碎片"},4,0,0,"",0,1,0,null,null,0,0,0,0,11,"12009",null,null,null,12009]
[13010,1609,"冰刀碎片",1709,null,"icon_s1205",14,{"$f":"CONCATENATE(VLOOKUP(G128,ID分段!A:B,2,FALSE),\"-\",VLOOKUP(G128,ID分段!A:C,3,FALSE))","v":"功法-碎片"},3,0,0,"",0,1,0,null,null,0,0,0,0,11,"12010",null,null,null,12010]
[13011,1610,"瘴影千丝术碎片",1710,null,"icon_s1301",14,{"$f":"CONCATENATE(VLOOKUP(G129,ID分段!A:B,2,FALSE),\"-\",VLOOKUP(G129,ID分段!A:C,3,FALSE))","v":"功法-碎片"},5,0,0,"",0,1,0,null,null,0,0,0,0,11,"12011",null,null,null,12011]
[13012,1611,"蚀骨腐血掌碎片",1711,null,"icon_s1302",14,{"$f":"CONCATENATE(VLOOKUP(G130,ID分段!A:B,2,FALSE),\"-\",VLOOKUP(G130,ID分段!A:C,3,FALSE))","v":"功法-碎片"},5,0,0,"",0,1,0,null,null,0,0,0,0,11,"12012",null,null,null,12012]
[13013,1612,"功法-木3碎片",1712,null,"",14,{"$f":"CONCATENATE(VLOOKUP(G131,ID分段!A:B,2,FALSE),\"-\",VLOOKUP(G131,ID分段!A:C,3,FALSE))","v":"功法-碎片"},5,0,0,"",0,1,0,null,null,0,0,0,0,11,"12013",null,null,null,12013]
[13014,1613,"竹刺碎片",1713,null,"icon_s1304",14,{"$f":"CONCATENATE(VLOOKUP(G132,ID分段!A:B,2,FALSE),\"-\",VLOOKUP(G132,ID分段!A:C,3,FALSE))","v":"功法-碎片"},4,0,0,"",0,1,0,null,null,0,0,0,0,11,"12014",null,null,null,12014]
[13015,1614,"飞叶碎片",1714,null,"icon_s1305",14,{"$f":"CONCATENATE(VLOOKUP(G133,ID分段!A:B,2,FALSE),\"-\",VLOOKUP(G133,ID分段!A:C,3,FALSE))","v":"功法-碎片"},3,0,0,"",0,1,0,null,null,0,0,0,0,11,"12015",null,null,null,12015]
[13016,1615,"烈焰剑碎片",1715,null,"icon_s1401",14,{"$f":"CONCATENATE(VLOOKUP(G134,ID分段!A:B,2,FALSE),\"-\",VLOOKUP(G134,ID分段!A:C,3,FALSE))","v":"功法-碎片"},5,0,0,{"$f":"_xlfn.TEXTJOIN(\";\",1,AG134:AI134)","v":""},0,1,0,null,null,0,0,0,0,11,"12016",null,null,null,12016]
[13017,1616,"赤焰龙吟功碎片",1716,null,"icon_s1402",14,{"$f":"CONCATENATE(VLOOKUP(G135,ID分段!A:B,2,FALSE),\"-\",VLOOKUP(G135,ID分段!A:C,3,FALSE))","v":"功法-碎片"},5,0,0,"",0,1,0,null,null,0,0,0,0,11,"12017",null,null,null,12017]
[13018,1617,"朱雀燎原指碎片",1717,null,"icon_s1403",14,{"$f":"CONCATENATE(VLOOKUP(G136,ID分段!A:B,2,FALSE),\"-\",VLOOKUP(G136,ID分段!A:C,3,FALSE))","v":"功法-碎片"},5,0,0,"",0,1,0,null,null,0,0,0,0,11,"12018",null,null,null,12018]
[13019,1618,"火球碎片",1718,null,"icon_s1404",14,{"$f":"CONCATENATE(VLOOKUP(G137,ID分段!A:B,2,FALSE),\"-\",VLOOKUP(G137,ID分段!A:C,3,FALSE))","v":"功法-碎片"},4,0,0,"",0,1,0,null,null,0,0,0,0,11,"12019",null,null,null,12019]
[13020,1619,"火刀碎片",1719,null,"icon_s1405",14,{"$f":"CONCATENATE(VLOOKUP(G138,ID分段!A:B,2,FALSE),\"-\",VLOOKUP(G138,ID分段!A:C,3,FALSE))","v":"功法-碎片"},3,0,0,"",0,1,0,null,null,0,0,0,0,11,"12020",null,null,null,12020]
[13021,1620,"黄尘灭魂刺碎片",1720,null,"icon_s1501",14,{"$f":"CONCATENATE(VLOOKUP(G139,ID分段!A:B,2,FALSE),\"-\",VLOOKUP(G139,ID分段!A:C,3,FALSE))","v":"功法-碎片"},5,0,0,"",0,1,0,null,null,0,0,0,0,11,"12021",null,null,null,12021]
[13022,1621,"地裂屠龙斩碎片",1721,null,"icon_s1502",14,{"$f":"CONCATENATE(VLOOKUP(G140,ID分段!A:B,2,FALSE),\"-\",VLOOKUP(G140,ID分段!A:C,3,FALSE))","v":"功法-碎片"},5,0,0,"",0,1,0,null,null,0,0,0,0,11,"12022",null,null,null,12022]
[13023,1622,"功法-土3碎片",1722,null,"",14,{"$f":"CONCATENATE(VLOOKUP(G141,ID分段!A:B,2,FALSE),\"-\",VLOOKUP(G141,ID分段!A:C,3,FALSE))","v":"功法-碎片"},5,0,0,"",0,1,0,null,null,0,0,0,0,11,"12023",null,null,null,12023]
[13024,1623,"落石碎片",1723,null,"icon_s1504",14,{"$f":"CONCATENATE(VLOOKUP(G142,ID分段!A:B,2,FALSE),\"-\",VLOOKUP(G142,ID分段!A:C,3,FALSE))","v":"功法-碎片"},4,0,0,"",0,1,0,null,null,0,0,0,0,11,"12024",null,null,null,12024]
[13025,1624,"小石头碎片",1724,null,"icon_s1505",14,{"$f":"CONCATENATE(VLOOKUP(G143,ID分段!A:B,2,FALSE),\"-\",VLOOKUP(G143,ID分段!A:C,3,FALSE))","v":"功法-碎片"},3,0,0,"",0,1,0,null,null,0,0,0,0,11,"12025",null,null,null,12025]
[{"$nulls":11},""]
[13501,1625,{"$f":"CONCATENATE(C99,\"碎片\")","v":"天衍星辰诀碎片"},1725,null,{"$f":"F99","v":"icon_s2001"},14,{"$f":"CONCATENATE(VLOOKUP(G145,ID分段!A:B,2,FALSE),\"-\",VLOOKUP(G145,ID分段!A:C,3,FALSE))","v":"功法-碎片"},3,0,0,"",0,1,0,null,null,0,0,0,0,11,"12501",null,null,null,12501]
[13502,1626,"法宝秘籍碎片",1726,null,{"$f":"F100","v":"icon_s2002"},14,{"$f":"CONCATENATE(VLOOKUP(G146,ID分段!A:B,2,FALSE),\"-\",VLOOKUP(G146,ID分段!A:C,3,FALSE))","v":"功法-碎片"},3,0,0,"",0,1,0,null,null,0,0,0,0,11,"12502",null,null,null,12502]
[13503,1627,"崩脉决碎片",1727,null,"icon_s2003",14,{"$f":"CONCATENATE(VLOOKUP(G147,ID分段!A:B,2,FALSE),\"-\",VLOOKUP(G147,ID分段!A:C,3,FALSE))","v":"功法-碎片"},3,0,0,"",0,1,0,null,null,0,0,0,0,11,"12503",null,null,null,12503]
[13504,1628,"两仪决碎片",1728,null,"icon_s2004",14,{"$f":"CONCATENATE(VLOOKUP(G148,ID分段!A:B,2,FALSE),\"-\",VLOOKUP(G148,ID分段!A:C,3,FALSE))","v":"功法-碎片"},3,0,0,"",0,1,0,null,null,0,0,0,0,11,"12504",null,null,null,12504]
[13505,1629,"火焰决碎片",1729,null,"icon_s2005",14,{"$f":"CONCATENATE(VLOOKUP(G149,ID分段!A:B,2,FALSE),\"-\",VLOOKUP(G149,ID分段!A:C,3,FALSE))","v":"功法-碎片"},3,0,0,"",0,1,0,null,null,0,0,0,0,11,"12505",null,null,null,12505]
[13506,1630,"乾坤巨灵诀碎片",1730,null,"icon_s2006",14,{"$f":"CONCATENATE(VLOOKUP(G150,ID分段!A:B,2,FALSE),\"-\",VLOOKUP(G150,ID分段!A:C,3,FALSE))","v":"功法-碎片"},4,0,0,"",0,1,0,null,null,0,0,0,0,11,"12506",null,null,null,12506]
[13507,1631,"极速齿轮碎片",1731,null,"icon_s2007",14,{"$f":"CONCATENATE(VLOOKUP(G151,ID分段!A:B,2,FALSE),\"-\",VLOOKUP(G151,ID分段!A:C,3,FALSE))","v":"功法-碎片"},4,0,0,"",0,1,0,null,null,0,0,0,0,11,"12507",null,null,null,12507]
[13508,1632,"太虚剑意碎片",1732,null,"icon_s2008",14,{"$f":"CONCATENATE(VLOOKUP(G152,ID分段!A:B,2,FALSE),\"-\",VLOOKUP(G152,ID分段!A:C,3,FALSE))","v":"功法-碎片"},4,0,0,"",0,1,0,null,null,0,0,0,0,11,"12508",null,null,null,12508]
[13509,1633,"青莲净体诀碎片",1733,null,"icon_s2009",14,{"$f":"CONCATENATE(VLOOKUP(G153,ID分段!A:B,2,FALSE),\"-\",VLOOKUP(G153,ID分段!A:C,3,FALSE))","v":"功法-碎片"},4,0,0,"",0,1,0,null,null,0,0,0,0,11,"12509",null,null,null,12509]
[13510,1634,"碧霄回春术碎片",1734,null,"icon_s2010",14,{"$f":"CONCATENATE(VLOOKUP(G154,ID分段!A:B,2,FALSE),\"-\",VLOOKUP(G154,ID分段!A:C,3,FALSE))","v":"功法-碎片"},4,0,0,"",0,1,0,null,null,0,0,0,0,11,"12510",null,null,null,12510]
[13511,10001,{"$f":"CONCATENATE(C109,\"碎片\")","v":"血祭神通碎片"},10010,null,"icon_s2011",14,{"$f":"CONCATENATE(VLOOKUP(G155,ID分段!A:B,2,FALSE),\"-\",VLOOKUP(G155,ID分段!A:C,3,FALSE))","v":"功法-碎片"},5,0,0,"",0,1,0,null,null,0,0,0,0,11,"12511",null,null,null,12511]
[13512,10002,"金煞决碎片",10011,null,"icon_s2012",14,{"$f":"CONCATENATE(VLOOKUP(G156,ID分段!A:B,2,FALSE),\"-\",VLOOKUP(G156,ID分段!A:C,3,FALSE))","v":"功法-碎片"},5,0,0,"",0,1,0,null,null,0,0,0,0,11,"12512",null,null,null,12512]
[13513,10003,"毒瘴领域碎片",10012,null,"icon_s2013",14,{"$f":"CONCATENATE(VLOOKUP(G157,ID分段!A:B,2,FALSE),\"-\",VLOOKUP(G157,ID分段!A:C,3,FALSE))","v":"功法-碎片"},5,0,0,"",0,1,0,null,null,0,0,0,0,11,"12513",null,null,null,12513]
[13514,10004,"毒爆碎片",10013,null,"icon_s2014",14,{"$f":"CONCATENATE(VLOOKUP(G158,ID分段!A:B,2,FALSE),\"-\",VLOOKUP(G158,ID分段!A:C,3,FALSE))","v":"功法-碎片"},5,0,0,"",0,1,0,null,null,0,0,0,0,11,"12514",null,null,null,12514]
[13515,10005,"异常转移碎片",10014,null,"icon_s2015",14,{"$f":"CONCATENATE(VLOOKUP(G159,ID分段!A:B,2,FALSE),\"-\",VLOOKUP(G159,ID分段!A:C,3,FALSE))","v":"功法-碎片"},5,0,0,"",0,1,0,null,null,0,0,0,0,11,"12515",null,null,null,12515]
[13516,10006,"阴水碎片",10015,null,"icon_s2016",14,{"$f":"CONCATENATE(VLOOKUP(G160,ID分段!A:B,2,FALSE),\"-\",VLOOKUP(G160,ID分段!A:C,3,FALSE))","v":"功法-碎片"},5,0,0,"",0,1,0,null,null,0,0,0,0,11,"12516",null,null,null,12516]
[13517,10007,"灵油碎片",10016,null,"icon_s2017",14,{"$f":"CONCATENATE(VLOOKUP(G161,ID分段!A:B,2,FALSE),\"-\",VLOOKUP(G161,ID分段!A:C,3,FALSE))","v":"功法-碎片"},5,0,0,"",0,1,0,null,null,0,0,0,0,11,"12517",null,null,null,12517]
[13518,10008,"厚土护体碎片",10017,null,"icon_s2018",14,{"$f":"CONCATENATE(VLOOKUP(G162,ID分段!A:B,2,FALSE),\"-\",VLOOKUP(G162,ID分段!A:C,3,FALSE))","v":"功法-碎片"},5,0,0,"",0,1,0,null,null,0,0,0,0,11,"12518",null,null,null,12518]
[13519,10009,"金沙碎片",10018,null,"icon_s2019",14,{"$f":"CONCATENATE(VLOOKUP(G163,ID分段!A:B,2,FALSE),\"-\",VLOOKUP(G163,ID分段!A:C,3,FALSE))","v":"功法-碎片"},5,0,0,"",0,1,0,null,null,0,0,0,0,11,"12519",null,null,null,12519]
[{"$nulls":11},""]
[20001,3013,"樗木之灵的树枝",3015,{"$f":"CONCATENATE(\"道具描述_\",C165)","v":"道具描述_樗木之灵的树枝"},{"$f":"\"icon_item_\"&A165","v":"icon_item_20001"},21,{"$f":"CONCATENATE(VLOOKUP(G165,ID分段!A:B,2,FALSE),\"-\",VLOOKUP(G165,ID分段!A:C,3,FALSE))","v":"道具-任务道具"},2,0,0,"",0,1,0,null,null,0,0,0,0]
[20002,3014,"飞天灵兽的翅膀",3016,{"$f":"CONCATENATE(\"道具描述_\",C166)","v":"道具描述_飞天灵兽的翅膀"},{"$f":"\"icon_item_\"&A166","v":"icon_item_20002"},21,{"$f":"CONCATENATE(VLOOKUP(G166,ID分段!A:B,2,FALSE),\"-\",VLOOKUP(G166,ID分段!A:C,3,FALSE))","v":"道具-任务道具"},2,0,0,"",0,1,0,null,null,0,0,0,0]
[20003,3183,"灵草种子",3184,"道具描述_灵草种子",{"$f":"\"icon_item_\"&A167","v":"icon_item_20003"},21,{"$f":"CONCATENATE(VLOOKUP(G167,ID分段!A:B,2,FALSE),\"-\",VLOOKUP(G167,ID分段!A:C,3,FALSE))","v":"道具-任务道具"},2,0,0,"",0,1,0,null,null,0,0,0,0]
[20004,10019,"甘露",10028,"道具描述_甘露",{"$f":"\"icon_item_\"&A168","v":"icon_item_20004"},21,{"$f":"CONCATENATE(VLOOKUP(G168,ID分段!A:B,2,FALSE),\"-\",VLOOKUP(G168,ID分段!A:C,3,FALSE))","v":"道具-任务道具"},2,0,0,"",0,1,0,null,null,0,0,0,0]
[20005,10020,"风铃",10029,"道具描述_风铃",{"$f":"\"icon_item_\"&A169","v":"icon_item_20005"},21,{"$f":"CONCATENATE(VLOOKUP(G169,ID分段!A:B,2,FALSE),\"-\",VLOOKUP(G169,ID分段!A:C,3,FALSE))","v":"道具-任务道具"},2,0,0,"",0,1,0,null,null,0,0,0,0]
[20006,10021,"风灵碎片",10030,"道具描述_风灵碎片",{"$f":"\"icon_item_\"&A170","v":"icon_item_20006"},21,{"$f":"CONCATENATE(VLOOKUP(G170,ID分段!A:B,2,FALSE),\"-\",VLOOKUP(G170,ID分段!A:C,3,FALSE))","v":"道具-任务道具"},2,0,0,"",0,1,0,null,null,0,0,0,0]
[20007,10022,"浮岛灵石",10031,"道具描述_浮岛灵石",{"$f":"\"icon_item_\"&A171","v":"icon_item_20007"},21,{"$f":"CONCATENATE(VLOOKUP(G171,ID分段!A:B,2,FALSE),\"-\",VLOOKUP(G171,ID分段!A:C,3,FALSE))","v":"道具-任务道具"},2,0,0,"",0,1,0,null,null,0,0,0,0]
[20008,10023,"云隐宗长老密信",10032,"道具描述_云隐宗长老密信",{"$f":"\"icon_item_\"&A172","v":"icon_item_20008"},21,{"$f":"CONCATENATE(VLOOKUP(G172,ID分段!A:B,2,FALSE),\"-\",VLOOKUP(G172,ID分段!A:C,3,FALSE))","v":"道具-任务道具"},2,0,0,"",0,1,0,null,null,0,0,0,0]
[20009,10024,"尧都玉佩",10033,"道具描述_尧都玉佩",{"$f":"\"icon_item_\"&A173","v":"icon_item_20009"},21,{"$f":"CONCATENATE(VLOOKUP(G173,ID分段!A:B,2,FALSE),\"-\",VLOOKUP(G173,ID分段!A:C,3,FALSE))","v":"道具-任务道具"},2,0,0,"",0,1,0,null,null,0,0,0,0]
[20010,10025,"山野灵草",10034,"道具描述_山野灵草",{"$f":"\"icon_item_\"&A174","v":"icon_item_20010"},21,{"$f":"CONCATENATE(VLOOKUP(G174,ID分段!A:B,2,FALSE),\"-\",VLOOKUP(G174,ID分段!A:C,3,FALSE))","v":"道具-任务道具"},2,0,0,"",0,1,0,null,null,0,0,0,0]
[20011,10026,"秘境种子",10035,"道具描述_秘境种子",{"$f":"\"icon_item_\"&A175","v":"icon_item_20011"},21,{"$f":"CONCATENATE(VLOOKUP(G175,ID分段!A:B,2,FALSE),\"-\",VLOOKUP(G175,ID分段!A:C,3,FALSE))","v":"道具-任务道具"},2,0,0,"",0,1,0,null,null,0,0,0,0]
[20012,10027,"甜蜜果实",10036,"道具描述_甜蜜果实",{"$f":"\"icon_item_\"&A176","v":"icon_item_20012"},21,{"$f":"CONCATENATE(VLOOKUP(G176,ID分段!A:B,2,FALSE),\"-\",VLOOKUP(G176,ID分段!A:C,3,FALSE))","v":"道具-任务道具"},2,0,0,"",0,1,0,null,null,0,0,0,0]
[20013,10298,"幽魂石",10300,"道具描述_幽魂石","icon_item_20013",21,{"$f":"CONCATENATE(VLOOKUP(G177,ID分段!A:B,2,FALSE),\"-\",VLOOKUP(G177,ID分段!A:C,3,FALSE))","v":"道具-任务道具"},2,0,0,"",0,1,0,null,null,0,0,0,0]
[20014,10299,"云雾秘钥",10301,"道具描述_云雾秘钥",{"$f":"\"icon_item_\"&A178","v":"icon_item_20014"},21,{"$f":"CONCATENATE(VLOOKUP(G178,ID分段!A:B,2,FALSE),\"-\",VLOOKUP(G178,ID分段!A:C,3,FALSE))","v":"道具-任务道具"},2,0,0,{"$f":"_xlfn.TEXTJOIN(\";\",1,AG178:AI178)","v":""},0,1,0,null,null,0,0,0,0]
[{"$nulls":11},""]
[21001,3194,"灵石神识符",3207,"探索神识时，指定获得大量灵石作为奖励。","icon_Coin",22,{"$f":"CONCATENATE(VLOOKUP(G180,ID分段!A:B,2,FALSE),\"-\",VLOOKUP(G180,ID分段!A:C,3,FALSE))","v":"道具-神识道符"},3,0,0,"",0,1,0,null,null,0,0,0,0,7,1]
[21002,3195,"修为神识符",3208,"探索神识时，指定获得大量修为作为奖励。","icon_Gem_Star_Blue",22,{"$f":"CONCATENATE(VLOOKUP(G181,ID分段!A:B,2,FALSE),\"-\",VLOOKUP(G181,ID分段!A:C,3,FALSE))","v":"道具-神识道符"},3,0,0,"",0,1,0,null,null,0,0,0,0,7,2]
[21003,3196,"灵气神识符",3209,"探索神识时，指定获得大量灵气作为奖励。","icon_GradeBadge_Master",22,{"$f":"CONCATENATE(VLOOKUP(G182,ID分段!A:B,2,FALSE),\"-\",VLOOKUP(G182,ID分段!A:C,3,FALSE))","v":"道具-神识道符"},3,0,0,"",0,1,0,null,null,0,0,0,0,7,3]
[21004,3197,"玄晶神识符",3210,"探索神识时，指定获得大量玄晶作为奖励。","icon_GradeBadge_Challenger",22,{"$f":"CONCATENATE(VLOOKUP(G183,ID分段!A:B,2,FALSE),\"-\",VLOOKUP(G183,ID分段!A:C,3,FALSE))","v":"道具-神识道符"},3,0,0,"",0,1,0,null,null,0,0,0,0,7,4]
[21005,3198,"功法神识符",3211,"探索神识时，指定获得大量功法碎片作为奖励。",{"$f":"\"icon_item_\"&A184","v":"icon_item_21005"},22,{"$f":"CONCATENATE(VLOOKUP(G184,ID分段!A:B,2,FALSE),\"-\",VLOOKUP(G184,ID分段!A:C,3,FALSE))","v":"道具-神识道符"},3,0,0,"",0,1,0,null,null,0,0,0,0,7,5]
[21006,3199,"法宝神识符",3212,"探索神识时，指定获得大量法宝碎片作为奖励。","icon_item_21006",22,{"$f":"CONCATENATE(VLOOKUP(G185,ID分段!A:B,2,FALSE),\"-\",VLOOKUP(G185,ID分段!A:C,3,FALSE))","v":"道具-神识道符"},3,0,0,"",0,1,0,null,null,0,0,0,0,7,6]
[21007,3200,"修为神识符",3213,"探索神识时，指定获得大量修为作为奖励。","icon_item_21007",22,{"$f":"CONCATENATE(VLOOKUP(G186,ID分段!A:B,2,FALSE),\"-\",VLOOKUP(G186,ID分段!A:C,3,FALSE))","v":"道具-神识道符"},3,0,0,"",0,1,0,null,null,0,0,0,0,7,7]
[21008,3201,"天地神识符",3214,"探索神识时，指定获得大量天材地宝作为奖励。","icon_item_21008",22,{"$f":"CONCATENATE(VLOOKUP(G187,ID分段!A:B,2,FALSE),\"-\",VLOOKUP(G187,ID分段!A:C,3,FALSE))","v":"道具-神识道符"},3,0,0,"",0,1,0,null,null,0,0,0,0,7,8]
[21009,3202,"渡劫神识符",3215,"探索神识时，指定获得大量渡劫丹作为奖励。","icon_item_21009",22,{"$f":"CONCATENATE(VLOOKUP(G188,ID分段!A:B,2,FALSE),\"-\",VLOOKUP(G188,ID分段!A:C,3,FALSE))","v":"道具-神识道符"},3,0,0,"",0,1,0,null,null,0,0,0,0,7,9]
[21010,3203,"好感神识符",3216,"探索神识时，指定获得大量好感度礼物作为奖励。","icon_item_21010",22,{"$f":"CONCATENATE(VLOOKUP(G189,ID分段!A:B,2,FALSE),\"-\",VLOOKUP(G189,ID分段!A:C,3,FALSE))","v":"道具-神识道符"},3,0,0,"",0,1,0,null,null,0,0,0,0,7,10]
[21011,3204,"心情神识符",3217,"探索神识时，指定获得大量心情礼物作为奖励。",{"$f":"\"icon_item_\"&A190","v":"icon_item_21011"},22,{"$f":"CONCATENATE(VLOOKUP(G190,ID分段!A:B,2,FALSE),\"-\",VLOOKUP(G190,ID分段!A:C,3,FALSE))","v":"道具-神识道符"},3,0,0,"",0,1,0,null,null,0,0,0,0,7,11]
[21012,3205,"紫色神识符",3218,"探索神识时，必定探得紫色品质神识。","icon_shenshitishengfu2",22,{"$f":"CONCATENATE(VLOOKUP(G191,ID分段!A:B,2,FALSE),\"-\",VLOOKUP(G191,ID分段!A:C,3,FALSE))","v":"道具-神识道符"},4,0,0,"",0,1,0,null,null,0,0,0,0,6,"4;100000"]
[21013,3206,"橙色神识符",3219,"探索神识时，必定探得橙色品质神识。","icon_shenshitishengfu3",22,{"$f":"CONCATENATE(VLOOKUP(G192,ID分段!A:B,2,FALSE),\"-\",VLOOKUP(G192,ID分段!A:C,3,FALSE))","v":"道具-神识道符"},5,0,0,"",0,1,0,null,null,0,0,0,0,6,"5;1000000"]
[{"$nulls":11},""]
[22001,3243,"主感悟点1",3250,{"$f":"CONCATENATE(\"道具描述_\",C194)","v":"道具描述_主感悟点1"},{"$f":"\"icon_item_\"&A194","v":"icon_item_22001"},23,{"$f":"CONCATENATE(VLOOKUP(G194,ID分段!A:B,2,FALSE),\"-\",VLOOKUP(G194,ID分段!A:C,3,FALSE))","v":"道具-感悟点"},5,0,0,"",0,1,0,null,null,0,0,0,0]
[22002,3244,"主感悟点2",3251,{"$f":"CONCATENATE(\"道具描述_\",C195)","v":"道具描述_主感悟点2"},"icon_item_22002",23,{"$f":"CONCATENATE(VLOOKUP(G195,ID分段!A:B,2,FALSE),\"-\",VLOOKUP(G195,ID分段!A:C,3,FALSE))","v":"道具-感悟点"},5,0,0,"",0,1,0,null,null,0,0,0,0]
[22003,3245,"主感悟点3",3252,"道具描述_主感悟点3","icon_item_22003",23,{"$f":"CONCATENATE(VLOOKUP(G196,ID分段!A:B,2,FALSE),\"-\",VLOOKUP(G196,ID分段!A:C,3,FALSE))","v":"道具-感悟点"},5,0,0,"",0,1,0,null,null,0,0,0,0]
[22004,3246,"主感悟点4",3253,"道具描述_主感悟点4","icon_item_22004",23,{"$f":"CONCATENATE(VLOOKUP(G197,ID分段!A:B,2,FALSE),\"-\",VLOOKUP(G197,ID分段!A:C,3,FALSE))","v":"道具-感悟点"},5,0,0,"",0,1,0,null,null,0,0,0,0]
[22005,3247,"主感悟点5",3254,"道具描述_主感悟点5","icon_item_22005",23,{"$f":"CONCATENATE(VLOOKUP(G198,ID分段!A:B,2,FALSE),\"-\",VLOOKUP(G198,ID分段!A:C,3,FALSE))","v":"道具-感悟点"},5,0,0,"",0,1,0,null,null,0,0,0,0]
[22006,3248,"主感悟点6",3255,"道具描述_主感悟点6","icon_item_22006",23,{"$f":"CONCATENATE(VLOOKUP(G199,ID分段!A:B,2,FALSE),\"-\",VLOOKUP(G199,ID分段!A:C,3,FALSE))","v":"道具-感悟点"},5,0,0,"",0,1,0,null,null,0,0,0,0]
[22007,3249,"主感悟点7",3256,"道具描述_主感悟点7","icon_item_22007",23,{"$f":"CONCATENATE(VLOOKUP(G200,ID分段!A:B,2,FALSE),\"-\",VLOOKUP(G200,ID分段!A:C,3,FALSE))","v":"道具-感悟点"},5,0,0,{"$f":"_xlfn.TEXTJOIN(\";\",1,AG200:AI200)","v":""},0,1,0,null,null,0,0,0,0]
[{"$nulls":11},""]
[22008,2079,"支线感悟点1",10291,{"$f":"CONCATENATE(\"道具描述_\",C202)","v":"道具描述_支线感悟点1"},{"$f":"\"icon_item_\"&A202","v":"icon_item_22008"},23,{"$f":"CONCATENATE(VLOOKUP(G202,ID分段!A:B,2,FALSE),\"-\",VLOOKUP(G202,ID分段!A:C,3,FALSE))","v":"道具-感悟点"},4,0,0,"",0,1,0,null,null,0,0,0,0]
[22009,2080,"支线感悟点2",10292,{"$f":"CONCATENATE(\"道具描述_\",C203)","v":"道具描述_支线感悟点2"},"icon_item_22009",23,{"$f":"CONCATENATE(VLOOKUP(G203,ID分段!A:B,2,FALSE),\"-\",VLOOKUP(G203,ID分段!A:C,3,FALSE))","v":"道具-感悟点"},4,0,0,"",0,1,0,null,null,0,0,0,0]
[22010,2081,"支线感悟点3",10293,"道具描述_支线感悟点3","icon_item_22010",23,{"$f":"CONCATENATE(VLOOKUP(G204,ID分段!A:B,2,FALSE),\"-\",VLOOKUP(G204,ID分段!A:C,3,FALSE))","v":"道具-感悟点"},4,0,0,"",0,1,0,null,null,0,0,0,0]
[22011,2082,"支线感悟点4",10294,"道具描述_支线感悟点4","icon_item_22011",23,{"$f":"CONCATENATE(VLOOKUP(G205,ID分段!A:B,2,FALSE),\"-\",VLOOKUP(G205,ID分段!A:C,3,FALSE))","v":"道具-感悟点"},4,0,0,"",0,1,0,null,null,0,0,0,0]
[22012,2083,"支线感悟点5",10295,"道具描述_支线感悟点5","icon_item_22012",23,{"$f":"CONCATENATE(VLOOKUP(G206,ID分段!A:B,2,FALSE),\"-\",VLOOKUP(G206,ID分段!A:C,3,FALSE))","v":"道具-感悟点"},4,0,0,"",0,1,0,null,null,0,0,0,0]
[22013,2084,"支线感悟点6",10296,"道具描述_支线感悟点6","icon_item_22013",23,{"$f":"CONCATENATE(VLOOKUP(G207,ID分段!A:B,2,FALSE),\"-\",VLOOKUP(G207,ID分段!A:C,3,FALSE))","v":"道具-感悟点"},4,0,0,"",0,1,0,null,null,0,0,0,0]
[22014,2085,"支线感悟点7",10297,"道具描述_支线感悟点7","icon_item_22014",23,{"$f":"CONCATENATE(VLOOKUP(G208,ID分段!A:B,2,FALSE),\"-\",VLOOKUP(G208,ID分段!A:C,3,FALSE))","v":"道具-感悟点"},4,0,0,{"$f":"_xlfn.TEXTJOIN(\";\",1,AG208:AI208)","v":""},0,1,0,null,null,0,0,0,0]
[]
[23001,10098,"倍源净尘符",10102,"永久免去资源翻倍类广告！","icon_adcard1",24,{"$f":"CONCATENATE(VLOOKUP(G210,ID分段!A:B,2,FALSE),\"-\",VLOOKUP(G210,ID分段!A:C,3,FALSE))","v":"道具-广告卡"},4,0,0,"",0,1,0,null,null,0,0,0,0]
[23002,10099,"全域无尘玉牌",10103,"永久免去所有广告！","icon_adcard2",24,{"$f":"CONCATENATE(VLOOKUP(G211,ID分段!A:B,2,FALSE),\"-\",VLOOKUP(G211,ID分段!A:C,3,FALSE))","v":"道具-广告卡"},5,0,0,"",0,1,0,null,null,0,0,0,0]
[23101,10100,"倍源净尘符碎片",10104,"集齐18枚碎片可兑换免双倍广告卡","icon_adcard1",24,{"$f":"CONCATENATE(VLOOKUP(G212,ID分段!A:B,2,FALSE),\"-\",VLOOKUP(G212,ID分段!A:C,3,FALSE))","v":"道具-广告卡"},4,0,0,"",0,1,0,null,null,0,0,0,0,10,"18;23001"]
[23102,10101,"全域无尘玉牌碎片",10105,"集齐30枚碎片可兑换免所有广告卡","icon_adcard2",24,{"$f":"CONCATENATE(VLOOKUP(G213,ID分段!A:B,2,FALSE),\"-\",VLOOKUP(G213,ID分段!A:C,3,FALSE))","v":"道具-广告卡"},5,0,0,"",0,1,0,null,null,0,0,0,0,10,"30;23002"]

{"sheet":"ID分段","index":1,"n_rows":21,"n_cols":6,"rows_kept":21,"cut":false,"hidden":false,"merged":[]}
["Tag","大类","小类","起始ID","结束ID","已使用"]
[1,"资源","货币",1000,1099]
[2,"资源","材料",1100,1199]
[3,"资源","渡劫丹",1200,1299]
[4,"资源","天材地宝",1300,1399]
[5,"资源","经验丹",1400,1499]
[6,"资源","好感度礼物",1500,1599]
[7,"资源","心情礼物",1600,1699]
[8,"资源","神识丹",1700,1799]
[9,"资源","自动转代币",1800,1899]
[]
[11,"法宝","本体",10000,10999]
[12,"法宝","碎片",11000,11999]
[13,"功法","本体",12000,12999]
[14,"功法","碎片",13000,13999]
[]
[21,"道具","任务道具",20000,20999]
[22,"道具","神识道符",21000,21999]
[23,"道具","感悟点",22000,22999]
[24,"道具","广告卡",23000,23099]
[25,"道具","广告卡碎片",23100,23199]

{"sheet":"道具用途说明","index":2,"n_rows":16,"n_cols":2,"rows_kept":16,"cut":false,"hidden":false,"merged":[]}
["associateID","associateVlaue"]
["int","int[]"]
[]
["特殊功能ID\n","特殊功能参数\n"]
[1,"突破丹可用的下限修为等级（包含）；突破丹可用的上限修为等级（不包含）；突破丹增加的概率；突破失败可以降低的修为损耗%"]
[2,"经验丹增加的修为值"]
[3,"功法对应的碎片ID；功法对应的技能组ID;功法分解时获得的碎片数量"]
[4,"法宝对应的碎片ID；法宝对应的法宝表ID;法宝分解时获得的碎片数量"]
[5,"心情礼物对应增加的心情值"]
[6,"神识符：提升某个品质的刷新概率;提升的权重百分比（填110意思是将原有权重值×1.1）"]
[7,"神识符：使用后必定出现哪个PrizeType的事件"]
[8,"神识丹：使用后可恢复的神识点数"]
[9,"自动转代币：要转的代币ID；要转的代币数量"]
[10,"广告卡碎片：需要多少个碎片；合成出什么道具ID"]
[11,"功法碎片：对应的功法本体道具ID"]
[12,"法宝碎片：对应的法宝本体道具ID"]