{"text_format":"2","workbook":"xlsx","n_sheets":3,"sheets":["ItemConfig","ID分段","道具用途说明"],"not_rendered":{"charts":0,"images":0,"macros":0,"external_links":4,"defined_names":1,"comments":0,"pivot_tables":0},"unopened":[],"bounds":{"document_bytes":16777216,"sheet_cells":100000,"run_cost":"one","rows_first":2000,"rows_last":500,"rows_between":2000,"halvings":0,"cell_chars":16384,"cell_head_chars":4096},"cells_cut":0,"cells_raw":0,"read":"whole","date_system":"1900"}

{"sheet":"ItemConfig","index":0,"n_rows":215,"n_cols":40,"rows_kept":215,"cut":false,"hidden":false,"merged":[]}
["ID","itemName",null,"itemDesc",null,"icon","itemTag",null,"quality","stack","isSell","SkiptoID","rewardsNum","isVisible","isUse","useLimit","useLimtValue","costItemNum","rewardsItems","rewardsItemNums","stack","associateID","associateVlaue","sort","itemDesc2"]
["int","int",null,"int",null,"string","int",null,"int","int","bool","int[]","int","int","bool","int",null,"int","int[]","int[]","int","int","int[]","int","int"]
[]
["ID1","道具名称\n","道具名\n(查看)","功能说明","功能说明","道具图标","道具分类\n见ID分段",{"$f":"SUBTOTAL(3,H5:H10009)","v":192},"品质\n1.[物品]白\n2.[物品]绿\n3.[物品]蓝\n4.[物品]紫\n5.[物品]橙\n6.[物品]红","堆叠数量\n0.无限","是否出售","跳转ID","出售金额","进入背包时，是否可见","是否可用","使用限制\n0. 无\n1. 共鸣等级","限制的值","消耗道具数量","获得道具ID","获得道具的数量","堆叠数量\n0.无限","特殊功能ID\n详情见说明页","特殊功能参数\n详情见说明页","背包内排序","包装文本","包装文本","参数1","参数2","参数3","参数4","参数5",null,"跳转1","跳转2","跳转3","跳转1","跳转2","跳转3"]
[1001,169,"灵石",162,"游历仙界最基础的货币。","icon_Coin",1,{"$f":"CONCATENATE(VLOOKUP(G5,ID分段!A:B,2,FALSE),\"-\",VLOOKUP(G5,ID分段!A:C,3,FALSE))","v":"资源-货币"},2,0,0,{"$f":"_xlfn.TEXTJOIN(\";\",1,AG5:AI5)","v":"5;14"},0,1,0,null,null,0,0,0,0,{"$nulls":11},5,14,null,{"$f":"IF(AG5=\"\",\"\",VLOOKUP(AG5,[1]SkiptoConfig!$A:$H,8,FALSE))","v":"使用神识"},{"$f":"IF(AH5=\"\",\"\",VLOOKUP(AH5,[1]SkiptoConfig!$A:$H,8,FALSE))","v":"命运峰"},{"$f":"IF(AI5=\"\",\"\",VLOOKUP(AI5,[1]SkiptoConfig!$A:$H,8,FALSE))","v":""}]
[1002,170,"妖丹",163,"妖物魂魄凝结而成的丹药，一般作为较为稀有的货币。","icon_Coins_s",1,{"$f":"CONCATENATE(VLOOKUP(G6,ID分段!A:B,2,FALSE),\"-\",VLOOKUP(G6,ID分段!A:C,3,FALSE))","v":"资源-货币"},4,0,0,{"$f":"_xlfn.TEXTJOIN(\";\",1,AG6:AI6)","v":"4"},0,1,0,null,null,0,0,0,0,{"$nulls":11},4,null,null,{"$f":"IF(AG6=\"\",\"\",VLOOKUP(AG6,[1]SkiptoConfig!$A:$H,8,FALSE))","v":"兑换商店-妖丹兑换"},{"$f":"IF(AH6=\"\",\"\",VLOOKUP(AH6,[1]SkiptoConfig!$A:$H,8,FALSE))","v":""},{"$f":"IF(AI6=\"\",\"\",VLOOKUP(AI6,[1]SkiptoConfig!$A:$H,8,FALSE))","v":""}]
[1003,171,"修为",164,"英雄提升等级所必需的资源。","icon_Gem_Star_Blue",2,{"$f":"CONCATENATE(VLOOKUP(G7,ID分段!A:B,2,FALSE),\"-\",VLOOKUP(G7,ID分段!A:C,3,FALSE))","v":"资源-材料"},2,0,0,"5;14",0,1,0,null,null,0,0,0,0,13,{"$nulls":10},5,14,null,{"$f":"IF(AG7=\"\",\"\",VLOOKUP(AG7,[1]SkiptoConfig!$A:$H,8,FALSE))","v":"使用神识"},{"$f":"IF(AH7=\"\",\"\",VLOOKUP(AH7,[1]SkiptoConfig!$A:$H,8,FALSE))","v":"命运峰"},{"$f":"IF(AI7=\"\",\"\",VLOOKUP(AI7,[1]SkiptoConfig!$A:$H,8,FALSE))","v":""}]
[1004,248,"仙缘宝券",249,"仙界最为珍贵的货币。","icon_Demo_Gem04",1,{"$f":"CONCATENATE(VLOOKUP(G8,ID分段!A:B,2,FALSE),\"-\",VLOOKUP(G8,ID分段!A:C,3,FALSE))","v":"资源-货币"},5,0,0,"6",0,1,0,null,null,0,0,0,0,{"$nulls":11},6,null,null,{"$f":"IF(AG8=\"\",\"\",VLOOKUP(AG8,[1]SkiptoConfig!$A:$H,8,FALSE))","v":"白嫖代金券"},{"$f":"IF(AH8=\"\",\"\",VLOOKUP(AH8,[1]SkiptoConfig!$A:$H,8,FALSE))","v":""},{"$f":"IF(AI8=\"\",\"\",VLOOKUP(AI8,[1]SkiptoConfig!$A:$H,8,FALSE))","v":""}]
[1005,725,"灵气",726,"功法升级所必需的资源。","icon_GradeBadge_Master",2,{"$f":"CONCATENATE(VLOOKUP(G9,ID分段!A:B,2,FALSE),\"-\",VLOOKUP(G9,ID分段!A:C,3,FALSE))","v":"资源-材料"},3,0,0,"10;5",0,1,0,null,null,0,0,0,0,{"$nulls":11},10,5,null,{"$f":"IF(AG9=\"\",\"\",VLOOKUP(AG9,[1]SkiptoConfig!$A:$H,8,FALSE))","v":"探宝"},{"$f":"IF(AH9=\"\",\"\",VLOOKUP(AH9,[1]SkiptoConfig!$A:$H,8,FALSE))","v":"使用神识"},{"$f":"IF(AI9=\"\",\"\",VLOOKUP(AI9,[1]SkiptoConfig!$A:$H,8,FALSE))","v":""}]
[1006,1400,"玄晶",1401,"法宝升级所必需的资源。","icon_GradeBadge_Challenger",2,{"$f":"CONCATENATE(VLOOKUP(G10,ID分段!A:B,2,FALSE),\"-\",VLOOKUP(G10,ID分段!A:C,3,FALSE))","v":"资源-材料"},3,0,0,"10;5",0,1,0,null,null,0,0,0,0,{"$nulls":11},10,5,null,{"$f":"IF(AG10=\"\",\"\",VLOOKUP(AG10,[1]SkiptoConfig!$A:$H,8,FALSE))","v":"探宝"},{"$f":"IF(AH10=\"\",\"\",VLOOKUP(AH10,[1]SkiptoConfig!$A:$H,8,FALSE))","v":"使用神识"},{"$f":"IF(AI10=\"\",\"\",VLOOKUP(AI10,[1]SkiptoConfig!$A:$H,8,FALSE))","v":""}]
[1007,-1,"广告币",-1,null,"icon_GradeBadge_Challenger",1,{"$f":"CONCATENATE(VLOOKUP(G11,ID分段!A:B,2,FALSE),\"-\",VLOOKUP(G11,ID分段!A:C,3,FALSE))","v":"资源-货币"},4,0,0,"",0,0,0,null,null,0,0,0,0,{"$nulls":14},{"$f":"IF(AG11=\"\",\"\",VLOOKUP(AG11,[1]SkiptoConfig!$A:$H,8,FALSE))","v":""},{"$f":"IF(AH11=\"\",\"\",VLOOKUP(AH11,[1]SkiptoConfig!$A:$H,8,FALSE))","v":""},{"$f":"IF(AI11=\"\",\"\",VLOOKUP(AI11,[1]SkiptoConfig!$A:$H,8,FALSE))","v":""}]
[{"$nulls":11},"",{"$nulls":23},{"$f":"IF(AG12=\"\",\"\",VLOOKUP(AG12,[1]SkiptoConfig!$A:$H,8,FALSE))","v":""},{"$f":"IF(AH12=\"\",\"\",VLOOKUP(AH12,[1]SkiptoConfig!$A:$H,8,FALSE))","v":""},{"$f":"IF(AI12=\"\",\"\",VLOOKUP(AI12,[1]SkiptoConfig!$A:$H,8,FALSE))","v":""}]
[1101,-1,{"$f":"CONCATENATE(\"自转道具-\",VLOOKUP(AA13,A:C,3,FALSE),\"×\",AB13)","v":"自转道具-仙缘宝券×6"},-1,null,"icon_GradeBadge_Challenger",9,{"$f":"CONCATENATE(VLOOKUP(G13,ID分段!A:B,2,FALSE),\"-\",VLOOKUP(G13,ID分段!A:C,3,FALSE))","v":"资源-自动转代币"},3,0,0,"",0,0,0,null,null,0,0,0,0,9,{"$f":"_xlfn.TEXTJOIN(\";\",1,AA13:AE13)","v":"1004;6"},null,null,null,1004,6,{"$nulls":7},{"$f":"IF(AG13=\"\",\"\",VLOOKUP(AG13,[1]SkiptoConfig!$A:$H,8,FALSE))","v":""},{"$f":"IF(AH13=\"\",\"\",VLOOKUP(AH13,[1]SkiptoConfig!$A:$H,8,FALSE))","v":""},{"$f":"IF(AI13=\"\",\"\",VLOOKUP(AI13,[1]SkiptoConfig!$A:$H,8,FALSE))","v":""}]
[1102,-1,"自转道具-仙缘宝券×30",-1,null,"icon_GradeBadge_Challenger",9,{"$f":"CONCATENATE(VLOOKUP(G14,ID分段!A:B,2,FALSE),\"-\",VLOOKUP(G14,ID分段!A:C,3,FALSE))","v":"资源-自动转代币"},3,0,0,"",0,0,0,null,null,0,0,0,0,9,{"$f":"_xlfn.TEXTJOIN(\";\",1,AA14:AE14)","v":"1004;30"},null,null,null,1004,30,{"$nulls":7},{"$f":"IF(AG14=\"\",\"\",VLOOKUP(AG14,[1]SkiptoConfig!$A:$H,8,FALSE))","v":""},{"$f":"IF(AH14=\"\",\"\",VLOOKUP(AH14,[1]SkiptoConfig!$A:$H,8,FALSE))","v":""},{"$f":"IF(AI14=\"\",\"\",VLOOKUP(AI14,[1]SkiptoConfig!$A:$H,8,FALSE))","v":""}]
[1103,-1,"自转道具-仙缘宝券×98",-1,null,"icon_GradeBadge_Challenger",9,{"$f":"CONCATENATE(VLOOKUP(G15,ID分段!A:B,2,FALSE),\"-\",VLOOKUP(G15,ID分段!A:C,3,FALSE))","v":"资源-自动转代币"},4,0,0,"",0,0,0,null,null,0,0,0,0,9,"1004;98",null,null,null,1004,98,{"$nulls":7},{"$f":"IF(AG15=\"\",\"\",VLOOKUP(AG15,[1]SkiptoConfig!$A:$H,8,FALSE))","v":""},{"$f":"IF(AH15=\"\",\"\",VLOOKUP(AH15,[1]SkiptoConfig!$A:$H,8,FALSE))","v":""},{"$f":"IF(AI15=\"\",\"\",VLOOKUP(AI15,[1]SkiptoConfig!$A:$H,8,FALSE))","v":""}]
[1104,-1,"自转道具-仙缘宝券×198",-1,null,"icon_GradeBadge_Challenger",9,{"$f":"CONCATENATE(VLOOKUP(G16,ID分段!A:B,2,FALSE),\"-\",VLOOKUP(G16,ID分段!A:C,3,FALSE))","v":"资源-自动转代币"},4,0,0,"",0,0,0,null,null,0,0,0,0,9,"1004;198",null,null,null,1004,198,{"$nulls":7},{"$f":"IF(AG16=\"\",\"\",VLOOKUP(AG16,[1]SkiptoConfig!$A:$H,8,FALSE))","v":""},{"$f":"IF(AH16=\"\",\"\",VLOOKUP(AH16,[1]SkiptoConfig!$A:$H,8,FALSE))","v":""},{"$f":"IF(AI16=\"\",\"\",VLOOKUP(AI16,[1]SkiptoConfig!$A:$H,8,FALSE))","v":""}]
[1105,-1,"自转道具-仙缘宝券×328",-1,null,"icon_GradeBadge_Challenger",9,{"$f":"CONCATENATE(VLOOKUP(G17,ID分段!A:B,2,FALSE),\"-\",VLOOKUP(G17,ID分段!A:C,3,FALSE))","v":"资源-自动转代币"},5,0,0,"",0,0,0,null,null,0,0,0,0,9,"1004;328",null,null,null,1004,328,{"$nulls":7},{"$f":"IF(AG17=\"\",\"\",VLOOKUP(AG17,[1]SkiptoConfig!$A:$H,8,FALSE))","v":""},{"$f":"IF(AH17=\"\",\"\",VLOOKUP(AH17,[1]SkiptoConfig!$A:$H,8,FALSE))","v":""},{"$f":"IF(AI17=\"\",\"\",VLOOKUP(AI17,[1]SkiptoConfig!$A:$H,8,FALSE))","v":""}]
[1106,-1,"自转道具-仙缘宝券×648",-1,null,"icon_GradeBadge_Challenger",9,{"$f":"CONCATENATE(VLOOKUP(G18,ID分段!A:B,2,FALSE),\"-\",VLOOKUP(G18,ID分段!A:C,3,FALSE))","v":"资源-自动转代币"},5,0,0,"",0,0,0,null,null,0,0,0,0,9,"1004;648",null,null,null,1004,648,{"$nulls":7},{"$f":"IF(AG18=\"\",\"\",VLOOKUP(AG18,[1]SkiptoConfig!$A:$H,8,FALSE))","v":""},{"$f":"IF(AH18=\"\",\"\",VLOOKUP(AH18,[1]SkiptoConfig!$A:$H,8,FALSE))","v":""},{"$f":"IF(AI18=\"\",\"\",VLOOKUP(AI18,[1]SkiptoConfig!$A:$H,8,FALSE))","v":""}]
[{"$nulls":11},"",{"$nulls":23},{"$f":"IF(AG19=\"\",\"\",VLOOKUP(AG19,[1]SkiptoConfig!$A:$H,8,FALSE))","v":""},{"$f":"IF(AH19=\"\",\"\",VLOOKUP(AH19,[1]SkiptoConfig!$A:$H,8,FALSE))","v":""},{"$f":"IF(AI19=\"\",\"\",VLOOKUP(AI19,[1]SkiptoConfig!$A:$H,8,FALSE))","v":""}]
[1201,250,"渡劫丹",259,"最基础的渡劫丹，可提升10%渡劫成功率。","icon_dujiedan",3,{"$f":"CONCATENATE(VLOOKUP(G20,ID分段!A:B,2,FALSE),\"-\",VLOOKUP(G20,ID分段!A:C,3,FALSE))","v":"资源-渡劫丹"},3,0,0,"5;7",0,1,0,null,null,0,0,0,0,1,"1;300;10;10",null,null,null,1,300,10,10,null,null,5,7,null,{"$f":"IF(AG20=\"\",\"\",VLOOKUP(AG20,[1]SkiptoConfig!$A:$H,8,FALSE))","v":"使用神识"},{"$f":"IF(AH20=\"\",\"\",VLOOKUP(AH20,[1]SkiptoConfig!$A:$H,8,FALSE))","v":"兑换商店-每日特惠"},{"$f":"IF(AI20=\"\",\"\",VLOOKUP(AI20,[1]SkiptoConfig!$A:$H,8,FALSE))","v":""}]
[1202,251,"良品渡劫丹",260,"品相较好的渡劫丹，可提升15%渡劫成功率。","icon_dujiedan",3,{"$f":"CONCATENATE(VLOOKUP(G21,ID分段!A:B,2,FALSE),\"-\",VLOOKUP(G21,ID分段!A:C,3,FALSE))","v":"资源-渡劫丹"},4,0,0,"5;7",0,1,0,null,null,0,0,0,0,1,"1;300;15;25",null,null,null,1,300,15,25,null,null,5,7,null,{"$f":"IF(AG21=\"\",\"\",VLOOKUP(AG21,[1]SkiptoConfig!$A:$H,8,FALSE))","v":"使用神识"},{"$f":"IF(AH21=\"\",\"\",VLOOKUP(AH21,[1]SkiptoConfig!$A:$H,8,FALSE))","v":"兑换商店-每日特惠"},{"$f":"IF(AI21=\"\",\"\",VLOOKUP(AI21,[1]SkiptoConfig!$A:$H,8,FALSE))","v":""}]
[1203,252,"上品渡劫丹",261,"品相极好的渡劫丹，可提升25%渡劫成功率。","icon_dujiedan",3,{"$f":"CONCATENATE(VLOOKUP(G22,ID分段!A:B,2,FALSE),\"-\",VLOOKUP(G22,ID分段!A:C,3,FALSE))","v":"资源-渡劫丹"},5,0,0,"5",0,1,0,null,null,0,0,0,0,1,"1;300;25;50",null,null,null,1,300,25,50,null,null,5,null,null,{"$f":"IF(AG22=\"\",\"\",VLOOKUP(AG22,[1]SkiptoConfig!$A:$H,8,FALSE))","v":"使用神识"},{"$f":"IF(AH22=\"\",\"\",VLOOKUP(AH22,[1]SkiptoConfig!$A:$H,8,FALSE))","v":""},{"$f":"IF(AI22=\"\",\"\",VLOOKUP(AI22,[1]SkiptoConfig!$A:$H,8,FALSE))","v":""}]
[1204,253,"极品渡劫丹",262,"百年难得一见的渡劫丹，可提升40%渡劫成功率。","icon_dujiedan",3,{"$f":"CONCATENATE(VLOOKUP(G23,ID分段!A:B,2,FALSE),\"-\",VLOOKUP(G23,ID分段!A:C,3,FALSE))","v":"资源-渡劫丹"},6,0,0,"5",0,1,0,null,null,0,0,0,0,1,"1;300;40;80",null,null,null,1,300,40,80,null,null,5,null,null,{"$f":"IF(AG23=\"\",\"\",VLOOKUP(AG23,[1]SkiptoConfig!$A:$H,8,FALSE))","v":"使用神识"},{"$f":"IF(AH23=\"\",\"\",VLOOKUP(AH23,[1]SkiptoConfig!$A:$H,8,FALSE))","v":""},{"$f":"IF(AI23=\"\",\"\",VLOOKUP(AI23,[1]SkiptoConfig!$A:$H,8,FALSE))","v":""}]
[{"$nulls":11},"",{"$nulls":23},{"$f":"IF(AG24=\"\",\"\",VLOOKUP(AG24,[1]SkiptoConfig!$A:$H,8,FALSE))","v":""},{"$f":"IF(AH24=\"\",\"\",VLOOKUP(AH24,[1]SkiptoConfig!$A:$H,8,FALSE))","v":""},{"$f":"IF(AI24=\"\",\"\",VLOOKUP(AI24,[1]SkiptoConfig!$A:$H,8,FALSE))","v":""}]
[1301,268,"筑基丹",272,"突破练气期达到筑基期境界所必需的天材地宝。",{"$f":"\"icon_item_\"&A25","v":"icon_item_1301"},4,{"$f":"CONCATENATE(VLOOKUP(G25,ID分段!A:B,2,FALSE),\"-\",VLOOKUP(G25,ID分段!A:C,3,FALSE))","v":"资源-天材地宝"},4,0,0,"8",0,1,0,null,null,0,0,0,0,1,"1;300;45;0",null,null,null,1,300,45,0,null,null,8,null,null,{"$f":"IF(AG25=\"\",\"\",VLOOKUP(AG25,[1]SkiptoConfig!$A:$H,8,FALSE))","v":"主线剧情"},{"$f":"IF(AH25=\"\",\"\",VLOOKUP(AH25,[1]SkiptoConfig!$A:$H,8,FALSE))","v":""},{"$f":"IF(AI25=\"\",\"\",VLOOKUP(AI25,[1]SkiptoConfig!$A:$H,8,FALSE))","v":""},"练气期","筑基期"]
[1302,269,"金阳果",273,"突破筑基期达到结丹期境界所必需的天材地宝。",{"$f":"\"icon_item_\"&A26","v":"icon_item_1302"},4,{"$f":"CONCATENATE(VLOOKUP(G26,ID分段!A:B,2,FALSE),\"-\",VLOOKUP(G26,ID分段!A:C,3,FALSE))","v":"资源-天材地宝"},4,0,0,"8",0,1,0,null,null,0,0,0,0,1,"1;300;40;0",null,null,null,1,300,40,0,null,null,8,null,null,{"$f":"IF(AG26=\"\",\"\",VLOOKUP(AG26,[1]SkiptoConfig!$A:$H,8,FALSE))","v":"主线剧情"},{"$f":"IF(AH26=\"\",\"\",VLOOKUP(AH26,[1]SkiptoConfig!$A:$H,8,FALSE))","v":""},{"$f":"IF(AI26=\"\",\"\",VLOOKUP(AI26,[1]SkiptoConfig!$A:$H,8,FALSE))","v":""},"筑基期","结丹期"]
[1303,270,"九窍芝",274,"突破结丹期达到元婴期境界所必需的天材地宝。",{"$f":"\"icon_item_\"&A27","v":"icon_item_1303"},4,{"$f":"CONCATENATE(VLOOKUP(G27,ID分段!A:B,2,FALSE),\"-\",VLOOKUP(G27,ID分段!A:C,3,FALSE))","v":"资源-天材地宝"},4,0,0,"8",0,1,0,null,null,0,0,0,0,1,"1;300;35;0",null,null,null,1,300,35,0,null,null,8,null,null,{"$f":"IF(AG27=\"\",\"\",VLOOKUP(AG27,[1]SkiptoConfig!$A:$H,8,FALSE))","v":"主线剧情"},{"$f":"IF(AH27=\"\",\"\",VLOOKUP(AH27,[1]SkiptoConfig!$A:$H,8,FALSE))","v":""},{"$f":"IF(AI27=\"\",\"\",VLOOKUP(AI27,[1]SkiptoConfig!$A:$H,8,FALSE))","v":""},"结丹期","元婴期"]
[1304,271,"玄冥髓",275,"突破元婴期达到化神期境界所必需的天材地宝。",{"$f":"\"icon_item_\"&A28","v":"icon_item_1304"},4,{"$f":"CONCATENATE(VLOOKUP(G28,ID分段!A:B,2,FALSE),\"-\",VLOOKUP(G28,ID分段!A:C,3,FALSE))","v":"资源-天材地宝"},5,0,0,"8",0,1,0,null,null,0,0,0,0,1,"1;300;30;0",null,null,null,1,300,30,0,null,null,8,null,null,{"$f":"IF(AG28=\"\",\"\",VLOOKUP(AG28,[1]SkiptoConfig!$A:$H,8,FALSE))","v":"主线剧情"},{"$f":"IF(AH28=\"\",\"\",VLOOKUP(AH28,[1]SkiptoConfig!$A:$H,8,FALSE))","v":""},{"$f":"IF(AI28=\"\",\"\",VLOOKUP(AI28,[1]SkiptoConfig!$A:$H,8,FALSE))","v":""},"元婴期","化神期"]
[1305,10112,"九焰莲",10117,"突破化神期达到炼虚期境界所必需的天材地宝。","icon_item_1305",4,{"$f":"CONCATENATE(VLOOKUP(G29,ID分段!A:B,2,FALSE),\"-\",VLOOKUP(G29,ID分段!A:C,3,FALSE))","v":"资源-天材地宝"},5,0,0,{"$f":"_xlfn.TEXTJOIN(\";\",1,AG29:AI29)","v":"8"},0,1,0,null,null,0,0,0,0,1,"1;300;25;0",null,null,null,1,300,25,0,null,null,8,null,null,{"$f":"IF(AG29=\"\",\"\",VLOOKUP(AG29,[1]SkiptoConfig!$A:$H,8,FALSE))","v":"主线剧情"},{"$f":"IF(AH29=\"\",\"\",VLOOKUP(AH29,[1]SkiptoConfig!$A:$H,8,FALSE))","v":""},{"$f":"IF(AI29=\"\",\"\",VLOOKUP(AI29,[1]SkiptoConfig!$A:$H,8,FALSE))","v":""},"化神期","炼虚期"]
[1306,10113,"混沌合晶",10118,"突破炼虚期达到大乘期境界所必需的天材地宝。","icon_item_1306",4,{"$f":"CONCATENATE(VLOOKUP(G30,ID分段!A:B,2,FALSE),\"-\",VLOOKUP(G30,ID分段!A:C,3,FALSE))","v":"资源-天材地宝"},5,0,0,"8",0,1,0,null,null,0,0,0,0,1,"1;300;20;0",null,null,null,1,300,20,0,null,null,8,null,null,{"$f":"IF(AG30=\"\",\"\",VLOOKUP(AG30,[1]SkiptoConfig!$A:$H,8,FALSE))","v":"主线剧情"},{"$f":"IF(AH30=\"\",\"\",VLOOKUP(AH30,[1]SkiptoConfig!$A:$H,8,FALSE))","v":""},{"$f":"IF(AI30=\"\",\"\",VLOOKUP(AI30,[1]SkiptoConfig!$A:$H,8,FALSE))","v":""},"炼虚期","大乘期"]
[1307,10114,"鸿蒙紫华",10119,"突破大乘期达到飞升期境界所必需的天材地宝。","icon_item_1307",4,{"$f":"CONCATENATE(VLOOKUP(G31,ID分段!A:B,2,FALSE),\"-\",VLOOKUP(G31,ID分段!A:C,3,FALSE))","v":"资源-天材地宝"},6,0,0,"8",0,1,0,null,null,0,0,0,0,1,"1;300;15;0",null,null,null,1,300,15,0,null,null,8,null,null,{"$f":"IF(AG31=\"\",\"\",VLOOKUP(AG31,[1]SkiptoConfig!$A:$H,8,FALSE))","v":"主线剧情"},{"$f":"IF(AH31=\"\",\"\",VLOOKUP(AH31,[1]SkiptoConfig!$A:$H,8,FALSE))","v":""},{"$f":"IF(AI31=\"\",\"\",VLOOKUP(AI31,[1]SkiptoConfig!$A:$H,8,FALSE))","v":""},"大乘期","飞升期"]
[1308,10115,"开天古藤",10120,"突破飞升期达到逍遥期境界所必需的天材地宝。",{"$f":"\"icon_item_\"&A32","v":"icon_item_1308"},4,{"$f":"CONCATENATE(VLOOKUP(G32,ID分段!A:B,2,FALSE),\"-\",VLOOKUP(G32,ID分段!A:C,3,FALSE))","v":"资源-天材地宝"},6,0,0,"8",0,1,0,null,null,0,0,0,0,1,"1;300;10;0",null,null,null,1,300,10,0,null,null,8,null,null,{"$f":"IF(AG32=\"\",\"\",VLOOKUP(AG32,[1]SkiptoConfig!$A:$H,8,FALSE))","v":"主线剧情"},{"$f":"IF(AH32=\"\",\"\",VLOOKUP(AH32,[1]SkiptoConfig!$A:$H,8,FALSE))","v":""},{"$f":"IF(AI32=\"\",\"\",VLOOKUP(AI32,[1]SkiptoConfig!$A:$H,8,FALSE))","v":""},"飞升期","逍遥期"]
[1309,10116,"九天露华",10121,"突破逍遥期达到真神期境界所必需的天材地宝。",{"$f":"\"icon_item_\"&A33","v":"icon_item_1309"},4,{"$f":"CONCATENATE(VLOOKUP(G33,ID分段!A:B,2,FALSE),\"-\",VLOOKUP(G33,ID分段!A:C,3,FALSE))","v":"资源-天材地宝"},6,0,0,{"$f":"_xlfn.TEXTJOIN(\";\",1,AG33:AI33)","v":"8"},0,1,0,null,null,0,0,0,0,1,"1;300;5;0",null,null,null,1,300,5,0,null,null,8,null,null,{"$f":"IF(AG33=\"\",\"\",VLOOKUP(AG33,[1]SkiptoConfig!$A:$H,8,FALSE))","v":"主线剧情"},{"$f":"IF(AH33=\"\",\"\",VLOOKUP(AH33,[1]SkiptoConfig!$A:$H,8,FALSE))","v":""},{"$f":"IF(AI33=\"\",\"\",VLOOKUP(AI33,[1]SkiptoConfig!$A:$H,8,FALSE))","v":""},"逍遥期","真神期"]
[{"$nulls":11},""]
[1401,276,"增元丹",280,20,"icon_xiuweidan",5,{"$f":"CONCATENATE(VLOOKUP(G35,ID分段!A:B,2,FALSE),\"-\",VLOOKUP(G35,ID分段!A:C,3,FALSE))","v":"资源-经验丹"},2,0,0,"5;14",0,1,0,null,null,0,0,0,0,2,{"$f":"ROUND(Z35*0.001,0)*1000","v":4000},null,null,{"$f":"VLOOKUP(E35,[2]HeroPowerUpConfig!$A:$M,13,FALSE)*0.5","v":3570},{"$nulls":6},5,14,null,{"$f":"IF(AG35=\"\",\"\",VLOOKUP(AG35,[1]SkiptoConfig!$A:$H,8,FALSE))","v":"使用神识"},{"$f":"IF(AH35=\"\",\"\",VLOOKUP(AH35,[1]SkiptoConfig!$A:$H,8,FALSE))","v":"命运峰"},{"$f":"IF(AI35=\"\",\"\",VLOOKUP(AI35,[1]SkiptoConfig!$A:$H,8,FALSE))","v":""}]
[1402,277,"良品增元丹",281,50,"icon_xiuweidan",5,{"$f":"CONCATENATE(VLOOKUP(G36,ID分段!A:B,2,FALSE),\"-\",VLOOKUP(G36,ID分段!A:C,3,FALSE))","v":"资源-经验丹"},3,0,0,"5;14",0,1,0,null,null,0,0,0,0,2,{"$f":"ROUND(Z36*0.001,0)*1000","v":7000},null,null,{"$f":"VLOOKUP(E36,[2]HeroPowerUpConfig!$A:$M,13,FALSE)*0.5","v":7255},{"$nulls":6},5,14,null,{"$f":"IF(AG36=\"\",\"\",VLOOKUP(AG36,[1]SkiptoConfig!$A:$H,8,FALSE))","v":"使用神识"},{"$f":"IF(AH36=\"\",\"\",VLOOKUP(AH36,[1]SkiptoConfig!$A:$H,8,FALSE))","v":"命运峰"},{"$f":"IF(AI36=\"\",\"\",VLOOKUP(AI36,[1]SkiptoConfig!$A:$H,8,FALSE))","v":""}]
[1403,278,"上品增元丹",282,70,"icon_xiuweidan",5,{"$f":"CONCATENATE(VLOOKUP(G37,ID分段!A:B,2,FALSE),\"-\",VLOOKUP(G37,ID分段!A:C,3,FALSE))","v":"资源-经验丹"},4,0,0,"5;14",0,1,0,null,null,0,0,0,0,2,11000,null,null,{"$f":"VLOOKUP(E37,[2]HeroPowerUpConfig!$A:$M,13,FALSE)*0.5","v":10900},{"$nulls":6},5,14,null,{"$f":"IF(AG37=\"\",\"\",VLOOKUP(AG37,[1]SkiptoConfig!$A:$H,8,FALSE))","v":"使用神识"},{"$f":"IF(AH37=\"\",\"\",VLOOKUP(AH37,[1]SkiptoConfig!$A:$H,8,FALSE))","v":"命运峰"},{"$f":"IF(AI37=\"\",\"\",VLOOKUP(AI37,[1]SkiptoConfig!$A:$H,8,FALSE))","v":""}]
[1404,279,"极品增元丹",283,100,"icon_xiuweidan",5,{"$f":"CONCATENATE(VLOOKUP(G38,ID分段!A:B,2,FALSE),\"-\",VLOOKUP(G38,ID分段!A:C,3,FALSE))","v":"资源-经验丹"},5,0,0,"5;14",0,1,0,null,null,0,0,0,0,2,19000,null,null,{"$f":"VLOOKUP(E38,[2]HeroPowerUpConfig!$A:$M,13,FALSE)*0.5","v":18765},{"$nulls":6},5,14,null,{"$f":"IF(AG38=\"\",\"\",VLOOKUP(AG38,[1]SkiptoConfig!$A:$H,8,FALSE))","v":"使用神识"},{"$f":"IF(AH38=\"\",\"\",VLOOKUP(AH38,[1]SkiptoConfig!$A:$H,8,FALSE))","v":"命运峰"},{"$f":"IF(AI38=\"\",\"\",VLOOKUP(AI38,[1]SkiptoConfig!$A:$H,8,FALSE))","v":""}]
[{"$nulls":11},"",{"$nulls":23},{"$f":"IF(AG39=\"\",\"\",VLOOKUP(AG39,[1]SkiptoConfig!$A:$H,8,FALSE))","v":""},{"$f":"IF(AH39=\"\",\"\",VLOOKUP(AH39,[1]SkiptoConfig!$A:$H,8,FALSE))","v":""},{"$f":"IF(AI39=\"\",\"\",VLOOKUP(AI39,[1]SkiptoConfig!$A:$H,8,FALSE))","v":""}]
[1501,1947,"清茶",1949,{"$f":"CONCATENATE(\"道具描述_\",C40)","v":"道具描述_清茶"},"icon_haogandugift",6,{"$f":"CONCATENATE(VLOOKUP(G40,ID分段!A:B,2,FALSE),\"-\",VLOOKUP(G40,ID分段!A:C,3,FALSE))","v":"资源-好感度礼物"},3,0,0,"5",0,1,0,null,null,0,0,0,0,0,0,{"$nulls":9},5,null,null,{"$f":"IF(AG40=\"\",\"\",VLOOKUP(AG40,[1]SkiptoConfig!$A:$H,8,FALSE))","v":"使用神识"},{"$f":"IF(AH40=\"\",\"\",VLOOKUP(AH40,[1]SkiptoConfig!$A:$H,8,FALSE))","v":""},{"$f":"IF(AI40=\"\",\"\",VLOOKUP(AI40,[1]SkiptoConfig!$A:$H,8,FALSE))","v":""}]
{"$rows_left_out":176}
{"sheet":"ID分段","index":1,"n_rows":22,"n_cols":6,"rows_kept":22,"cut":false,"hidden":false,"merged":[]}
["Tag","大类","小类","起始ID","结束ID","已使用"]
[1,"资源","货币",1000,1099]
[2,"资源","材料",1100,1199]
[3,"资源","渡劫丹",1200,1299]
[4,"资源","天材地宝",1300,1399]
[5,"资源","经验丹",1400,1499]
[6,"资源","好感度礼物",1500,1599]
[7,"资源","心情礼物",1600,1699]
[8,"资源","神识丹",1700,1799]
[9,"资源","自动转代币",1800,1899]
[]
[11,"法宝","本体",10000,10999]
[12,"法宝","碎片",11000,11999]
[13,"功法","本体",12000,12999]
[14,"功法","碎片",13000,13999]
[]
[21,"道具","任务道具",20000,20999]
[22,"道具","神识道符",21000,21999]
[23,"道具","感悟点",22000,22999]
[24,"道具","广告卡",23000,23099]
[25,"道具","广告卡碎片",23100,23199]
[26,"道具","隐藏链接道具",23200,23299]

{"sheet":"道具用途说明","index":2,"n_rows":17,"n_cols":2,"rows_kept":17,"cut":false,"hidden":false,"merged":[]}
["associateID","associateVlaue"]
["int","int[]"]
[]
["特殊功能ID\n","特殊功能参数\n"]
[1,"突破丹可用的下限修为等级（包含）；突破丹可用的上限修为等级（不包含）；突破丹增加的概率；突破失败可以降低的修为损耗%"]
[2,"经验丹增加的修为值"]
[3,"功法对应的碎片ID；功法对应的技能组ID;功法分解时获得的碎片数量"]
[4,"法宝对应的碎片ID；法宝对应的法宝表ID;法宝分解时获得的碎片数量"]
[5,"心情礼物对应增加的心情值"]
[6,"神识符：提升某个品质的刷新概率;提升的权重百分比（填110意思是将原有权重值×1.1）"]
[7,"神识符：使用后必定出现哪个PrizeType的事件"]
[8,"神识丹：使用后可恢复的神识点数"]
[9,"自动转代币：要转的代币ID；要转的代币数量"]
[10,"广告卡碎片：需要多少个碎片；合成出什么道具ID"]
[11,"功法碎片：对应的功法本体道具ID"]
[12,"法宝碎片：对应的法宝本体道具ID"]
[13,"修为会自动转成玩家经验值"]